{"text_format":"1","workbook":"xlsx","n_sheets":13,"sheets":["Pachuag","Zoar","Quaddic","Candlewood","CT River","Hamilton","Lilly","Highland","Teams","YTD","Report","Sheet1","Sheet2"],"not_rendered":{"charts":0,"images":0,"macros":1,"external_links":0,"defined_names":16,"comments":0,"pivot_tables":0},"unopened":[],"bounds":{"document_bytes":16777216,"sheet_cells":100000,"rows_first":2000,"rows_last":500,"rows_between":2000,"halvings":0,"cell_chars":16384,"cell_head_chars":4096},"cells_cut":0,"cells_raw":0,"read":"whole","date_system":"1900"}

{"sheet":"Pachuag","index":0,"n_rows":34,"n_cols":17,"rows_kept":34,"cut":false,"hidden":false,"merged":[[1,0,2,0],[0,0,0,16],[30,6,30,7],[30,3,30,5],[30,13,30,14],[30,10,30,12],[31,13,31,14],[32,13,32,14],[33,13,33,14],[33,6,33,7],[31,6,31,7],[32,6,32,7]]}
[{"$f":"YTD!L15","v":"Pachaug"}]
[null,"Team","Fish","Member","Show","Non","Number","Number","Number","Lunker","Species","Gross","Total","Net","Points","Non Boater","# Non-"]
[null,"Number","Alone?","Name","Up?","Boater?","of LMB","of SMB","Dead","Weight","LMB/SMB","Weight","Caught","Weight","Awarded","Weight","Boaters"]
[1,2,"N",{"$f":"YTD!P15","v":"Armand F."},"Y","N",3,null,null,null,null,4.28,{"$f":"G4+H4","v":3},{"$f":"L4-(I4*0.2)","v":4.28},{"$f":"IF($E4=\"N\",35,IF($M4=0,30,RANK($N4,$N$4:$N$29,0)))","v":4},{"$f":"IF(F4=\"Y\",N4,0)","v":0},{"$f":"IF(E4=\"N\",0,(IF(F4=\"N\",0,1)))","v":0}]
[2,8,"N",{"$f":"YTD!P16","v":"Bill"},"N","Y",null,null,null,null,null,null,0,0,{"$f":"IF($E5=\"N\",35,IF($M5=0,30,RANK($N5,$N$4:$N$29,0)))","v":35},0,{"$f":"IF(E5=\"N\",0,(IF(F5=\"N\",0,1)))","v":0}]
[3,9,"N",{"$f":"YTD!P17","v":"Dean"},"Y","N",null,null,null,null,null,null,{"$f":"G6+H6","v":0},{"$f":"L6-(I6*0.2)","v":0},30,{"$f":"IF(F6=\"Y\",N6,0)","v":0},0]
[4,9,"N",{"$f":"YTD!P18","v":"Jack"},"Y","Y",1,null,null,null,null,1.47,1,1.47,8,1.47,1]
[5,8,"y",{"$f":"YTD!P19","v":"Jason"},"Y","N",1,null,null,null,null,1.08,{"$f":"G8+H8","v":1},{"$f":"L8-(I8*0.2)","v":1.08},11,{"$f":"IF(F8=\"Y\",N8,0)","v":0},0]
[6,7,"N",{"$f":"YTD!P20","v":"Jeff"},"Y","N",null,null,null,null,null,null,0,0,30,0,0]
[7,null,"N",{"$f":"YTD!P21","v":"Jim B"},"N","Y",null,null,null,null,null,null,0,0,35,0,0]
[8,7,"N",{"$f":"YTD!P22","v":"Jim H"},"Y","Y",1,null,null,null,null,1.08,{"$f":"G11+H11","v":1},{"$f":"L11-(I11*0.2)","v":1.08},11,{"$f":"IF(F11=\"Y\",N11,0)","v":1.08},1]
[9,6,"N",{"$f":"YTD!P23","v":"Joe"},"Y","Y",null,null,null,null,null,null,0,0,30,0,1]
[10,4,"N",{"$f":"YTD!P24","v":"Kevin"},"Y","N",5,null,null,null,null,6.76,5,6.76,2,0,0]
[11,null,"N",{"$f":"YTD!P25","v":"Mike"},"N","Y",null,null,null,null,null,null,0,0,35,0,0]
[12,3,"N",{"$f":"YTD!P26","v":"Morrie"},"Y","N",null,1,null,null,null,0.64,1,0.64,13,0,0]
[13,4,"N",{"$f":"YTD!P27","v":"Pete"},"Y","Y",5,null,null,null,null,7.74,5,7.74,1,7.74,1]
[14,1,"N",{"$f":"YTD!P28","v":"Rich B"},"Y","Y",1,null,null,null,null,1.17,1,1.17,10,1.17,1]
[15,3,"N",{"$f":"YTD!P29","v":"Rich T"},"Y","Y",2,null,null,null,null,1.71,{"$f":"G18+H18","v":2},{"$f":"L18-(I18*0.2)","v":1.71},7,1.71,1]
[16,6,"N",{"$f":"YTD!P30","v":"Ron"},"Y","N",null,1,null,null,null,1.38,1,1.38,9,0,0]
[17,5,"N",{"$f":"YTD!P31","v":"Scott"},"Y","Y",1,1,null,null,null,4.8600000000000003,{"$f":"G20+H20","v":2},{"$f":"L20-(I20*0.2)","v":4.8600000000000003},3,{"$f":"IF(F20=\"Y\",N20,0)","v":4.8600000000000003},1]
[18,5,"N",{"$f":"YTD!P32","v":"Steve D"},"Y","N",2,1,null,null,null,3.38,3,3.38,6,0,0]
[19,2,"N",{"$f":"YTD!P33","v":"Steve S"},"Y","Y",1,null,null,3.59,"LMB ",3.59,1,3.59,5,3.59,1]
[20,1,"N",{"$f":"YTD!P34","v":"Tom"},"Y","N",null,null,null,null,null,null,{"$f":"G23+H23","v":0},{"$f":"L23-(I23*0.2)","v":0},30,0,0]
[21,null,"N",{"$f":"YTD!P35","v":"Vinny"},"N","Y",null,null,null,null,null,null,0,0,35,0,0]
[22,null,"N",{"$f":"YTD!P36","v":"X"},"N","N",null,null,null,null,null,null,0,0,35,0,0]
[23,null,"N",{"$f":"YTD!P37","v":"X"},"N","N",null,null,null,null,null,null,0,0,35,0,0]
[24,null,"N",{"$f":"YTD!P38","v":"X"},"N","N",null,null,null,null,null,null,0,0,35,0,0]
[25,null,"N",{"$f":"YTD!P39","v":"X"},"N","N",null,null,null,null,null,null,{"$f":"G28+H28","v":0},{"$f":"L28-(I28*0.2)","v":0},35,{"$f":"IF(F28=\"Y\",N28,0)","v":0},{"$f":"IF(E28=\"N\",0,(IF(F28=\"N\",0,1)))","v":0}]
[26,null,"N",{"$f":"YTD!P40","v":"X"},"N","N",null,null,null,null,null,null,{"$f":"G29+H29","v":0},{"$f":"L29-(I29*0.2)","v":0},35,{"$f":"IF(F29=\"Y\",N29,0)","v":0},{"$f":"IF(E29=\"N\",0,(IF(F29=\"N\",0,1)))","v":0}]
[null,null,null,"Totals",{"$f":"COUNTIF(E4:E29,\"Y\")","v":17},null,{"$f":"SUM(G4:G29)","v":23},{"$f":"SUM(H4:H29)","v":4},{"$f":"SUM(I4:I29)","v":0},{"$f":"MAX(J4:J29)","v":3.59},null,{"$f":"SUM(L4:L29)","v":39.14},{"$f":"SUM(M4:M29)","v":27},{"$f":"SUM(N4:N29)","v":39.14},null,{"$f":"SUM(P4:P29)","v":21.619999999999997},{"$f":"SUM(Q4:Q29)","v":8}]
[null,"Place","Team #","Partners",null,null,"Total Weight",null,"Place","Team #","Partners",null,null,"Total Weight",null,"NB Avg",{"$f":"IF(Q30=0,\"No Data\",P30/Q30)","v":2.7024999999999997}]
[null,"1st",{"$f":"Teams!N4","v":4},{"$f":"VLOOKUP($C32,$B$4:$D$29,3,0)","v":"Kevin"},"&",{"$f":"IF($B$4:$B$29=20,\"#N/A\",IF(COUNTIF($B$4:$B$29,$C32)=1,\"Alone\",LOOKUP(2,1/($B$4:$B$29=$C32),$D$4:$D$29)))","v":"Pete"},{"$f":"Teams!O4","v":14.5},null,"4th",{"$f":"Teams!N7","v":8},{"$f":"VLOOKUP($J32,$B$4:$D$29,3,0)","v":"Bill"},"&",{"$f":"IF($B$4:$B$29=20,\"#N/A\",IF(COUNTIF($B$4:$B$29,$J32)=1,\"Alone\",LOOKUP(2,1/($B$4:$B$29=$J32),$D$4:$D$29)))","v":"Jason"},{"$f":"Teams!O7","v":3.7824999999999998}]
[null,"2nd",{"$f":"Teams!N5","v":5},{"$f":"VLOOKUP($C33,$B$4:$D$29,3,0)","v":"Scott"},"&",{"$f":"IF($B$4:$B$29=20,\"#N/A\",IF(COUNTIF($B$4:$B$29,$C33)=1,\"Alone\",LOOKUP(2,1/($B$4:$B$29=$C33),$D$4:$D$29)))","v":"Steve D"},{"$f":"Teams!O5","v":8.24},null,"5th",{"$f":"Teams!N8","v":3},{"$f":"VLOOKUP($J33,$B$4:$D$29,3,0)","v":"Morrie"},"&",{"$f":"IF($B$4:$B$29=20,\"#N/A\",IF(COUNTIF($B$4:$B$29,$J33)=1,\"Alone\",LOOKUP(2,1/($B$4:$B$29=$J33),$D$4:$D$29)))","v":"Rich T"},{"$f":"Teams!O8","v":2.35}]
[null,"3rd",{"$f":"Teams!N6","v":2},{"$f":"VLOOKUP($C34,$B$4:$D$29,3,0)","v":"Armand F."},"&",{"$f":"IF($B$4:$B$29=20,\"#N/A\",IF(COUNTIF($B$4:$B$29,$C34)=1,\"Alone\",LOOKUP(2,1/($B$4:$B$29=$C34),$D$4:$D$29)))","v":"Steve S"},{"$f":"Teams!O6","v":7.87},null,"6th",{"$f":"Teams!N9","v":9},{"$f":"VLOOKUP($J34,$B$4:$D$29,3,0)","v":"Dean"},"&",{"$f":"IF($B$4:$B$29=20,\"#N/A\",IF(COUNTIF($B$4:$B$29,$J34)=1,\"Alone\",LOOKUP(2,1/($B$4:$B$29=$J34),$D$4:$D$29)))","v":"Jack"},{"$f":"Teams!O9","v":1.47}]

{"sheet":"Zoar","index":1,"n_rows":34,"n_cols":17,"rows_kept":34,"cut":false,"hidden":false,"merged":[[30,13,30,14],[31,13,31,14],[30,3,30,5],[30,10,30,12],[33,6,33,7],[33,13,33,14],[1,0,2,0],[0,0,0,16],[32,6,32,7],[32,13,32,14],[30,6,30,7],[31,6,31,7]]}
[{"$f":"YTD!L16","v":"Zoar"}]
[null,"Team","Fish","Member","Show","Non","Number","Number","Number","Lunker","Species","Gross","Total","Net","Points","Non Boater","# Non-"]
[null,"Number","Alone?","Name","Up?","Boater?","of LMB","of SMB","Dead","Weight","LMB/SMB","Weight","Caught","Weight","Awarded","Weight","Boaters"]
[1,3,"N",{"$f":"YTD!P15","v":"Armand F."},"Y","N",2,1,null,null,null,3.35,{"$f":"G4+H4","v":3},{"$f":"L4-(I4*0.2)","v":3.35},{"$f":"IF($E4=\"N\",35,IF($M4=0,30,RANK($N4,$N$4:$N$29,0)))","v":12},{"$f":"IF(F4=\"Y\",N4,0)","v":0},{"$f":"IF(E4=\"N\",0,(IF(F4=\"N\",0,1)))","v":0}]
[2,null,"N",{"$f":"YTD!P16","v":"Bill"},"N","N",null,null,null,null,null,null,0,0,{"$f":"IF($E5=\"N\",35,IF($M5=0,30,RANK($N5,$N$4:$N$29,0)))","v":35},0,{"$f":"IF(E5=\"N\",0,(IF(F5=\"N\",0,1)))","v":0}]
[3,6,"N",{"$f":"YTD!P17","v":"Dean"},"Y","Y",3,null,null,null,null,3.55,{"$f":"G6+H6","v":3},{"$f":"L6-(I6*0.2)","v":3.55},11,{"$f":"IF(F6=\"Y\",N6,0)","v":3.55},1]
[4,10,"N",{"$f":"YTD!P18","v":"Jack"},"Y","Y",null,null,null,null,null,null,0,0,30,0,1]
[5,7,"N",{"$f":"YTD!P19","v":"Jason"},"Y","N",1,1,null,null,null,4.0599999999999996,{"$f":"G8+H8","v":2},{"$f":"L8-(I8*0.2)","v":4.0599999999999996},8,{"$f":"IF(F8=\"Y\",N8,0)","v":0},0]
[6,9,"N",{"$f":"YTD!P20","v":"Jeff"},"Y","N",null,3,null,null,null,5.36,3,5.36,4,0,0]
[7,4,"N",{"$f":"YTD!P21","v":"Jim B"},"Y","Y",2,3,null,null,null,5.55,5,5.55,2,5.55,1]
[8,3,"N",{"$f":"YTD!P22","v":"Jim H"},"Y","Y",4,null,null,null,null,4.82,{"$f":"G11+H11","v":4},{"$f":"L11-(I11*0.2)","v":4.82},7,{"$f":"IF(F11=\"Y\",N11,0)","v":4.82},1]
[9,9,"N",{"$f":"YTD!P23","v":"Joe"},"Y","Y",null,null,null,null,null,null,0,0,30,0,1]
[10,2,"Y",{"$f":"YTD!P24","v":"Kevin"},"Y","N",2,2,null,null,null,5.54,4,5.54,3,0,0]
[11,5,"N",{"$f":"YTD!P25","v":"Mike"},"Y","Y",1,2,null,null,null,4.9400000000000004,3,4.9400000000000004,5,4.9400000000000004,1]
[12,5,"N",{"$f":"YTD!P26","v":"Morrie"},"Y","N",null,null,null,null,null,null,0,0,30,0,0]
[13,7,"N",{"$f":"YTD!P27","v":"Pete"},"Y","Y",3,null,null,null,null,3.63,3,3.63,10,3.63,1]
[14,8,"N",{"$f":"YTD!P28","v":"Rich B"},"Y","N",2,null,null,null,null,3.32,2,3.32,13,0,0]
[15,8,"N",{"$f":"YTD!P29","v":"Rich T"},"Y","Y",null,null,null,null,null,null,{"$f":"G18+H18","v":0},{"$f":"L18-(I18*0.2)","v":0},30,0,1]
[16,10,"N",{"$f":"YTD!P30","v":"Ron"},"Y","N",1,null,null,null,null,0.79,1,0.79,15,0,0]
[17,1,"N",{"$f":"YTD!P31","v":"Scott"},"Y","N",1,null,null,null,null,0.89,{"$f":"G20+H20","v":1},{"$f":"L20-(I20*0.2)","v":0.89},14,{"$f":"IF(F20=\"Y\",N20,0)","v":0},0]
[18,4,"N",{"$f":"YTD!P32","v":"Steve D"},"Y","N",3,2,null,null,null,7.44,5,7.44,1,0,0]
[19,1,"N",{"$f":"YTD!P33","v":"Steve S"},"Y","Y",null,2,null,3.57,"smb",4.8499999999999996,2,4.8499999999999996,6,4.8499999999999996,1]
[20,6,"N",{"$f":"YTD!P34","v":"Tom"},"Y","N",1,2,null,null,null,3.9,{"$f":"G23+H23","v":3},{"$f":"L23-(I23*0.2)","v":3.9},9,0,0]
[21,null,"N",{"$f":"YTD!P35","v":"Vinny"},"N","N",null,null,null,null,null,null,0,0,35,0,0]
[22,null,"N",{"$f":"YTD!P36","v":"X"},"N","N",null,null,null,null,null,null,0,0,35,0,0]
[23,null,"N",{"$f":"YTD!P37","v":"X"},"N","N",null,null,null,null,null,null,0,0,35,0,0]
[24,null,"N",{"$f":"YTD!P38","v":"X"},"N","N",null,null,null,null,null,null,0,0,35,0,0]
[25,null,"N",{"$f":"YTD!P39","v":"X"},"N","N",null,null,null,null,null,null,{"$f":"G28+H28","v":0},{"$f":"L28-(I28*0.2)","v":0},35,{"$f":"IF(F28=\"Y\",N28,0)","v":0},{"$f":"IF(E28=\"N\",0,(IF(F28=\"N\",0,1)))","v":0}]
[26,null,"N",{"$f":"YTD!P40","v":"X"},"N","N",null,null,null,null,null,null,{"$f":"G29+H29","v":0},{"$f":"L29-(I29*0.2)","v":0},35,{"$f":"IF(F29=\"Y\",N29,0)","v":0},{"$f":"IF(E29=\"N\",0,(IF(F29=\"N\",0,1)))","v":0}]
[null,null,null,"Totals",{"$f":"COUNTIF(E4:E29,\"Y\")","v":19},null,{"$f":"SUM(G4:G29)","v":26},{"$f":"SUM(H4:H29)","v":18},{"$f":"SUM(I4:I29)","v":0},{"$f":"MAX(J4:J29)","v":3.57},null,{"$f":"SUM(L4:L29)","v":61.99},{"$f":"SUM(M4:M29)","v":44},{"$f":"SUM(N4:N29)","v":61.99},null,{"$f":"SUM(P4:P29)","v":27.339999999999996},{"$f":"SUM(Q4:Q29)","v":9}]
[null,"Place","Team #","Partners",null,null,"Total Weight",null,"Place","Team #","Partners",null,null,"Total Weight",null,"NB Avg",{"$f":"IF(Q30=0,\"No Data\",P30/Q30)","v":3.0377777777777775}]
[null,"1st",{"$f":"Teams!N34","v":4},{"$f":"VLOOKUP($C32,$B$4:$D$29,3,0)","v":"Jim B"},"&",{"$f":"IF($B$4:$B$29=20,\"#N/A\",IF(COUNTIF($B$4:$B$29,$C32)=1,\"Alone\",LOOKUP(2,1/($B$4:$B$29=$C32),$D$4:$D$29)))","v":"Steve D"},{"$f":"Teams!O34","v":12.99},null,"4th",{"$f":"Teams!N37","v":7},{"$f":"VLOOKUP($J32,$B$4:$D$29,3,0)","v":"Jason"},"&",{"$f":"IF($B$4:$B$29=20,\"#N/A\",IF(COUNTIF($B$4:$B$29,$J32)=1,\"Alone\",LOOKUP(2,1/($B$4:$B$29=$J32),$D$4:$D$29)))","v":"Pete"},{"$f":"Teams!O37","v":7.6899999999999995}]
[null,"2nd",{"$f":"Teams!N35","v":2},{"$f":"VLOOKUP($C33,$B$4:$D$29,3,0)","v":"Kevin"},"&",{"$f":"IF($B$4:$B$29=20,\"#N/A\",IF(COUNTIF($B$4:$B$29,$C33)=1,\"Alone\",LOOKUP(2,1/($B$4:$B$29=$C33),$D$4:$D$29)))","v":"Alone"},{"$f":"Teams!O35","v":8.5777777777777775},null,"5th",{"$f":"Teams!N38","v":6},{"$f":"VLOOKUP($J33,$B$4:$D$29,3,0)","v":"Dean"},"&",{"$f":"IF($B$4:$B$29=20,\"#N/A\",IF(COUNTIF($B$4:$B$29,$J33)=1,\"Alone\",LOOKUP(2,1/($B$4:$B$29=$J33),$D$4:$D$29)))","v":"Tom"},{"$f":"Teams!O38","v":7.4499999999999993}]
[null,"3rd",{"$f":"Teams!N36","v":3},{"$f":"VLOOKUP($C34,$B$4:$D$29,3,0)","v":"Armand F."},"&",{"$f":"IF($B$4:$B$29=20,\"#N/A\",IF(COUNTIF($B$4:$B$29,$C34)=1,\"Alone\",LOOKUP(2,1/($B$4:$B$29=$C34),$D$4:$D$29)))","v":"Jim H"},{"$f":"Teams!O36","v":8.17},null,"6th",{"$f":"Teams!N39","v":1},{"$f":"VLOOKUP($J34,$B$4:$D$29,3,0)","v":"Scott"},"&",{"$f":"IF($B$4:$B$29=20,\"#N/A\",IF(COUNTIF($B$4:$B$29,$J34)=1,\"Alone\",LOOKUP(2,1/($B$4:$B$29=$J34),$D$4:$D$29)))","v":"Steve S"},{"$f":"Teams!O39","v":5.7399999999999993}]

{"sheet":"Quaddic","index":2,"n_rows":34,"n_cols":17,"rows_kept":34,"cut":false,"hidden":false,"merged":[[33,6,33,7],[33,13,33,14],[30,13,30,14],[31,6,31,7],[31,13,31,14],[32,6,32,7],[32,13,32,14],[0,0,0,16],[30,3,30,5],[30,6,30,7],[30,10,30,12],[1,0,2,0]]}
[{"$f":"YTD!L17","v":"Quaddick"}]
[null,"Team","Fish","Member","Show","Non","Number","Number","Number","Lunker","Species","Gross","Total","Net","Points","Non Boater","# Non-"]
[null,"Number","Alone?","Name","Up?","Boater?","of LMB","of SMB","Dead","Weight","LMB/SMB","Weight","Caught","Weight","Awarded","Weight","Boaters"]
[1,9,"N",{"$f":"YTD!P15","v":"Armand F."},"y","N",5,null,null,null,null,4.54,{"$f":"G4+H4","v":5},{"$f":"L4-(I4*0.2)","v":4.54},{"$f":"IF($E4=\"N\",35,IF($M4=0,30,RANK($N4,$N$4:$N$29,0)))","v":9},{"$f":"IF(F4=\"Y\",N4,0)","v":0},{"$f":"IF(E4=\"N\",0,(IF(F4=\"N\",0,1)))","v":0}]
[2,11,"N",{"$f":"YTD!P16","v":"Bill"},"y","Y",null,null,null,null,null,null,0,0,{"$f":"IF($E5=\"N\",35,IF($M5=0,30,RANK($N5,$N$4:$N$29,0)))","v":30},0,{"$f":"IF(E5=\"N\",0,(IF(F5=\"N\",0,1)))","v":1}]
[3,7,"N",{"$f":"YTD!P17","v":"Dean"},"y","N",4,null,null,null,null,2.85,{"$f":"G6+H6","v":4},{"$f":"L6-(I6*0.2)","v":2.85},16,{"$f":"IF(F6=\"Y\",N6,0)","v":0},0]
[4,6,"N",{"$f":"YTD!P18","v":"Jack"},"y","Y",4,null,null,null,null,3.04,4,3.04,15,3.04,1]
[5,8,"Y",{"$f":"YTD!P19","v":"Jason"},"y","N",5,null,null,null,null,5.62,{"$f":"G8+H8","v":5},{"$f":"L8-(I8*0.2)","v":5.62},5,{"$f":"IF(F8=\"Y\",N8,0)","v":0},0]
[6,6,"N",{"$f":"YTD!P20","v":"Jeff"},"y","N",4,null,null,3.62,"lmb",6.19,4,6.19,4,0,0]
[7,1,"N",{"$f":"YTD!P21","v":"Jim B"},"y","Y",3,null,null,null,null,3.11,3,3.11,14,3.11,1]
[8,4,"N",{"$f":"YTD!P22","v":"Jim H"},"y","Y",2,null,null,null,null,4.3899999999999997,{"$f":"G11+H11","v":2},{"$f":"L11-(I11*0.2)","v":4.3899999999999997},11,{"$f":"IF(F11=\"Y\",N11,0)","v":4.3899999999999997},1]
[9,9,"N",{"$f":"YTD!P23","v":"Joe"},"y","Y",5,null,null,null,null,4.37,5,4.37,12,4.37,1]
[10,10,"N",{"$f":"YTD!P24","v":"Kevin"},"y","N",5,null,null,null,null,4.88,5,4.88,7,0,0]
[11,5,"N",{"$f":"YTD!P25","v":"Mike"},"y","Y",1,null,null,null,null,2.56,1,2.56,17,2.56,1]
[12,2,"N",{"$f":"YTD!P26","v":"Morrie"},"y","N",2,null,null,null,null,2.06,2,2.06,18,0,0]
[13,7,"N",{"$f":"YTD!P27","v":"Pete"},"y","Y",4,null,null,null,null,6.45,4,6.45,3,6.45,1]
[14,5,"N",{"$f":"YTD!P28","v":"Rich B"},"y","N",null,null,null,null,null,null,0,0,30,0,0]
[15,3,"N",{"$f":"YTD!P29","v":"Rich T"},"y","Y",5,null,null,null,null,4.6100000000000003,{"$f":"G18+H18","v":5},{"$f":"L18-(I18*0.2)","v":4.6100000000000003},8,4.6100000000000003,1]
[16,11,"N",{"$f":"YTD!P30","v":"Ron"},"y","N",4,null,null,null,null,3.43,4,3.43,13,0,0]
[17,4,"N",{"$f":"YTD!P31","v":"Scott"},"y","N",5,null,null,null,null,5.05,{"$f":"G20+H20","v":5},{"$f":"L20-(I20*0.2)","v":5.05},6,{"$f":"IF(F20=\"Y\",N20,0)","v":0},0]
[18,3,"N",{"$f":"YTD!P32","v":"Steve D"},"y","N",5,null,null,3.37,null,6.86,5,6.86,1,0,0]
[19,2,"N",{"$f":"YTD!P33","v":"Steve S"},"y","Y",null,null,null,null,null,null,0,0,30,0,1]
[20,1,"N",{"$f":"YTD!P34","v":"Tom"},"y","N",5,null,1,null,null,6.93,{"$f":"G23+H23","v":5},{"$f":"L23-(I23*0.2)","v":6.7299999999999995},2,0,0]
[21,10,"N",{"$f":"YTD!P35","v":"Vinny"},"y","Y",5,null,null,null,null,4.54,5,4.54,9,4.54,1]
[22,null,"N",{"$f":"YTD!P36","v":"X"},"N","N",null,null,null,null,null,null,0,0,35,0,0]
[23,null,"N",{"$f":"YTD!P37","v":"X"},"N","N",null,null,null,null,null,null,0,0,35,0,0]
[24,null,"N",{"$f":"YTD!P38","v":"X"},"N","N",null,null,null,null,null,null,0,0,35,0,0]
[25,null,"N",{"$f":"YTD!P39","v":"X"},"N","N",null,null,null,null,null,null,{"$f":"G28+H28","v":0},{"$f":"L28-(I28*0.2)","v":0},35,{"$f":"IF(F28=\"Y\",N28,0)","v":0},{"$f":"IF(E28=\"N\",0,(IF(F28=\"N\",0,1)))","v":0}]
[26,null,"N",{"$f":"YTD!P40","v":"X"},"N","N",null,null,null,null,null,null,{"$f":"G29+H29","v":0},{"$f":"L29-(I29*0.2)","v":0},35,{"$f":"IF(F29=\"Y\",N29,0)","v":0},{"$f":"IF(E29=\"N\",0,(IF(F29=\"N\",0,1)))","v":0}]
[null,null,null,"Totals",{"$f":"COUNTIF(E4:E29,\"Y\")","v":21},null,{"$f":"SUM(G4:G29)","v":73},{"$f":"SUM(H4:H29)","v":0},{"$f":"SUM(I4:I29)","v":1},{"$f":"MAX(J4:J29)","v":3.62},null,{"$f":"SUM(L4:L29)","v":81.48},{"$f":"SUM(M4:M29)","v":73},{"$f":"SUM(N4:N29)","v":81.280000000000015},null,{"$f":"SUM(P4:P29)","v":33.07},{"$f":"SUM(Q4:Q29)","v":10}]
[null,"Place","Team #","Partners",null,null,"Total Weight",null,"Place","Team #","Partners",null,null,"Total Weight",null,"NB Avg",{"$f":"IF(Q30=0,\"No Data\",P30/Q30)","v":3.3069999999999999}]
[null,"1st",{"$f":"Teams!N64","v":3},{"$f":"VLOOKUP($C32,$B$4:$D$29,3,0)","v":"Rich T"},"&",{"$f":"IF($B$4:$B$29=20,\"#N/A\",IF(COUNTIF($B$4:$B$29,$C32)=1,\"Alone\",LOOKUP(2,1/($B$4:$B$29=$C32),$D$4:$D$29)))","v":"Steve D"},{"$f":"Teams!O64","v":11.47},null,"4th",{"$f":"Teams!N67","v":10},{"$f":"VLOOKUP($J32,$B$4:$D$29,3,0)","v":"Kevin"},"&",{"$f":"IF($B$4:$B$29=20,\"#N/A\",IF(COUNTIF($B$4:$B$29,$J32)=1,\"Alone\",LOOKUP(2,1/($B$4:$B$29=$J32),$D$4:$D$29)))","v":"Vinny"},{"$f":"Teams!O67","v":9.42}]
[null,"2nd",{"$f":"Teams!N65","v":1},{"$f":"VLOOKUP($C33,$B$4:$D$29,3,0)","v":"Jim B"},"&",{"$f":"IF($B$4:$B$29=20,\"#N/A\",IF(COUNTIF($B$4:$B$29,$C33)=1,\"Alone\",LOOKUP(2,1/($B$4:$B$29=$C33),$D$4:$D$29)))","v":"Tom"},{"$f":"Teams!O65","v":9.84},null,"5th",{"$f":"Teams!N68","v":7},{"$f":"VLOOKUP($J33,$B$4:$D$29,3,0)","v":"Dean"},"&",{"$f":"IF($B$4:$B$29=20,\"#N/A\",IF(COUNTIF($B$4:$B$29,$J33)=1,\"Alone\",LOOKUP(2,1/($B$4:$B$29=$J33),$D$4:$D$29)))","v":"Pete"},{"$f":"Teams!O68","v":9.3000000000000007}]
[null,"3rd",{"$f":"Teams!N66","v":4},{"$f":"VLOOKUP($C34,$B$4:$D$29,3,0)","v":"Jim H"},"&",{"$f":"IF($B$4:$B$29=20,\"#N/A\",IF(COUNTIF($B$4:$B$29,$C34)=1,\"Alone\",LOOKUP(2,1/($B$4:$B$29=$C34),$D$4:$D$29)))","v":"Scott"},{"$f":"Teams!O66","v":9.44},null,"6th",{"$f":"Teams!N69","v":6},{"$f":"VLOOKUP($J34,$B$4:$D$29,3,0)","v":"Jack"},"&",{"$f":"IF($B$4:$B$29=20,\"#N/A\",IF(COUNTIF($B$4:$B$29,$J34)=1,\"Alone\",LOOKUP(2,1/($B$4:$B$29=$J34),$D$4:$D$29)))","v":"Jeff"},{"$f":"Teams!O69","v":9.23}]

{"sheet":"Candlewood","index":3,"n_rows":34,"n_cols":17,"rows_kept":34,"cut":false,"hidden":false,"merged":[[33,6,33,7],[33,13,33,14],[30,13,30,14],[31,6,31,7],[31,13,31,14],[32,6,32,7],[32,13,32,14],[0,0,0,16],[30,3,30,5],[30,6,30,7],[30,10,30,12],[1,0,2,0]]}
[{"$f":"YTD!L18","v":"Candlewood "}]
[null,"Team","Fish","Member","Show","Non","Number","Number","Number","Lunker","Species","Gross","Total","Net","Points","Non Boater","# Non-"]
[null,"Number","Alone?","Name","Up?","Boater?","of LMB","of SMB","Dead","Weight","LMB/SMB","Weight","Caught","Weight","Awarded","Weight","Boaters"]
[1,1,"N",{"$f":"YTD!P15","v":"Armand F."},"y","N",2,3,null,null,null,7.49,{"$f":"G4+H4","v":5},{"$f":"L4-(I4*0.2)","v":7.49},{"$f":"IF($E4=\"N\",35,IF($M4=0,30,RANK($N4,$N$4:$N$29,0)))","v":8},{"$f":"IF(F4=\"Y\",N4,0)","v":0},{"$f":"IF(E4=\"N\",0,(IF(F4=\"N\",0,1)))","v":0}]
[2,4,"N",{"$f":"YTD!P16","v":"Bill"},"y","Y",null,1,null,null,null,1.43,1,1.43,{"$f":"IF($E5=\"N\",35,IF($M5=0,30,RANK($N5,$N$4:$N$29,0)))","v":20},1.43,{"$f":"IF(E5=\"N\",0,(IF(F5=\"N\",0,1)))","v":1}]
[3,7,"Y",{"$f":"YTD!P17","v":"Dean"},"y","N",4,1,null,null,null,8.7799999999999994,{"$f":"G6+H6","v":5},{"$f":"L6-(I6*0.2)","v":8.7799999999999994},3,{"$f":"IF(F6=\"Y\",N6,0)","v":0},0]
[4,1,"N",{"$f":"YTD!P18","v":"Jack"},"y","Y",2,3,null,3.53,"LMB",12.33,5,12.33,1,12.33,1]
[5,9,"N",{"$f":"YTD!P19","v":"Jason"},"y","N",1,null,null,null,null,2.89,{"$f":"G8+H8","v":1},{"$f":"L8-(I8*0.2)","v":2.89},16,{"$f":"IF(F8=\"Y\",N8,0)","v":0},0]
[6,4,"N",{"$f":"YTD!P20","v":"Jeff"},"y","N",2,3,null,null,null,8.0399999999999991,5,8.0399999999999991,5,0,0]
[7,3,"N",{"$f":"YTD!P21","v":"Jim B"},"y","Y",1,2,null,null,null,3.41,3,3.41,13,3.41,1]
[8,2,"N",{"$f":"YTD!P22","v":"Jim H"},"y","Y",1,1,null,null,null,3.36,{"$f":"G11+H11","v":2},{"$f":"L11-(I11*0.2)","v":3.36},14,{"$f":"IF(F11=\"Y\",N11,0)","v":3.36},1]
[9,8,"N",{"$f":"YTD!P23","v":"Joe"},"y","Y",1,null,null,null,null,2.2599999999999998,1,2.2599999999999998,17,2.2599999999999998,1]
[10,3,"N",{"$f":"YTD!P24","v":"Kevin"},"y","N",4,1,null,null,null,8.27,5,8.27,4,0,0]
[11,5,"N",{"$f":"YTD!P25","v":"Mike"},"y","Y",2,1,null,null,null,5.57,3,5.57,10,5.57,1]
[12,2,"N",{"$f":"YTD!P26","v":"Morrie"},"y","N",null,1,null,null,null,1.61,1,1.61,18,0,0]
[13,11,"N",{"$f":"YTD!P27","v":"Pete"},"y","Y",2,1,null,null,null,4.4800000000000004,3,4.4800000000000004,12,4.4800000000000004,1]
[14,10,"N",{"$f":"YTD!P28","v":"Rich B"},"y","N",1,2,null,null,null,4.96,3,4.96,11,0,0]
[15,6,"N",{"$f":"YTD!P29","v":"Rich T"},"y","Y",3,2,null,null,null,7.78,{"$f":"G18+H18","v":5},{"$f":"L18-(I18*0.2)","v":7.78},7,7.78,1]
[16,11,"N",{"$f":"YTD!P30","v":"Ron"},"y","N",1,4,null,null,null,8,5,8,6,0,0]
[17,8,"N",{"$f":"YTD!P31","v":"Scott"},"y","N",3,1,null,null,null,6.51,{"$f":"G20+H20","v":4},{"$f":"L20-(I20*0.2)","v":6.51},9,{"$f":"IF(F20=\"Y\",N20,0)","v":0},0]
[18,5,"N",{"$f":"YTD!P32","v":"Steve D"},"y","N",2,3,null,null,null,10.220000000000001,5,10.220000000000001,2,0,0]
[19,10,"N",{"$f":"YTD!P33","v":"Steve S"},"y","Y",1,1,null,null,null,1.51,2,1.51,19,1.51,1]
[20,6,"N",{"$f":"YTD!P34","v":"Tom"},"y","N",1,1,1,null,null,3.34,{"$f":"G23+H23","v":2},{"$f":"L23-(I23*0.2)","v":3.1399999999999997},15,0,0]
[21,9,"N",{"$f":"YTD!P35","v":"Vinny"},"y","Y",null,null,null,null,null,null,0,0,30,0,1]
[22,null,"N",{"$f":"YTD!P36","v":"X"},"N","N",null,null,null,null,null,null,0,0,35,0,0]
[23,null,"N",{"$f":"YTD!P37","v":"X"},"N","N",null,null,null,null,null,null,0,0,35,0,0]
[24,null,"N",{"$f":"YTD!P38","v":"X"},"N","N",null,null,null,null,null,null,0,0,35,0,0]
[25,null,"N",{"$f":"YTD!P39","v":"X"},"N","N",null,null,null,null,null,null,{"$f":"G28+H28","v":0},{"$f":"L28-(I28*0.2)","v":0},35,{"$f":"IF(F28=\"Y\",N28,0)","v":0},{"$f":"IF(E28=\"N\",0,(IF(F28=\"N\",0,1)))","v":0}]
[26,null,"N",{"$f":"YTD!P40","v":"X"},"N","N",null,null,null,null,null,null,{"$f":"G29+H29","v":0},{"$f":"L29-(I29*0.2)","v":0},35,{"$f":"IF(F29=\"Y\",N29,0)","v":0},{"$f":"IF(E29=\"N\",0,(IF(F29=\"N\",0,1)))","v":0}]
[null,null,null,"Totals",{"$f":"COUNTIF(E4:E29,\"Y\")","v":21},null,{"$f":"SUM(G4:G29)","v":34},{"$f":"SUM(H4:H29)","v":32},{"$f":"SUM(I4:I29)","v":1},{"$f":"MAX(J4:J29)","v":3.53},null,{"$f":"SUM(L4:L29)","v":112.24000000000002},{"$f":"SUM(M4:M29)","v":66},{"$f":"SUM(N4:N29)","v":112.04000000000002},null,{"$f":"SUM(P4:P29)","v":42.13},{"$f":"SUM(Q4:Q29)","v":10}]
[null,"Place","Team #","Partners",null,null,"Total Weight",null,"Place","Team #","Partners",null,null,"Total Weight",null,"NB Avg",{"$f":"IF(Q30=0,\"No Data\",P30/Q30)","v":4.2130000000000001}]
[null,"1st",{"$f":"Teams!$N94","v":1},{"$f":"VLOOKUP($C32,$B$4:$D$29,3,0)","v":"Armand F."},"&",{"$f":"IF($B$4:$B$29=20,\"#N/A\",IF(COUNTIF($B$4:$B$29,$C32)=1,\"Alone\",LOOKUP(2,1/($B$4:$B$29=$C32),$D$4:$D$29)))","v":"Jack"},{"$f":"Teams!O94","v":19.82},null,"4th",{"$f":"Teams!$N97","v":11},{"$f":"VLOOKUP($J32,$B$4:$D$29,3,0)","v":"Pete"},"&",{"$f":"IF($B$4:$B$29=20,\"#N/A\",IF(COUNTIF($B$4:$B$29,$J32)=1,\"Alone\",LOOKUP(2,1/($B$4:$B$29=$J32),$D$4:$D$29)))","v":"Ron"},{"$f":"Teams!O97","v":12.48}]
[null,"2nd",{"$f":"Teams!$N95","v":5},{"$f":"VLOOKUP($C33,$B$4:$D$29,3,0)","v":"Mike"},"&",{"$f":"IF($B$4:$B$29=20,\"#N/A\",IF(COUNTIF($B$4:$B$29,$C33)=1,\"Alone\",LOOKUP(2,1/($B$4:$B$29=$C33),$D$4:$D$29)))","v":"Steve D"},{"$f":"Teams!O95","v":15.790000000000001},null,"5th",{"$f":"Teams!$N98","v":3},{"$f":"VLOOKUP($J33,$B$4:$D$29,3,0)","v":"Jim B"},"&",{"$f":"IF($B$4:$B$29=20,\"#N/A\",IF(COUNTIF($B$4:$B$29,$J33)=1,\"Alone\",LOOKUP(2,1/($B$4:$B$29=$J33),$D$4:$D$29)))","v":"Kevin"},{"$f":"Teams!O98","v":11.68}]
[null,"3rd",{"$f":"Teams!$N96","v":7},{"$f":"VLOOKUP($C34,$B$4:$D$29,3,0)","v":"Dean"},"&",{"$f":"IF($B$4:$B$29=20,\"#N/A\",IF(COUNTIF($B$4:$B$29,$C34)=1,\"Alone\",LOOKUP(2,1/($B$4:$B$29=$C34),$D$4:$D$29)))","v":"Alone"},{"$f":"Teams!O96","v":12.992999999999999},null,"6th",{"$f":"Teams!$N99","v":6},{"$f":"VLOOKUP($J34,$B$4:$D$29,3,0)","v":"Rich T"},"&",{"$f":"IF($B$4:$B$29=20,\"#N/A\",IF(COUNTIF($B$4:$B$29,$J34)=1,\"Alone\",LOOKUP(2,1/($B$4:$B$29=$J34),$D$4:$D$29)))","v":"Tom"},{"$f":"Teams!O99","v":10.92}]

{"sheet":"CT River","index":4,"n_rows":34,"n_cols":17,"rows_kept":34,"cut":false,"hidden":false,"merged":[[33,6,33,7],[33,13,33,14],[30,13,30,14],[31,6,31,7],[31,13,31,14],[32,6,32,7],[32,13,32,14],[0,0,0,16],[30,3,30,5],[30,6,30,7],[30,10,30,12],[1,0,2,0]]}
[{"$f":"YTD!L19","v":"CT River"}]
[null,"Team","Fish","Member","Show","Non","Number","Number","Number","Lunker","Species","Gross","Total","Net","Points","Non Boater","# Non-"]
[null,"Number","Alone?","Name","Up?","Boater?","of LMB","of SMB","Dead","Weight","LMB/SMB","Weight","Caught","Weight","Awarded","Weight","Boaters"]
[1,6,"N",{"$f":"YTD!P15","v":"Armand F."},"y","N",2,null,null,null,null,2.52,{"$f":"G4+H4","v":2},{"$f":"L4-(I4*0.2)","v":2.52},{"$f":"IF($E4=\"N\",35,IF($M4=0,30,RANK($N4,$N$4:$N$29,0)))","v":10},{"$f":"IF(F4=\"Y\",N4,0)","v":0},{"$f":"IF(E4=\"N\",0,(IF(F4=\"N\",0,1)))","v":0}]
[2,6,"N",{"$f":"YTD!P16","v":"Bill"},"y","Y",null,2,null,null,null,2.2400000000000002,2,2.2400000000000002,{"$f":"IF($E5=\"N\",35,IF($M5=0,30,RANK($N5,$N$4:$N$29,0)))","v":11},2.2400000000000002,{"$f":"IF(E5=\"N\",0,(IF(F5=\"N\",0,1)))","v":1}]
[3,3,"N",{"$f":"YTD!P17","v":"Dean"},"y","N",null,1,null,null,null,0.73,{"$f":"G6+H6","v":1},{"$f":"L6-(I6*0.2)","v":0.73},14,{"$f":"IF(F6=\"Y\",N6,0)","v":0},0]
[4,7,"N",{"$f":"YTD!P18","v":"Jack"},"y","Y",2,1,null,2.0299999999999998,"lmb ",5.14,3,5.14,2,5.14,1]
[5,2,"Y",{"$f":"YTD!P19","v":"Jason"},"y","N",1,4,null,null,null,5.88,{"$f":"G8+H8","v":5},{"$f":"L8-(I8*0.2)","v":5.88},1,{"$f":"IF(F8=\"Y\",N8,0)","v":0},0]
[6,5,"N",{"$f":"YTD!P20","v":"Jeff"},"y","N",2,null,null,null,null,2.81,2,2.81,8,0,0]
[7,null,"N",{"$f":"YTD!P21","v":"Jim B"},"N","Y",null,null,null,null,null,null,0,0,35,0,0]
[8,9,"N",{"$f":"YTD!P22","v":"Jim H"},"y","Y",null,null,null,null,null,null,{"$f":"G11+H11","v":0},{"$f":"L11-(I11*0.2)","v":0},30,{"$f":"IF(F11=\"Y\",N11,0)","v":0},1]
[9,8,"N",{"$f":"YTD!P23","v":"Joe"},"y","Y",null,null,null,null,null,null,0,0,30,0,1]
[10,1,"N",{"$f":"YTD!P24","v":"Kevin"},"y","N",1,1,null,null,null,2.61,2,2.61,9,0,0]
[11,11,"N",{"$f":"YTD!P25","v":"Mike"},"y","Y",1,null,null,null,null,1.03,1,1.03,13,1.03,1]
[12,8,"N",{"$f":"YTD!P26","v":"Morrie"},"y","N",null,null,null,null,null,null,0,0,30,0,0]
[13,5,"N",{"$f":"YTD!P27","v":"Pete"},"y","Y",null,null,null,null,null,null,0,0,30,0,1]
[14,9,"N",{"$f":"YTD!P28","v":"Rich B"},"y","N",2,1,null,null,null,4.45,3,4.45,3,0,0]
[15,1,"N",{"$f":"YTD!P29","v":"Rich T"},"y","Y",null,2,null,null,null,2.84,{"$f":"G18+H18","v":2},{"$f":"L18-(I18*0.2)","v":2.84},7,2.84,1]
[16,4,"Y",{"$f":"YTD!P30","v":"Ron"},"y","N",null,3,null,null,null,3.99,3,3.99,4,0,0]
[17,7,"N",{"$f":"YTD!P31","v":"Scott"},"y","N",null,3,null,null,null,2.94,{"$f":"G20+H20","v":3},{"$f":"L20-(I20*0.2)","v":2.94},6,{"$f":"IF(F20=\"Y\",N20,0)","v":0},0]
[18,10,"N",{"$f":"YTD!P32","v":"Steve D"},"y","N",1,2,null,null,null,3.11,3,3.11,5,0,0]
[19,10,"N",{"$f":"YTD!P33","v":"Steve S"},"y","Y",1,null,null,null,null,1.1100000000000001,1,1.1100000000000001,12,1.1100000000000001,1]
[20,11,"N",{"$f":"YTD!P34","v":"Tom"},"y","N",null,null,null,null,null,null,{"$f":"G23+H23","v":0},{"$f":"L23-(I23*0.2)","v":0},30,0,0]
[21,3,"N",{"$f":"YTD!P35","v":"Vinny"},"y","Y",null,null,null,null,null,null,0,0,30,0,1]
[22,null,"N",{"$f":"YTD!P36","v":"X"},"N","N",null,null,null,null,null,null,0,0,35,0,0]
[23,null,"N",{"$f":"YTD!P37","v":"X"},"N","N",null,null,null,null,null,null,0,0,35,0,0]
[24,null,"N",{"$f":"YTD!P38","v":"X"},"N","N",null,null,null,null,null,null,0,0,35,0,0]
[25,null,"N",{"$f":"YTD!P39","v":"X"},"N","N",null,null,null,null,null,null,{"$f":"G28+H28","v":0},{"$f":"L28-(I28*0.2)","v":0},35,{"$f":"IF(F28=\"Y\",N28,0)","v":0},{"$f":"IF(E28=\"N\",0,(IF(F28=\"N\",0,1)))","v":0}]
[26,null,"N",{"$f":"YTD!P40","v":"X"},"N","N",null,null,null,null,null,null,{"$f":"G29+H29","v":0},{"$f":"L29-(I29*0.2)","v":0},35,{"$f":"IF(F29=\"Y\",N29,0)","v":0},{"$f":"IF(E29=\"N\",0,(IF(F29=\"N\",0,1)))","v":0}]
[null,null,null,"Totals",{"$f":"COUNTIF(E4:E29,\"Y\")","v":20},null,{"$f":"SUM(G4:G29)","v":13},{"$f":"SUM(H4:H29)","v":20},{"$f":"SUM(I4:I29)","v":0},{"$f":"MAX(J4:J29)","v":2.0299999999999998},null,{"$f":"SUM(L4:L29)","v":41.399999999999991},{"$f":"SUM(M4:M29)","v":33},{"$f":"SUM(N4:N29)","v":41.399999999999991},null,{"$f":"SUM(P4:P29)","v":12.36},{"$f":"SUM(Q4:Q29)","v":9}]
[null,"Place","Team #","Partners",null,null,"Total Weight",null,"Place","Team #","Partners",null,null,"Total Weight",null,"NB Avg",{"$f":"IF(Q30=0,\"No Data\",P30/Q30)","v":1.3733333333333333}]
[null,"1st",{"$f":"Teams!$AD4","v":7},{"$f":"VLOOKUP($C32,$B$4:$D$29,3,0)","v":"Jack"},"&",{"$f":"IF($B$4:$B$29=20,\"#N/A\",IF(COUNTIF($B$4:$B$29,$C32)=1,\"Alone\",LOOKUP(2,1/($B$4:$B$29=$C32),$D$4:$D$29)))","v":"Scott"},{"$f":"Teams!AE4","v":8.08},null,"4th",{"$f":"Teams!$AD7","v":4},{"$f":"VLOOKUP($J32,$B$4:$D$29,3,0)","v":"Ron"},"&",{"$f":"IF($B$4:$B$29=20,\"#N/A\",IF(COUNTIF($B$4:$B$29,$J32)=1,\"Alone\",LOOKUP(2,1/($B$4:$B$29=$J32),$D$4:$D$29)))","v":"Alone"},{"$f":"Teams!AE7","v":5.3633333333333333}]
[null,"2nd",{"$f":"Teams!$AD5","v":2},{"$f":"VLOOKUP($C33,$B$4:$D$29,3,0)","v":"Jason"},"&",{"$f":"IF($B$4:$B$29=20,\"#N/A\",IF(COUNTIF($B$4:$B$29,$C33)=1,\"Alone\",LOOKUP(2,1/($B$4:$B$29=$C33),$D$4:$D$29)))","v":"Alone"},{"$f":"Teams!AE5","v":7.253333333333333},null,"5th",{"$f":"Teams!$AD8","v":6},{"$f":"VLOOKUP($J33,$B$4:$D$29,3,0)","v":"Armand F."},"&",{"$f":"IF($B$4:$B$29=20,\"#N/A\",IF(COUNTIF($B$4:$B$29,$J33)=1,\"Alone\",LOOKUP(2,1/($B$4:$B$29=$J33),$D$4:$D$29)))","v":"Bill"},{"$f":"Teams!AE8","v":4.76}]
[null,"3rd",{"$f":"Teams!$AD6","v":1},{"$f":"VLOOKUP($C34,$B$4:$D$29,3,0)","v":"Kevin"},"&",{"$f":"IF($B$4:$B$29=20,\"#N/A\",IF(COUNTIF($B$4:$B$29,$C34)=1,\"Alone\",LOOKUP(2,1/($B$4:$B$29=$C34),$D$4:$D$29)))","v":"Rich T"},{"$f":"Teams!AE6","v":5.4499999999999993},null,"6th",{"$f":"Teams!$AD9","v":9},{"$f":"VLOOKUP($J34,$B$4:$D$29,3,0)","v":"Jim H"},"&",{"$f":"IF($B$4:$B$29=20,\"#N/A\",IF(COUNTIF($B$4:$B$29,$J34)=1,\"Alone\",LOOKUP(2,1/($B$4:$B$29=$J34),$D$4:$D$29)))","v":"Rich B"},{"$f":"Teams!AE9","v":4.45}]

{"sheet":"Hamilton","index":5,"n_rows":34,"n_cols":17,"rows_kept":34,"cut":false,"hidden":false,"merged":[[33,6,33,7],[33,13,33,14],[30,13,30,14],[31,6,31,7],[31,13,31,14],[32,6,32,7],[32,13,32,14],[0,0,0,16],[30,3,30,5],[30,6,30,7],[30,10,30,12],[1,0,2,0]]}
[{"$f":"YTD!L20","v":"Hamilton"}]
[null,"Team","Fish","Member","Show","Non","Number","Number","Number","Lunker","Species","Gross","Total","Net","Points","Non Boater","# Non-"]
[null,"Number","Alone?","Name","Up?","Boater?","of LMB","of SMB","Dead","Weight","LMB/SMB","Weight","Caught","Weight","Awarded","Weight","Boaters"]
[1,7,"N",{"$f":"YTD!P15","v":"Armand F."},"y","N",5,null,null,null,null,6.02,{"$f":"G4+H4","v":5},{"$f":"L4-(I4*0.2)","v":6.02},{"$f":"IF($E4=\"N\",35,IF($M4=0,30,RANK($N4,$N$4:$N$29,0)))","v":6},{"$f":"IF(F4=\"Y\",N4,0)","v":0},{"$f":"IF(E4=\"N\",0,(IF(F4=\"N\",0,1)))","v":0}]
[2,5,"N",{"$f":"YTD!P16","v":"Bill"},"y","Y",3,null,null,null,null,3.65,3,3.65,{"$f":"IF($E5=\"N\",35,IF($M5=0,30,RANK($N5,$N$4:$N$29,0)))","v":12},3.65,{"$f":"IF(E5=\"N\",0,(IF(F5=\"N\",0,1)))","v":1}]
[3,null,"N",{"$f":"YTD!P17","v":"Dean"},"N","N",null,null,null,null,null,null,{"$f":"G6+H6","v":0},{"$f":"L6-(I6*0.2)","v":0},35,{"$f":"IF(F6=\"Y\",N6,0)","v":0},0]
[4,9,"N",{"$f":"YTD!P18","v":"Jack"},"y","Y",3,null,null,null,null,4.12,3,4.12,9,4.12,1]
[5,1,"N",{"$f":"YTD!P19","v":"Jason"},"y","N",3,null,null,null,null,3.15,{"$f":"G8+H8","v":3},{"$f":"L8-(I8*0.2)","v":3.15},15,{"$f":"IF(F8=\"Y\",N8,0)","v":0},0]
[6,10,"Y",{"$f":"YTD!P20","v":"Jeff"},"y","N",4,null,null,null,null,7.09,4,7.09,1,0,0]
[7,4,"N",{"$f":"YTD!P21","v":"Jim B"},"y","Y",4,null,1,null,null,3.73,4,3.53,13,3.53,1]
[8,null,"N",{"$f":"YTD!P22","v":"Jim H"},"n","Y",null,null,null,null,null,null,{"$f":"G11+H11","v":0},{"$f":"L11-(I11*0.2)","v":0},35,{"$f":"IF(F11=\"Y\",N11,0)","v":0},0]
[9,8,"N",{"$f":"YTD!P23","v":"Joe"},"y","Y",3,null,null,2.54,"LMB",4.34,3,4.34,8,4.34,1]
[10,2,"N",{"$f":"YTD!P24","v":"Kevin"},"y","N",3,null,null,null,null,3.91,3,3.91,11,0,0]
[11,2,"N",{"$f":"YTD!P25","v":"Mike"},"y","Y",4,null,null,null,null,4.04,4,4.04,10,4.04,1]
[12,9,"N",{"$f":"YTD!P26","v":"Morrie"},"y","N",1,null,null,2.82,"LMB",2.82,1,2.82,16,0,0]
[13,7,"N",{"$f":"YTD!P27","v":"Pete"},"y","Y",5,null,null,null,null,7.04,5,7.04,3,7.04,1]
[14,8,"N",{"$f":"YTD!P28","v":"Rich B"},"y","N",2,null,null,null,null,2.54,2,2.54,17,0,0]
[15,1,"N",{"$f":"YTD!P29","v":"Rich T"},"y","N",1,null,null,null,null,0.93,{"$f":"G18+H18","v":1},{"$f":"L18-(I18*0.2)","v":0.93},19,0,0]
[16,6,"N",{"$f":"YTD!P30","v":"Ron"},"y","N",5,null,null,null,null,6.93,5,6.93,4,0,0]
[17,5,"N",{"$f":"YTD!P31","v":"Scott"},"y","N",5,null,null,null,null,6.53,{"$f":"G20+H20","v":5},{"$f":"L20-(I20*0.2)","v":6.53},5,{"$f":"IF(F20=\"Y\",N20,0)","v":0},0]
[18,4,"N",{"$f":"YTD!P32","v":"Steve D"},"y","N",3,null,null,null,null,3.3,3,3.3,14,0,0]
[19,3,"N",{"$f":"YTD!P33","v":"Steve S"},"y","Y",2,null,null,null,null,1.93,2,1.93,18,1.93,1]
[20,3,"N",{"$f":"YTD!P34","v":"Tom"},"y","N",5,null,null,1.27,"LMB",5.38,{"$f":"G23+H23","v":5},{"$f":"L23-(I23*0.2)","v":5.38},7,0,0]
[21,6,"N",{"$f":"YTD!P35","v":"Vinny"},"y","Y",4,1,null,null,null,7.06,5,7.06,2,7.06,1]
[22,null,"N",{"$f":"YTD!P36","v":"X"},"N","N",null,null,null,null,null,null,0,0,35,0,0]
[23,null,"N",{"$f":"YTD!P37","v":"X"},"N","N",null,null,null,null,null,null,0,0,35,0,0]
[24,null,"N",{"$f":"YTD!P38","v":"X"},"N","N",null,null,null,null,null,null,0,0,35,0,0]
[25,null,"N",{"$f":"YTD!P39","v":"X"},"N","N",null,null,null,null,null,null,{"$f":"G28+H28","v":0},{"$f":"L28-(I28*0.2)","v":0},35,{"$f":"IF(F28=\"Y\",N28,0)","v":0},{"$f":"IF(E28=\"N\",0,(IF(F28=\"N\",0,1)))","v":0}]
[26,null,"N",{"$f":"YTD!P40","v":"X"},"N","N",null,null,null,null,null,null,{"$f":"G29+H29","v":0},{"$f":"L29-(I29*0.2)","v":0},35,{"$f":"IF(F29=\"Y\",N29,0)","v":0},{"$f":"IF(E29=\"N\",0,(IF(F29=\"N\",0,1)))","v":0}]
[null,null,null,"Totals",{"$f":"COUNTIF(E4:E29,\"Y\")","v":19},null,{"$f":"SUM(G4:G29)","v":65},{"$f":"SUM(H4:H29)","v":1},{"$f":"SUM(I4:I29)","v":1},{"$f":"MAX(J4:J29)","v":2.82},null,{"$f":"SUM(L4:L29)","v":84.509999999999991},{"$f":"SUM(M4:M29)","v":66},{"$f":"SUM(N4:N29)","v":84.31},null,{"$f":"SUM(P4:P29)","v":35.71},{"$f":"SUM(Q4:Q29)","v":8}]
[null,"Place","Team #","Partners",null,null,"Total Weight",null,"Place","Team #","Partners",null,null,"Total Weight",null,"NB Avg",{"$f":"IF(Q30=0,\"No Data\",P30/Q30)","v":4.4637500000000001}]
[null,"1st",{"$f":"Teams!$AD34","v":6},{"$f":"VLOOKUP($C32,$B$4:$D$29,3,0)","v":"Ron"},"&",{"$f":"IF($B$4:$B$29=20,\"#N/A\",IF(COUNTIF($B$4:$B$29,$C32)=1,\"Alone\",LOOKUP(2,1/($B$4:$B$29=$C32),$D$4:$D$29)))","v":"Vinny"},{"$f":"Teams!AE34","v":13.989999999999998},null,"4th",{"$f":"Teams!$AD37","v":5},{"$f":"VLOOKUP($J32,$B$4:$D$29,3,0)","v":"Bill"},"&",{"$f":"IF($B$4:$B$29=20,\"#N/A\",IF(COUNTIF($B$4:$B$29,$J32)=1,\"Alone\",LOOKUP(2,1/($B$4:$B$29=$J32),$D$4:$D$29)))","v":"Scott"},{"$f":"Teams!AE37","v":10.18}]
[null,"2nd",{"$f":"Teams!$AD35","v":7},{"$f":"VLOOKUP($C33,$B$4:$D$29,3,0)","v":"Armand F."},"&",{"$f":"IF($B$4:$B$29=20,\"#N/A\",IF(COUNTIF($B$4:$B$29,$C33)=1,\"Alone\",LOOKUP(2,1/($B$4:$B$29=$C33),$D$4:$D$29)))","v":"Pete"},{"$f":"Teams!AE35","v":13.059999999999999},null,"5th",{"$f":"Teams!$AD38","v":2},{"$f":"VLOOKUP($J33,$B$4:$D$29,3,0)","v":"Kevin"},"&",{"$f":"IF($B$4:$B$29=20,\"#N/A\",IF(COUNTIF($B$4:$B$29,$J33)=1,\"Alone\",LOOKUP(2,1/($B$4:$B$29=$J33),$D$4:$D$29)))","v":"Mike"},{"$f":"Teams!AE38","v":7.95}]
[null,"3rd",{"$f":"Teams!$AD36","v":10},{"$f":"VLOOKUP($C34,$B$4:$D$29,3,0)","v":"Jeff"},"&",{"$f":"IF($B$4:$B$29=20,\"#N/A\",IF(COUNTIF($B$4:$B$29,$C34)=1,\"Alone\",LOOKUP(2,1/($B$4:$B$29=$C34),$D$4:$D$29)))","v":"Alone"},{"$f":"Teams!AE36","v":11.553750000000001},null,"6th",{"$f":"Teams!$AD39","v":3},{"$f":"VLOOKUP($J34,$B$4:$D$29,3,0)","v":"Steve S"},"&",{"$f":"IF($B$4:$B$29=20,\"#N/A\",IF(COUNTIF($B$4:$B$29,$J34)=1,\"Alone\",LOOKUP(2,1/($B$4:$B$29=$J34),$D$4:$D$29)))","v":"Tom"},{"$f":"Teams!AE39","v":7.31}]

{"sheet":"Lilly","index":6,"n_rows":34,"n_cols":17,"rows_kept":34,"cut":false,"hidden":false,"merged":[[33,6,33,7],[33,13,33,14],[30,13,30,14],[31,6,31,7],[31,13,31,14],[32,6,32,7],[32,13,32,14],[0,0,0,16],[30,3,30,5],[30,6,30,7],[30,10,30,12],[1,0,2,0]]}
[{"$f":"YTD!L21","v":"Lilly"}]
[null,"Team","Fish","Member","Show","Non","Number","Number","Number","Lunker","Species","Gross","Total","Net","Points","Non Boater","# Non-"]
[null,"Number","Alone?","Name","Up?","Boater?","of LMB","of SMB","Dead","Weight","LMB/SMB","Weight","Caught","Weight","Awarded","Weight","Boaters"]
[1,2,"N",{"$f":"YTD!P15","v":"Armand F."},"y","Y",2,3,null,null,null,5.74,{"$f":"G4+H4","v":5},{"$f":"L4-(I4*0.2)","v":5.74},{"$f":"IF($E4=\"N\",35,IF($M4=0,30,RANK($N4,$N$4:$N$29,0)))","v":8},{"$f":"IF(F4=\"Y\",N4,0)","v":5.74},{"$f":"IF(E4=\"N\",0,(IF(F4=\"N\",0,1)))","v":1}]
[2,10,"N",{"$f":"YTD!P16","v":"Bill"},"y","Y",2,2,null,null,null,4.08,4,4.08,{"$f":"IF($E5=\"N\",35,IF($M5=0,30,RANK($N5,$N$4:$N$29,0)))","v":12},4.08,{"$f":"IF(E5=\"N\",0,(IF(F5=\"N\",0,1)))","v":1}]
[3,8,"N",{"$f":"YTD!P17","v":"Dean"},"y","N",2,3,null,null,null,7.17,{"$f":"G6+H6","v":5},{"$f":"L6-(I6*0.2)","v":7.17},6,{"$f":"IF(F6=\"Y\",N6,0)","v":0},0]
[4,9,"N",{"$f":"YTD!P18","v":"Jack"},"y","Y",2,3,null,null,null,6.18,5,6.18,7,6.18,1]
[5,5,"N",{"$f":"YTD!P19","v":"Jason"},"y","N",2,3,null,4.2300000000000004,"SMB",7.79,{"$f":"G8+H8","v":5},{"$f":"L8-(I8*0.2)","v":7.79},4,{"$f":"IF(F8=\"Y\",N8,0)","v":0},0]
[6,2,"N",{"$f":"YTD!P20","v":"Jeff"},"y","N",2,3,1,null,null,8.19,5,7.9899999999999993,3,0,0]
[7,7,"N",{"$f":"YTD!P21","v":"Jim B"},"y","Y",null,null,null,null,null,null,0,0,30,0,1]
[8,4,"N",{"$f":"YTD!P22","v":"Jim H"},"y","Y",2,1,null,null,null,2.89,{"$f":"G11+H11","v":3},{"$f":"L11-(I11*0.2)","v":2.89},16,{"$f":"IF(F11=\"Y\",N11,0)","v":2.89},1]
[9,3,"N",{"$f":"YTD!P23","v":"Joe"},"y","Y",2,null,null,3.83,"LMB ",5.54,2,5.54,9,5.54,1]
[10,1,"N",{"$f":"YTD!P24","v":"Kevin"},"y","N",null,4,null,null,null,8.25,4,8.25,2,0,0]
[11,5,"N",{"$f":"YTD!P25","v":"Mike"},"y","Y",null,1,null,null,null,1.02,1,1.02,19,1.02,1]
[12,10,"N",{"$f":"YTD!P26","v":"Morrie"},"y","N",4,1,null,3.87,"LMB ",8.3800000000000008,5,8.3800000000000008,1,0,0]
[13,6,"N",{"$f":"YTD!P27","v":"Pete"},"y","Y",2,1,null,null,null,3.92,3,3.92,13,3.92,1]
[14,9,"N",{"$f":"YTD!P28","v":"Rich B"},"y","N",3,2,1,null,null,5.14,5,4.9399999999999995,10,0,0]
[15,8,"N",{"$f":"YTD!P29","v":"Rich T"},"y","Y",4,1,null,null,null,4.84,{"$f":"G18+H18","v":5},{"$f":"L18-(I18*0.2)","v":4.84},11,4.84,1]
[16,7,"N",{"$f":"YTD!P30","v":"Ron"},"y","N",2,1,null,null,null,3.48,3,3.48,15,0,0]
[17,6,"N",{"$f":"YTD!P31","v":"Scott"},"y","N",null,2,null,null,null,1.86,{"$f":"G20+H20","v":2},{"$f":"L20-(I20*0.2)","v":1.86},18,{"$f":"IF(F20=\"Y\",N20,0)","v":0},0]
[18,3,"N",{"$f":"YTD!P32","v":"Steve D"},"y","N",5,null,null,null,null,7.44,5,7.44,5,0,0]
[19,1,"N",{"$f":"YTD!P33","v":"Steve S"},"y","Y",1,null,null,null,null,2.04,1,2.04,17,2.04,1]
[20,4,"N",{"$f":"YTD!P34","v":"Tom"},"y","N",1,1,null,null,null,3.55,{"$f":"G23+H23","v":2},{"$f":"L23-(I23*0.2)","v":3.55},14,0,0]
[21,null,"N",{"$f":"YTD!P35","v":"Vinny"},"n","Y",null,null,null,null,null,null,0,0,35,0,0]
[22,null,"N",{"$f":"YTD!P36","v":"X"},"N","N",null,null,null,null,null,null,0,0,35,0,0]
[23,null,"N",{"$f":"YTD!P37","v":"X"},"N","N",null,null,null,null,null,null,0,0,35,0,0]
[24,null,"N",{"$f":"YTD!P38","v":"X"},"N","N",null,null,null,null,null,null,0,0,35,0,0]
[25,null,"N",{"$f":"YTD!P39","v":"X"},"N","N",null,null,null,null,null,null,{"$f":"G28+H28","v":0},{"$f":"L28-(I28*0.2)","v":0},35,{"$f":"IF(F28=\"Y\",N28,0)","v":0},{"$f":"IF(E28=\"N\",0,(IF(F28=\"N\",0,1)))","v":0}]
[26,null,"N",{"$f":"YTD!P40","v":"X"},"N","N",null,null,null,null,null,null,{"$f":"G29+H29","v":0},{"$f":"L29-(I29*0.2)","v":0},35,{"$f":"IF(F29=\"Y\",N29,0)","v":0},{"$f":"IF(E29=\"N\",0,(IF(F29=\"N\",0,1)))","v":0}]
[null,null,null,"Totals",{"$f":"COUNTIF(E4:E29,\"Y\")","v":20},null,{"$f":"SUM(G4:G29)","v":38},{"$f":"SUM(H4:H29)","v":32},{"$f":"SUM(I4:I29)","v":2},{"$f":"MAX(J4:J29)","v":4.2300000000000004},null,{"$f":"SUM(L4:L29)","v":97.500000000000014},{"$f":"SUM(M4:M29)","v":70},{"$f":"SUM(N4:N29)","v":97.100000000000009},null,{"$f":"SUM(P4:P29)","v":36.249999999999993},{"$f":"SUM(Q4:Q29)","v":10}]
[null,"Place","Team #","Partners",null,null,"Total Weight",null,"Place","Team #","Partners",null,null,"Total Weight",null,"NB Avg",{"$f":"IF(Q30=0,\"No Data\",P30/Q30)","v":3.6249999999999991}]
[null,"1st",{"$f":"Teams!$AD64","v":2},{"$f":"VLOOKUP($C32,$B$4:$D$29,3,0)","v":"Armand F."},"&",{"$f":"IF($B$4:$B$29=20,\"#N/A\",IF(COUNTIF($B$4:$B$29,$C32)=1,\"Alone\",LOOKUP(2,1/($B$4:$B$29=$C32),$D$4:$D$29)))","v":"Jeff"},{"$f":"Teams!AE64","v":13.73},null,"4th",{"$f":"Teams!$AD67","v":8},{"$f":"VLOOKUP($J32,$B$4:$D$29,3,0)","v":"Dean"},"&",{"$f":"IF($B$4:$B$29=20,\"#N/A\",IF(COUNTIF($B$4:$B$29,$J32)=1,\"Alone\",LOOKUP(2,1/($B$4:$B$29=$J32),$D$4:$D$29)))","v":"Rich T"},{"$f":"Teams!AE67","v":12.01}]
[null,"2nd",{"$f":"Teams!$AD65","v":3},{"$f":"VLOOKUP($C33,$B$4:$D$29,3,0)","v":"Joe"},"&",{"$f":"IF($B$4:$B$29=20,\"#N/A\",IF(COUNTIF($B$4:$B$29,$C33)=1,\"Alone\",LOOKUP(2,1/($B$4:$B$29=$C33),$D$4:$D$29)))","v":"Steve D"},{"$f":"Teams!AE65","v":12.98},null,"5th",{"$f":"Teams!$AD68","v":9},{"$f":"VLOOKUP($J33,$B$4:$D$29,3,0)","v":"Jack"},"&",{"$f":"IF($B$4:$B$29=20,\"#N/A\",IF(COUNTIF($B$4:$B$29,$J33)=1,\"Alone\",LOOKUP(2,1/($B$4:$B$29=$J33),$D$4:$D$29)))","v":"Rich B"},{"$f":"Teams!AE68","v":11.12}]
[null,"3rd",{"$f":"Teams!$AD66","v":10},{"$f":"VLOOKUP($C34,$B$4:$D$29,3,0)","v":"Bill"},"&",{"$f":"IF($B$4:$B$29=20,\"#N/A\",IF(COUNTIF($B$4:$B$29,$C34)=1,\"Alone\",LOOKUP(2,1/($B$4:$B$29=$C34),$D$4:$D$29)))","v":"Morrie"},{"$f":"Teams!AE66","v":12.46},null,"6th",{"$f":"Teams!$AD69","v":1},{"$f":"VLOOKUP($J34,$B$4:$D$29,3,0)","v":"Kevin"},"&",{"$f":"IF($B$4:$B$29=20,\"#N/A\",IF(COUNTIF($B$4:$B$29,$J34)=1,\"Alone\",LOOKUP(2,1/($B$4:$B$29=$J34),$D$4:$D$29)))","v":"Steve S"},{"$f":"Teams!AE69","v":10.29}]

{"sheet":"Highland","index":7,"n_rows":34,"n_cols":17,"rows_kept":34,"cut":false,"hidden":false,"merged":[[33,6,33,7],[33,13,33,14],[30,13,30,14],[31,6,31,7],[31,13,31,14],[32,6,32,7],[32,13,32,14],[0,0,0,16],[30,3,30,5],[30,6,30,7],[30,10,30,12],[1,0,2,0]]}
[{"$f":"YTD!L22","v":"Highland"}]
[null,"Team","Fish","Member","Show","Non","Number","Number","Number","Lunker","Species","Gross","Total","Net","Points","Non Boater","# Non-"]
[null,"Number","Alone?","Name","Up?","Boater?","of LMB","of SMB","Dead","Weight","LMB/SMB","Weight","Caught","Weight","Awarded","Weight","Boaters"]
[1,9,"N",{"$f":"YTD!P15","v":"Armand F."},"y","N",4,null,null,null,null,7.23,{"$f":"G4+H4","v":4},{"$f":"L4-(I4*0.2)","v":7.23},{"$f":"IF($E4=\"N\",35,IF($M4=0,30,RANK($N4,$N$4:$N$29,0)))","v":2},{"$f":"IF(F4=\"Y\",N4,0)","v":0},{"$f":"IF(E4=\"N\",0,(IF(F4=\"N\",0,1)))","v":0}]
[2,5,"N",{"$f":"YTD!P16","v":"Bill"},"y","Y",1,null,null,null,null,1.03,1,1.03,{"$f":"IF($E5=\"N\",35,IF($M5=0,30,RANK($N5,$N$4:$N$29,0)))","v":10},1.03,{"$f":"IF(E5=\"N\",0,(IF(F5=\"N\",0,1)))","v":1}]
[3,null,"N",{"$f":"YTD!P17","v":"Dean"},"N","N",null,null,null,null,null,null,{"$f":"G6+H6","v":0},{"$f":"L6-(I6*0.2)","v":0},35,{"$f":"IF(F6=\"Y\",N6,0)","v":0},0]
[4,7,"N",{"$f":"YTD!P18","v":"Jack"},"y","Y",1,null,null,null,null,1.1100000000000001,1,1.1100000000000001,9,1.1100000000000001,1]
[5,8,"N",{"$f":"YTD!P19","v":"Jason"},"y","N",1,1,null,3.15,"smb",4.09,{"$f":"G8+H8","v":2},{"$f":"L8-(I8*0.2)","v":4.09},6,{"$f":"IF(F8=\"Y\",N8,0)","v":0},0]
[6,2,"y",{"$f":"YTD!P20","v":"Jeff"},"y","N",3,null,null,3.47,"LMB ",5.82,3,5.82,4,0,0]
[7,null,"N",{"$f":"YTD!P21","v":"Jim B"},"N","Y",null,null,null,null,null,null,0,0,35,0,0]
[8,1,"N",{"$f":"YTD!P22","v":"Jim H"},"y","Y",null,null,null,null,null,null,{"$f":"G11+H11","v":0},{"$f":"L11-(I11*0.2)","v":0},30,{"$f":"IF(F11=\"Y\",N11,0)","v":0},1]
[9,3,"N",{"$f":"YTD!P23","v":"Joe"},"y","Y",null,null,null,null,null,null,0,0,30,0,1]
[10,1,"N",{"$f":"YTD!P24","v":"Kevin"},"y","N",null,null,null,null,null,null,0,0,30,0,0]
[11,9,"N",{"$f":"YTD!P25","v":"Mike"},"y","Y",2,null,null,null,null,1.79,2,1.79,8,1.79,1]
[12,6,"N",{"$f":"YTD!P26","v":"Morrie"},"y","N",null,null,null,null,null,null,0,0,30,0,0]
[13,6,"N",{"$f":"YTD!P27","v":"Pete"},"y","Y",null,null,null,null,null,null,0,0,30,0,1]
[14,5,"N",{"$f":"YTD!P28","v":"Rich B"},"y","N",3,null,null,null,null,3.45,3,3.45,7,0,0]
[15,null,"N",{"$f":"YTD!P29","v":"Rich T"},"N","Y",null,null,null,null,null,null,{"$f":"G18+H18","v":0},{"$f":"L18-(I18*0.2)","v":0},35,0,0]
[16,null,"N",{"$f":"YTD!P30","v":"Ron"},"N","N",null,null,null,null,null,null,0,0,35,0,0]
[17,4,"y",{"$f":"YTD!P31","v":"Scott"},"y","N",5,null,null,null,null,6.8,{"$f":"G20+H20","v":5},{"$f":"L20-(I20*0.2)","v":6.8},3,{"$f":"IF(F20=\"Y\",N20,0)","v":0},0]
[18,7,"N",{"$f":"YTD!P32","v":"Steve D"},"y","N",4,null,null,null,null,7.37,4,7.37,1,0,0]
[19,8,"N",{"$f":"YTD!P33","v":"Steve S"},"y","Y",null,null,null,null,null,null,0,0,30,0,1]
[20,3,"N",{"$f":"YTD!P34","v":"Tom"},"y","N",4,null,null,2.04,"lmb ",5.54,{"$f":"G23+H23","v":4},{"$f":"L23-(I23*0.2)","v":5.54},5,0,0]
[21,null,"N",{"$f":"YTD!P35","v":"Vinny"},"N","Y",null,null,null,null,null,null,0,0,35,0,0]
[22,null,"N",{"$f":"YTD!P36","v":"X"},"N","N",null,null,null,null,null,null,0,0,35,0,0]
[23,null,"N",{"$f":"YTD!P37","v":"X"},"N","N",null,null,null,null,null,null,0,0,35,0,0]
[24,null,"N",{"$f":"YTD!P38","v":"X"},"N","N",null,null,null,null,null,null,0,0,35,0,0]
[25,null,"N",{"$f":"YTD!P39","v":"X"},"N","N",null,null,null,null,null,null,{"$f":"G28+H28","v":0},{"$f":"L28-(I28*0.2)","v":0},35,{"$f":"IF(F28=\"Y\",N28,0)","v":0},{"$f":"IF(E28=\"N\",0,(IF(F28=\"N\",0,1)))","v":0}]
[26,null,"N",{"$f":"YTD!P40","v":"X"},"N","N",null,null,null,null,null,null,{"$f":"G29+H29","v":0},{"$f":"L29-(I29*0.2)","v":0},35,{"$f":"IF(F29=\"Y\",N29,0)","v":0},{"$f":"IF(E29=\"N\",0,(IF(F29=\"N\",0,1)))","v":0}]
[null,null,null,"Totals",{"$f":"COUNTIF(E4:E29,\"Y\")","v":16},null,{"$f":"SUM(G4:G29)","v":28},{"$f":"SUM(H4:H29)","v":1},{"$f":"SUM(I4:I29)","v":0},{"$f":"MAX(J4:J29)","v":3.47},null,{"$f":"SUM(L4:L29)","v":44.23},{"$f":"SUM(M4:M29)","v":29},{"$f":"SUM(N4:N29)","v":44.23},null,{"$f":"SUM(P4:P29)","v":3.93},{"$f":"SUM(Q4:Q29)","v":7}]
[null,"Place","Team #","Partners",null,null,"Total Weight",null,"Place","Team #","Partners",null,null,"Total Weight",null,"NB Avg",{"$f":"IF(Q30=0,\"No Data\",P30/Q30)","v":0.5614285714285715}]
[null,"1st",{"$f":"Teams!$AD94","v":9},{"$f":"VLOOKUP($C32,$B$4:$D$29,3,0)","v":"Armand F."},"&",{"$f":"IF($B$4:$B$29=20,\"#N/A\",IF(COUNTIF($B$4:$B$29,$C32)=1,\"Alone\",LOOKUP(2,1/($B$4:$B$29=$C32),$D$4:$D$29)))","v":"Mike"},{"$f":"Teams!AE94","v":9.02},null,"4th",{"$f":"Teams!$AD97","v":2},{"$f":"VLOOKUP($J32,$B$4:$D$29,3,0)","v":"Jeff"},"&",{"$f":"IF($B$4:$B$29=20,\"#N/A\",IF(COUNTIF($B$4:$B$29,$J32)=1,\"Alone\",LOOKUP(2,1/($B$4:$B$29=$J32),$D$4:$D$29)))","v":"Alone"},{"$f":"Teams!AE97","v":6.3814285714285717}]
[null,"2nd",{"$f":"Teams!$AD95","v":7},{"$f":"VLOOKUP($C33,$B$4:$D$29,3,0)","v":"Jack"},"&",{"$f":"IF($B$4:$B$29=20,\"#N/A\",IF(COUNTIF($B$4:$B$29,$C33)=1,\"Alone\",LOOKUP(2,1/($B$4:$B$29=$C33),$D$4:$D$29)))","v":"Steve D"},{"$f":"Teams!AE95","v":8.48},null,"5th",{"$f":"Teams!$AD98","v":3},{"$f":"VLOOKUP($J33,$B$4:$D$29,3,0)","v":"Joe"},"&",{"$f":"IF($B$4:$B$29=20,\"#N/A\",IF(COUNTIF($B$4:$B$29,$J33)=1,\"Alone\",LOOKUP(2,1/($B$4:$B$29=$J33),$D$4:$D$29)))","v":"Tom"},{"$f":"Teams!AE98","v":5.54}]
[null,"3rd",{"$f":"Teams!$AD96","v":4},{"$f":"VLOOKUP($C34,$B$4:$D$29,3,0)","v":"Scott"},"&",{"$f":"IF($B$4:$B$29=20,\"#N/A\",IF(COUNTIF($B$4:$B$29,$C34)=1,\"Alone\",LOOKUP(2,1/($B$4:$B$29=$C34),$D$4:$D$29)))","v":"Alone"},{"$f":"Teams!AE96","v":7.3614285714285712},null,"6th",{"$f":"Teams!$AD99","v":5},{"$f":"VLOOKUP($J34,$B$4:$D$29,3,0)","v":"Bill"},"&",{"$f":"IF($B$4:$B$29=20,\"#N/A\",IF(COUNTIF($B$4:$B$29,$J34)=1,\"Alone\",LOOKUP(2,1/($B$4:$B$29=$J34),$D$4:$D$29)))","v":"Rich B"},{"$f":"Teams!AE99","v":4.4800000000000004}]

{"sheet":"Teams","index":8,"n_rows":120,"n_cols":31,"rows_kept":120,"cut":false,"hidden":false,"merged":[[31,16,31,27],[1,16,1,27],[61,16,61,27],[91,16,91,27],[1,0,1,11],[31,0,31,11],[61,0,61,11],[91,0,91,11]]}
[]
[{"$f":"YTD!L15","v":"Pachaug"},null,null,null,null,null,null,null,null,null,null,null,"Sort","Copy","Sort",null,{"$f":"YTD!L19","v":"CT River"},null,null,null,null,null,null,null,null,null,null,null,"Sort","Copy","Sort"]
["Team #","Alone?","Name","Net Wt",null,"Team #","Alone?","Name","Net Wt",null,"Totals","Rank","Rank","Team #","Tot Wt",null,"Team #","Alone?","Name","Net Wt",null,"Team #","Alone?","Name","Net Wt",null,"Totals","Rank","Rank","Team #","Tot Wt"]
[{"$f":"Pachuag!B4","v":2},{"$f":"Pachuag!C4","v":"N"},{"$f":"Pachuag!D4","v":"Armand F."},{"$f":"Pachuag!N4","v":4.28},null,0,"N","Jim B",0,null,{"$f":"IF(F4=20,0,IF(F4=F5,I4+I5,IF(G4=\"Y\",I4+I$30,0)))","v":0},{"$f":"IF(K4>0,RANK(K4,K$4:K$29,0),\"\")","v":""},1,4,14.5,null,{"$f":"'CT River'!B4","v":6},{"$f":"'CT River'!C4","v":"N"},{"$f":"'CT River'!D4","v":"Armand F."},{"$f":"'CT River'!N4","v":2.52},null,0,"N","Jim B",0,null,{"$f":"IF(V4=20,0,IF(V4=V5,Y4+Y5,IF(W4=\"Y\",Y4+Y$30,0)))","v":0},{"$f":"IF(AA4>0,RANK(AA4,AA$4:AA$29,0),\"\")","v":""},1,7,8.08]
[{"$f":"Pachuag!B5","v":8},{"$f":"Pachuag!C5","v":"N"},{"$f":"Pachuag!D5","v":"Bill"},{"$f":"Pachuag!N5","v":0},null,0,"N","Mike",0,null,{"$f":"IF(F5=20,0,IF(F5=F6,I5+I6,IF(G5=\"Y\",I5+I$30,0)))","v":0},{"$f":"IF(K5>0,RANK(K5,K$4:K$29,0),\"\")","v":""},2,5,8.24,null,{"$f":"'CT River'!B5","v":6},{"$f":"'CT River'!C5","v":"N"},{"$f":"'CT River'!D5","v":"Bill"},{"$f":"'CT River'!N5","v":2.2400000000000002},null,0,"N","X",0,null,{"$f":"IF(V5=20,0,IF(V5=V6,Y5+Y6,IF(W5=\"Y\",Y5+Y$30,0)))","v":0},{"$f":"IF(AA5>0,RANK(AA5,AA$4:AA$29,0),\"\")","v":""},2,2,7.253333333333333]
[{"$f":"Pachuag!B6","v":9},{"$f":"Pachuag!C6","v":"N"},{"$f":"Pachuag!D6","v":"Dean"},{"$f":"Pachuag!N6","v":0},null,0,"N","Vinny",0,null,0,"",3,2,7.87,null,{"$f":"'CT River'!B6","v":3},{"$f":"'CT River'!C6","v":"N"},{"$f":"'CT River'!D6","v":"Dean"},{"$f":"'CT River'!N6","v":0.73},null,0,"N","X",0,null,0,"",3,1,5.4499999999999993]
[{"$f":"Pachuag!B7","v":9},{"$f":"Pachuag!C7","v":"N"},{"$f":"Pachuag!D7","v":"Jack"},{"$f":"Pachuag!N7","v":1.47},null,0,"N","X",0,null,0,"",4,8,3.7824999999999998,null,{"$f":"'CT River'!B7","v":7},{"$f":"'CT River'!C7","v":"N"},{"$f":"'CT River'!D7","v":"Jack"},{"$f":"'CT River'!N7","v":5.14},null,0,"N","X",0,null,0,"",4,4,5.3633333333333333]
[{"$f":"Pachuag!B8","v":8},{"$f":"Pachuag!C8","v":"y"},{"$f":"Pachuag!D8","v":"Jason"},{"$f":"Pachuag!N8","v":1.08},null,0,"N","X",0,null,0,"",5,3,2.35,null,{"$f":"'CT River'!B8","v":2},{"$f":"'CT River'!C8","v":"Y"},{"$f":"'CT River'!D8","v":"Jason"},{"$f":"'CT River'!N8","v":5.88},null,0,"N","X",0,null,0,"",5,6,4.76]
[{"$f":"Pachuag!B9","v":7},{"$f":"Pachuag!C9","v":"N"},{"$f":"Pachuag!D9","v":"Jeff"},{"$f":"Pachuag!N9","v":0},null,0,"N","X",0,null,0,"",6,9,1.47,null,{"$f":"'CT River'!B9","v":5},{"$f":"'CT River'!C9","v":"N"},{"$f":"'CT River'!D9","v":"Jeff"},{"$f":"'CT River'!N9","v":2.81},null,0,"N","X",0,null,0,"",6,9,4.45]
[{"$f":"Pachuag!B10","v":0},{"$f":"Pachuag!C10","v":"N"},{"$f":"Pachuag!D10","v":"Jim B"},{"$f":"Pachuag!N10","v":0},null,0,"N","X",0,null,0,"",7,6,1.38,null,{"$f":"'CT River'!B10","v":0},{"$f":"'CT River'!C10","v":"N"},{"$f":"'CT River'!D10","v":"Jim B"},{"$f":"'CT River'!N10","v":0},null,1,"N","Kevin",2.61,null,5.4499999999999993,3,7,10,4.22]
[{"$f":"Pachuag!B11","v":7},{"$f":"Pachuag!C11","v":"N"},{"$f":"Pachuag!D11","v":"Jim H"},{"$f":"Pachuag!N11","v":1.08},null,0,"N","X",0,null,0,"",8,1,1.17,null,{"$f":"'CT River'!B11","v":9},{"$f":"'CT River'!C11","v":"N"},{"$f":"'CT River'!D11","v":"Jim H"},{"$f":"'CT River'!N11","v":0},null,1,"N","Rich T",2.84,null,0,"",8,5,2.81]
[{"$f":"Pachuag!B12","v":6},{"$f":"Pachuag!C12","v":"N"},{"$f":"Pachuag!D12","v":"Joe"},{"$f":"Pachuag!N12","v":0},null,1,"N","Rich B",1.17,null,1.17,8,9,7,1.08,null,{"$f":"'CT River'!B12","v":8},{"$f":"'CT River'!C12","v":"N"},{"$f":"'CT River'!D12","v":"Joe"},{"$f":"'CT River'!N12","v":0},null,2,"Y","Jason",5.88,null,7.253333333333333,2,9,11,1.03]
[{"$f":"Pachuag!B13","v":4},{"$f":"Pachuag!C13","v":"N"},{"$f":"Pachuag!D13","v":"Kevin"},{"$f":"Pachuag!N13","v":6.76},null,1,"N","Tom",0,null,0,"",9,8,1.08,null,{"$f":"'CT River'!B13","v":1},{"$f":"'CT River'!C13","v":"N"},{"$f":"'CT River'!D13","v":"Kevin"},{"$f":"'CT River'!N13","v":2.61},null,3,"N","Dean",0.73,null,0.73,10,10,3,0.73]
[{"$f":"Pachuag!B14","v":0},{"$f":"Pachuag!C14","v":"N"},{"$f":"Pachuag!D14","v":"Mike"},{"$f":"Pachuag!N14","v":0},null,2,"N","Armand F.",4.28,null,7.87,3,"",0,0,null,{"$f":"'CT River'!B14","v":11},{"$f":"'CT River'!C14","v":"N"},{"$f":"'CT River'!D14","v":"Mike"},{"$f":"'CT River'!N14","v":1.03},null,3,"N","Vinny",0,null,0,"","",0,0]
[{"$f":"Pachuag!B15","v":3},{"$f":"Pachuag!C15","v":"N"},{"$f":"Pachuag!D15","v":"Morrie"},{"$f":"Pachuag!N15","v":0.64},null,2,"N","Steve S",3.59,null,0,"","",0,0,null,{"$f":"'CT River'!B15","v":8},{"$f":"'CT River'!C15","v":"N"},{"$f":"'CT River'!D15","v":"Morrie"},{"$f":"'CT River'!N15","v":0},null,4,"Y","Ron",3.99,null,5.3633333333333333,4,"",0,0]
[{"$f":"Pachuag!B16","v":4},{"$f":"Pachuag!C16","v":"N"},{"$f":"Pachuag!D16","v":"Pete"},{"$f":"Pachuag!N16","v":7.74},null,3,"N","Morrie",0.64,null,2.35,5,"",0,0,null,{"$f":"'CT River'!B16","v":5},{"$f":"'CT River'!C16","v":"N"},{"$f":"'CT River'!D16","v":"Pete"},{"$f":"'CT River'!N16","v":0},null,5,"N","Jeff",2.81,null,2.81,8,"",0,0]
[{"$f":"Pachuag!B17","v":1},{"$f":"Pachuag!C17","v":"N"},{"$f":"Pachuag!D17","v":"Rich B"},{"$f":"Pachuag!N17","v":1.17},null,3,"N","Rich T",1.71,null,0,"","",0,0,null,{"$f":"'CT River'!B17","v":9},{"$f":"'CT River'!C17","v":"N"},{"$f":"'CT River'!D17","v":"Rich B"},{"$f":"'CT River'!N17","v":4.45},null,5,"N","Pete",0,null,0,"","",0,0]
[{"$f":"Pachuag!B18","v":3},{"$f":"Pachuag!C18","v":"N"},{"$f":"Pachuag!D18","v":"Rich T"},{"$f":"Pachuag!N18","v":1.71},null,4,"N","Kevin",6.76,null,14.5,1,"",0,0,null,{"$f":"'CT River'!B18","v":1},{"$f":"'CT River'!C18","v":"N"},{"$f":"'CT River'!D18","v":"Rich T"},{"$f":"'CT River'!N18","v":2.84},null,6,"N","Armand F.",2.52,null,4.76,5,"",0,0]
[{"$f":"Pachuag!B19","v":6},{"$f":"Pachuag!C19","v":"N"},{"$f":"Pachuag!D19","v":"Ron"},{"$f":"Pachuag!N19","v":1.38},null,4,"N","Pete",7.74,null,0,"","",0,0,null,{"$f":"'CT River'!B19","v":4},{"$f":"'CT River'!C19","v":"Y"},{"$f":"'CT River'!D19","v":"Ron"},{"$f":"'CT River'!N19","v":3.99},null,6,"N","Bill",2.2400000000000002,null,0,"","",0,0]
[{"$f":"Pachuag!B20","v":5},{"$f":"Pachuag!C20","v":"N"},{"$f":"Pachuag!D20","v":"Scott"},{"$f":"Pachuag!N20","v":4.8600000000000003},null,5,"N","Scott",4.8600000000000003,null,8.24,2,"",0,0,null,{"$f":"'CT River'!B20","v":7},{"$f":"'CT River'!C20","v":"N"},{"$f":"'CT River'!D20","v":"Scott"},{"$f":"'CT River'!N20","v":2.94},null,7,"N","Jack",5.14,null,8.08,1,"",1,0]
[{"$f":"Pachuag!B21","v":5},{"$f":"Pachuag!C21","v":"N"},{"$f":"Pachuag!D21","v":"Steve D"},{"$f":"Pachuag!N21","v":3.38},null,5,"N","Steve D",3.38,null,0,"","",0,0,null,{"$f":"'CT River'!B21","v":10},{"$f":"'CT River'!C21","v":"N"},{"$f":"'CT River'!D21","v":"Steve D"},{"$f":"'CT River'!N21","v":3.11},null,7,"N","Scott",2.94,null,0,"","",3,0]
[{"$f":"Pachuag!B22","v":2},{"$f":"Pachuag!C22","v":"N"},{"$f":"Pachuag!D22","v":"Steve S"},{"$f":"Pachuag!N22","v":3.59},null,6,"N","Joe",0,null,1.38,7,"",1,0,null,{"$f":"'CT River'!B22","v":10},{"$f":"'CT River'!C22","v":"N"},{"$f":"'CT River'!D22","v":"Steve S"},{"$f":"'CT River'!N22","v":1.1100000000000001},null,8,"N","Joe",0,null,0,"","",5,0]
[{"$f":"Pachuag!B23","v":1},{"$f":"Pachuag!C23","v":"N"},{"$f":"Pachuag!D23","v":"Tom"},{"$f":"Pachuag!N23","v":0},null,6,"N","Ron",1.38,null,0,"","",2,0,null,{"$f":"'CT River'!B23","v":11},{"$f":"'CT River'!C23","v":"N"},{"$f":"'CT River'!D23","v":"Tom"},{"$f":"'CT River'!N23","v":0},null,8,"N","Morrie",0,null,0,"","",6,0]
[{"$f":"Pachuag!B24","v":0},{"$f":"Pachuag!C24","v":"N"},{"$f":"Pachuag!D24","v":"Vinny"},{"$f":"Pachuag!N24","v":0},null,7,"N","Jeff",0,null,1.08,9,"",3,0,null,{"$f":"'CT River'!B24","v":3},{"$f":"'CT River'!C24","v":"N"},{"$f":"'CT River'!D24","v":"Vinny"},{"$f":"'CT River'!N24","v":0},null,9,"N","Jim H",0,null,4.45,6,"",7,0]
[{"$f":"Pachuag!B25","v":0},{"$f":"Pachuag!C25","v":"N"},{"$f":"Pachuag!D25","v":"X"},{"$f":"Pachuag!N25","v":0},null,7,"N","Jim H",1.08,null,0,"","",4,0,null,{"$f":"'CT River'!B25","v":0},{"$f":"'CT River'!C25","v":"N"},{"$f":"'CT River'!D25","v":"X"},{"$f":"'CT River'!N25","v":0},null,9,"N","Rich B",4.45,null,0,"","",8,0]
[{"$f":"Pachuag!B26","v":0},{"$f":"Pachuag!C26","v":"N"},{"$f":"Pachuag!D26","v":"X"},{"$f":"Pachuag!N26","v":0},null,8,"N","Bill",0,null,1.08,9,"",5,0,null,{"$f":"'CT River'!B26","v":0},{"$f":"'CT River'!C26","v":"N"},{"$f":"'CT River'!D26","v":"X"},{"$f":"'CT River'!N26","v":0},null,10,"N","Steve D",3.11,null,4.22,7,"",8,0]
[{"$f":"Pachuag!B27","v":0},{"$f":"Pachuag!C27","v":"N"},{"$f":"Pachuag!D27","v":"X"},{"$f":"Pachuag!N27","v":0},null,8,"y","Jason",1.08,null,3.7824999999999998,4,"",6,0,null,{"$f":"'CT River'!B27","v":0},{"$f":"'CT River'!C27","v":"N"},{"$f":"'CT River'!D27","v":"X"},{"$f":"'CT River'!N27","v":0},null,10,"N","Steve S",1.1100000000000001,null,0,"","",9,0]
[{"$f":"Pachuag!B28","v":0},{"$f":"Pachuag!C28","v":"N"},{"$f":"Pachuag!D28","v":"X"},{"$f":"Pachuag!N28","v":0},null,9,"N","Dean",0,null,1.47,6,"",7,0,null,{"$f":"'CT River'!B28","v":0},{"$f":"'CT River'!C28","v":"N"},{"$f":"'CT River'!D28","v":"X"},{"$f":"'CT River'!N28","v":0},null,11,"N","Mike",1.03,null,1.03,9,"",10,0]
[{"$f":"Pachuag!B29","v":0},{"$f":"Pachuag!C29","v":"N"},{"$f":"Pachuag!D29","v":"X"},{"$f":"Pachuag!N29","v":0},null,9,"N","Jack",1.47,null,0,"","",9,0,null,{"$f":"'CT River'!B29","v":0},{"$f":"'CT River'!C29","v":"N"},{"$f":"'CT River'!D29","v":"X"},{"$f":"'CT River'!N29","v":0},null,11,"N","Tom",0,null,0,"","",11,0]
[null,"Macro","CTL+M","Teams",1,null,null,"NB Avg",{"$f":"Pachuag!Q31","v":2.7024999999999997},null,null,null,null,null,null,null,null,"Macro","CTL+Y","Teams",5,null,null,"NB Avg",{"$f":"'CT River'!Q31","v":1.3733333333333333}]
[]
[{"$f":"YTD!L16","v":"Zoar"},null,null,null,null,null,null,null,null,null,null,null,"Sort","Copy","Sort",null,{"$f":"YTD!L20","v":"Hamilton"},null,null,null,null,null,null,null,null,null,null,null,"Sort","Copy","Sort"]
["Team #","Alone?","Name","Net Wt",null,"Team #","Alone?","Name","Net Wt",null,"Totals","Rank","Rank","Team #","Tot Wt",null,"Team #","Alone?","Name","Net Wt",null,"Team #","Alone?","Name","Net Wt",null,"Totals","Rank","Rank","Team #","Tot Wt"]
[{"$f":"Zoar!B4","v":3},{"$f":"Zoar!C4","v":"N"},{"$f":"Zoar!D4","v":"Armand F."},{"$f":"Zoar!N4","v":3.35},null,0,"N","Bill",0,null,{"$f":"IF(F34=20,0,IF(F34=F35,I34+I35,IF(G34=\"Y\",I34+I$60,0)))","v":0},{"$f":"IF(K34>0,RANK(K34,K$34:K$59,0),\"\")","v":""},1,4,12.99,null,{"$f":"Hamilton!B4","v":7},{"$f":"Hamilton!C4","v":"N"},{"$f":"Hamilton!D4","v":"Armand F."},{"$f":"Hamilton!N4","v":6.02},null,0,"N","Dean",0,null,{"$f":"IF(V34=20,0,IF(V34=V35,Y34+Y35,IF(W34=\"Y\",Y34+Y$60,0)))","v":0},{"$f":"IF(AA34>0,RANK(AA34,AA$34:AA$59,0),\"\")","v":""},1,6,13.989999999999998]
[{"$f":"Zoar!B5","v":0},{"$f":"Zoar!C5","v":"N"},{"$f":"Zoar!D5","v":"Bill"},{"$f":"Zoar!N5","v":0},null,0,"N","Vinny",0,null,{"$f":"IF(F35=20,0,IF(F35=F36,I35+I36,IF(G35=\"Y\",I35+I$60,0)))","v":0},{"$f":"IF(K35>0,RANK(K35,K$34:K$59,0),\"\")","v":""},2,2,8.5777777777777775,null,{"$f":"Hamilton!B5","v":5},{"$f":"Hamilton!C5","v":"N"},{"$f":"Hamilton!D5","v":"Bill"},{"$f":"Hamilton!N5","v":3.65},null,0,"N","Jim H",0,null,{"$f":"IF(V35=20,0,IF(V35=V36,Y35+Y36,IF(W35=\"Y\",Y35+$Y$60,0)))","v":0},{"$f":"IF(AA35>0,RANK(AA35,AA$34:AA$59,0),\"\")","v":""},2,7,13.059999999999999]
[{"$f":"Zoar!B6","v":6},{"$f":"Zoar!C6","v":"N"},{"$f":"Zoar!D6","v":"Dean"},{"$f":"Zoar!N6","v":3.55},null,0,"N","X",0,null,0,"",3,3,8.17,null,{"$f":"Hamilton!B6","v":0},{"$f":"Hamilton!C6","v":"N"},{"$f":"Hamilton!D6","v":"Dean"},{"$f":"Hamilton!N6","v":0},null,0,"N","X",0,null,0,"",3,10,11.553750000000001]
[{"$f":"Zoar!B7","v":10},{"$f":"Zoar!C7","v":"N"},{"$f":"Zoar!D7","v":"Jack"},{"$f":"Zoar!N7","v":0},null,0,"N","X",0,null,0,"",4,7,7.6899999999999995,null,{"$f":"Hamilton!B7","v":9},{"$f":"Hamilton!C7","v":"N"},{"$f":"Hamilton!D7","v":"Jack"},{"$f":"Hamilton!N7","v":4.12},null,0,"N","X",0,null,0,"",4,5,10.18]
[{"$f":"Zoar!B8","v":7},{"$f":"Zoar!C8","v":"N"},{"$f":"Zoar!D8","v":"Jason"},{"$f":"Zoar!N8","v":4.0599999999999996},null,0,"N","X",0,null,0,"",5,6,7.4499999999999993,null,{"$f":"Hamilton!B8","v":1},{"$f":"Hamilton!C8","v":"N"},{"$f":"Hamilton!D8","v":"Jason"},{"$f":"Hamilton!N8","v":3.15},null,0,"N","X",0,null,0,"",5,2,7.95]
[{"$f":"Zoar!B9","v":9},{"$f":"Zoar!C9","v":"N"},{"$f":"Zoar!D9","v":"Jeff"},{"$f":"Zoar!N9","v":5.36},null,0,"N","X",0,null,0,"",6,1,5.7399999999999993,null,{"$f":"Hamilton!B9","v":10},{"$f":"Hamilton!C9","v":"Y"},{"$f":"Hamilton!D9","v":"Jeff"},{"$f":"Hamilton!N9","v":7.09},null,0,"N","X",0,null,0,"",6,3,7.31]
[{"$f":"Zoar!B10","v":4},{"$f":"Zoar!C10","v":"N"},{"$f":"Zoar!D10","v":"Jim B"},{"$f":"Zoar!N10","v":5.55},null,0,"N","X",0,null,0,"",7,9,5.36,null,{"$f":"Hamilton!B10","v":4},{"$f":"Hamilton!C10","v":"N"},{"$f":"Hamilton!D10","v":"Jim B"},{"$f":"Hamilton!N10","v":3.53},null,0,"N","X",0,null,0,"",7,9,6.9399999999999995]
[{"$f":"Zoar!B11","v":3},{"$f":"Zoar!C11","v":"N"},{"$f":"Zoar!D11","v":"Jim H"},{"$f":"Zoar!N11","v":4.82},null,1,"N","Scott",0.89,null,5.7399999999999993,6,8,5,4.9400000000000004,null,{"$f":"Hamilton!B11","v":0},{"$f":"Hamilton!C11","v":"N"},{"$f":"Hamilton!D11","v":"Jim H"},{"$f":"Hamilton!N11","v":0},null,1,"N","Jason",3.15,null,4.08,10,8,8,6.88]
[{"$f":"Zoar!B12","v":9},{"$f":"Zoar!C12","v":"N"},{"$f":"Zoar!D12","v":"Joe"},{"$f":"Zoar!N12","v":0},null,1,"N","Steve S",4.8499999999999996,null,0,"",9,8,3.32,null,{"$f":"Hamilton!B12","v":8},{"$f":"Hamilton!C12","v":"N"},{"$f":"Hamilton!D12","v":"Joe"},{"$f":"Hamilton!N12","v":4.34},null,1,"N","Rich T",0.93,null,0,"",9,4,6.83]
[{"$f":"Zoar!B13","v":2},{"$f":"Zoar!C13","v":"Y"},{"$f":"Zoar!D13","v":"Kevin"},{"$f":"Zoar!N13","v":5.54},null,2,"Y","Kevin",5.54,null,8.5777777777777775,2,10,10,0.79,null,{"$f":"Hamilton!B13","v":2},{"$f":"Hamilton!C13","v":"N"},{"$f":"Hamilton!D13","v":"Kevin"},{"$f":"Hamilton!N13","v":3.91},null,2,"N","Kevin",3.91,null,7.95,5,10,1,4.08]
[{"$f":"Zoar!B14","v":5},{"$f":"Zoar!C14","v":"N"},{"$f":"Zoar!D14","v":"Mike"},{"$f":"Zoar!N14","v":4.9400000000000004},null,3,"N","Armand F.",3.35,null,8.17,3,"",0,0,null,{"$f":"Hamilton!B14","v":2},{"$f":"Hamilton!C14","v":"N"},{"$f":"Hamilton!D14","v":"Mike"},{"$f":"Hamilton!N14","v":4.04},null,2,"N","Mike",4.04,null,0,"","",0,0]
[{"$f":"Zoar!B15","v":5},{"$f":"Zoar!C15","v":"N"},{"$f":"Zoar!D15","v":"Morrie"},{"$f":"Zoar!N15","v":0},null,3,"N","Jim H",4.82,null,0,"","",0,0,null,{"$f":"Hamilton!B15","v":9},{"$f":"Hamilton!C15","v":"N"},{"$f":"Hamilton!D15","v":"Morrie"},{"$f":"Hamilton!N15","v":2.82},null,3,"N","Steve S",1.93,null,7.31,6,"",0,0]
[{"$f":"Zoar!B16","v":7},{"$f":"Zoar!C16","v":"N"},{"$f":"Zoar!D16","v":"Pete"},{"$f":"Zoar!N16","v":3.63},null,4,"N","Jim B",5.55,null,12.99,1,"",0,0,null,{"$f":"Hamilton!B16","v":7},{"$f":"Hamilton!C16","v":"N"},{"$f":"Hamilton!D16","v":"Pete"},{"$f":"Hamilton!N16","v":7.04},null,3,"N","Tom",5.38,null,0,"","",0,0]
[{"$f":"Zoar!B17","v":8},{"$f":"Zoar!C17","v":"N"},{"$f":"Zoar!D17","v":"Rich B"},{"$f":"Zoar!N17","v":3.32},null,4,"N","Steve D",7.44,null,0,"","",0,0,null,{"$f":"Hamilton!B17","v":8},{"$f":"Hamilton!C17","v":"N"},{"$f":"Hamilton!D17","v":"Rich B"},{"$f":"Hamilton!N17","v":2.54},null,4,"N","Jim B",3.53,null,6.83,9,"",0,0]
[{"$f":"Zoar!B18","v":8},{"$f":"Zoar!C18","v":"N"},{"$f":"Zoar!D18","v":"Rich T"},{"$f":"Zoar!N18","v":0},null,5,"N","Mike",4.9400000000000004,null,4.9400000000000004,8,"",0,0,null,{"$f":"Hamilton!B18","v":1},{"$f":"Hamilton!C18","v":"N"},{"$f":"Hamilton!D18","v":"Rich T"},{"$f":"Hamilton!N18","v":0.93},null,4,"N","Steve D",3.3,null,0,"","",0,0]
[{"$f":"Zoar!B19","v":10},{"$f":"Zoar!C19","v":"N"},{"$f":"Zoar!D19","v":"Ron"},{"$f":"Zoar!N19","v":0.79},null,5,"N","Morrie",0,null,0,"","",0,0,null,{"$f":"Hamilton!B19","v":6},{"$f":"Hamilton!C19","v":"N"},{"$f":"Hamilton!D19","v":"Ron"},{"$f":"Hamilton!N19","v":6.93},null,5,"N","Bill",3.65,null,10.18,4,"",0,0]
[{"$f":"Zoar!B20","v":1},{"$f":"Zoar!C20","v":"N"},{"$f":"Zoar!D20","v":"Scott"},{"$f":"Zoar!N20","v":0.89},null,6,"N","Dean",3.55,null,7.4499999999999993,5,"",0,0,null,{"$f":"Hamilton!B20","v":5},{"$f":"Hamilton!C20","v":"N"},{"$f":"Hamilton!D20","v":"Scott"},{"$f":"Hamilton!N20","v":6.53},null,5,"N","Scott",6.53,null,0,"","",0,0]
[{"$f":"Zoar!B21","v":4},{"$f":"Zoar!C21","v":"N"},{"$f":"Zoar!D21","v":"Steve D"},{"$f":"Zoar!N21","v":7.44},null,6,"N","Tom",3.9,null,0,"","",1,0,null,{"$f":"Hamilton!B21","v":4},{"$f":"Hamilton!C21","v":"N"},{"$f":"Hamilton!D21","v":"Steve D"},{"$f":"Hamilton!N21","v":3.3},null,6,"N","Ron",6.93,null,13.989999999999998,1,"",1,0]
[{"$f":"Zoar!B22","v":1},{"$f":"Zoar!C22","v":"N"},{"$f":"Zoar!D22","v":"Steve S"},{"$f":"Zoar!N22","v":4.8499999999999996},null,7,"N","Jason",4.0599999999999996,null,7.6899999999999995,4,"",3,0,null,{"$f":"Hamilton!B22","v":3},{"$f":"Hamilton!C22","v":"N"},{"$f":"Hamilton!D22","v":"Steve S"},{"$f":"Hamilton!N22","v":1.93},null,6,"N","Vinny",7.06,null,0,"","",2,0]
[{"$f":"Zoar!B23","v":6},{"$f":"Zoar!C23","v":"N"},{"$f":"Zoar!D23","v":"Tom"},{"$f":"Zoar!N23","v":3.9},null,7,"N","Pete",3.63,null,0,"","",4,0,null,{"$f":"Hamilton!B23","v":3},{"$f":"Hamilton!C23","v":"N"},{"$f":"Hamilton!D23","v":"Tom"},{"$f":"Hamilton!N23","v":5.38},null,7,"N","Armand F.",6.02,null,13.059999999999999,2,"",3,0]
[{"$f":"Zoar!B24","v":0},{"$f":"Zoar!C24","v":"N"},{"$f":"Zoar!D24","v":"Vinny"},{"$f":"Zoar!N24","v":0},null,8,"N","Rich B",3.32,null,3.32,9,"",5,0,null,{"$f":"Hamilton!B24","v":6},{"$f":"Hamilton!C24","v":"N"},{"$f":"Hamilton!D24","v":"Vinny"},{"$f":"Hamilton!N24","v":7.06},null,7,"N","Pete",7.04,null,0,"","",4,0]
[{"$f":"Zoar!B25","v":0},{"$f":"Zoar!C25","v":"N"},{"$f":"Zoar!D25","v":"X"},{"$f":"Zoar!N25","v":0},null,8,"N","Rich T",0,null,0,"","",6,0,null,{"$f":"Hamilton!B25","v":0},{"$f":"Hamilton!C25","v":"N"},{"$f":"Hamilton!D25","v":"X"},{"$f":"Hamilton!N25","v":0},null,8,"N","Joe",4.34,null,6.88,8,"",5,0]
[{"$f":"Zoar!B26","v":0},{"$f":"Zoar!C26","v":"N"},{"$f":"Zoar!D26","v":"X"},{"$f":"Zoar!N26","v":0},null,9,"N","Jeff",5.36,null,5.36,7,"",7,0,null,{"$f":"Hamilton!B26","v":0},{"$f":"Hamilton!C26","v":"N"},{"$f":"Hamilton!D26","v":"X"},{"$f":"Hamilton!N26","v":0},null,8,"N","Rich B",2.54,null,0,"","",6,0]
[{"$f":"Zoar!B27","v":0},{"$f":"Zoar!C27","v":"N"},{"$f":"Zoar!D27","v":"X"},{"$f":"Zoar!N27","v":0},null,9,"N","Joe",0,null,0,"","",8,0,null,{"$f":"Hamilton!B27","v":0},{"$f":"Hamilton!C27","v":"N"},{"$f":"Hamilton!D27","v":"X"},{"$f":"Hamilton!N27","v":0},null,9,"N","Jack",4.12,null,6.9399999999999995,7,"",7,0]
[{"$f":"Zoar!B28","v":0},{"$f":"Zoar!C28","v":"N"},{"$f":"Zoar!D28","v":"X"},{"$f":"Zoar!N28","v":0},null,10,"N","Jack",0,null,0.79,10,"",9,0,null,{"$f":"Hamilton!B28","v":0},{"$f":"Hamilton!C28","v":"N"},{"$f":"Hamilton!D28","v":"X"},{"$f":"Hamilton!N28","v":0},null,9,"N","Morrie",2.82,null,0,"","",8,0]
[{"$f":"Zoar!B29","v":0},{"$f":"Zoar!C29","v":"N"},{"$f":"Zoar!D29","v":"X"},{"$f":"Zoar!N29","v":0},null,10,"N","Ron",0.79,null,0,"","",10,0,null,{"$f":"Hamilton!B29","v":0},{"$f":"Hamilton!C29","v":"N"},{"$f":"Hamilton!D29","v":"X"},{"$f":"Hamilton!N29","v":0},null,10,"Y","Jeff",7.09,null,11.553750000000001,3,"",9,0]
[null,"Macro","CTL+D","Teams",2,null,null,"NB Avg",{"$f":"Zoar!Q31","v":3.0377777777777775},null,null,null,null,null,null,null,null,"Macro","CTL+T","Teams",6,null,null,"NB Avg",{"$f":"Hamilton!Q31","v":4.4637500000000001}]
[]
[{"$f":"YTD!L17","v":"Quaddick"},null,null,null,null,null,null,null,null,null,null,null,"Sort","Copy","Sort",null,{"$f":"YTD!L21","v":"Lilly"},null,null,null,null,null,null,null,null,null,null,null,"Sort","Copy","Sort"]
["Team #","Alone?","Name","Net Wt",null,"Team #","Alone?","Name","Net Wt",null,"Totals","Rank","Rank","Team #","Tot Wt",null,"Team #","Alone?","Name","Net Wt",null,"Team #","Alone?","Name","Net Wt",null,"Totals","Rank","Rank","Team #","Tot Wt"]
[{"$f":"Quaddic!B4","v":9},{"$f":"Quaddic!C4","v":"N"},{"$f":"Quaddic!D4","v":"Armand F."},{"$f":"Quaddic!N4","v":4.54},null,0,"N","X",0,null,{"$f":"IF(F64=20,0,IF(F64=F65,I64+I65,IF(G64=\"Y\",I64+I$90,0)))","v":0},{"$f":"IF(K64>0,RANK(K64,K$64:K$89,0),\"\")","v":""},1,3,11.47,null,{"$f":"Lilly!B4","v":2},{"$f":"Lilly!C4","v":"N"},{"$f":"Lilly!D4","v":"Armand F."},{"$f":"Lilly!N4","v":5.74},null,0,"N","Vinny",0,null,{"$f":"IF(V64=20,0,IF(V64=V65,Y64+Y65,IF(W64=\"Y\",Y64+Y$90,0)))","v":0},{"$f":"IF(AA64>0,RANK(AA64,AA$64:AA$89,0),\"\")","v":""},1,2,13.73]
[{"$f":"Quaddic!B5","v":11},{"$f":"Quaddic!C5","v":"N"},{"$f":"Quaddic!D5","v":"Bill"},{"$f":"Quaddic!N5","v":0},null,0,"N","X",0,null,{"$f":"IF(F65=20,0,IF(F65=F66,I65+I66,IF(G65=\"Y\",I65+I$90,0)))","v":0},{"$f":"IF(K65>0,RANK(K65,K$64:K$89,0),\"\")","v":""},2,1,9.84,null,{"$f":"Lilly!B5","v":10},{"$f":"Lilly!C5","v":"N"},{"$f":"Lilly!D5","v":"Bill"},{"$f":"Lilly!N5","v":4.08},null,0,"N","X",0,null,{"$f":"IF(V65=20,0,IF(V65=V66,Y65+Y66,IF(W65=\"Y\",Y65+Y$90,0)))","v":0},{"$f":"IF(AA65>0,RANK(AA65,AA$64:AA$89,0),\"\")","v":""},2,3,12.98]
[{"$f":"Quaddic!B6","v":7},{"$f":"Quaddic!C6","v":"N"},{"$f":"Quaddic!D6","v":"Dean"},{"$f":"Quaddic!N6","v":2.85},null,0,"N","X",0,null,0,"",3,4,9.44,null,{"$f":"Lilly!B6","v":8},{"$f":"Lilly!C6","v":"N"},{"$f":"Lilly!D6","v":"Dean"},{"$f":"Lilly!N6","v":7.17},null,0,"N","X",0,null,0,"",3,10,12.46]
[{"$f":"Quaddic!B7","v":6},{"$f":"Quaddic!C7","v":"N"},{"$f":"Quaddic!D7","v":"Jack"},{"$f":"Quaddic!N7","v":3.04},null,0,"N","X",0,null,0,"",4,10,9.42,null,{"$f":"Lilly!B7","v":9},{"$f":"Lilly!C7","v":"N"},{"$f":"Lilly!D7","v":"Jack"},{"$f":"Lilly!N7","v":6.18},null,0,"N","X",0,null,0,"",4,8,12.01]
[{"$f":"Quaddic!B8","v":8},{"$f":"Quaddic!C8","v":"Y"},{"$f":"Quaddic!D8","v":"Jason"},{"$f":"Quaddic!N8","v":5.62},null,0,"N","X",0,null,0,"",5,7,9.3000000000000007,null,{"$f":"Lilly!B8","v":5},{"$f":"Lilly!C8","v":"N"},{"$f":"Lilly!D8","v":"Jason"},{"$f":"Lilly!N8","v":7.79},null,0,"N","X",0,null,0,"",5,9,11.12]
[{"$f":"Quaddic!B9","v":6},{"$f":"Quaddic!C9","v":"N"},{"$f":"Quaddic!D9","v":"Jeff"},{"$f":"Quaddic!N9","v":6.19},null,1,"N","Jim B",3.11,null,9.84,2,6,6,9.23,null,{"$f":"Lilly!B9","v":2},{"$f":"Lilly!C9","v":"N"},{"$f":"Lilly!D9","v":"Jeff"},{"$f":"Lilly!N9","v":7.9899999999999993},null,0,"N","X",0,null,0,"",6,1,10.29]
[{"$f":"Quaddic!B10","v":1},{"$f":"Quaddic!C10","v":"N"},{"$f":"Quaddic!D10","v":"Jim B"},{"$f":"Quaddic!N10","v":3.11},null,1,"N","Tom",6.7299999999999995,null,0,"",7,8,8.9269999999999996,null,{"$f":"Lilly!B10","v":7},{"$f":"Lilly!C10","v":"N"},{"$f":"Lilly!D10","v":"Jim B"},{"$f":"Lilly!N10","v":0},null,1,"N","Kevin",8.25,null,10.29,6,7,5,8.81]
[{"$f":"Quaddic!B11","v":4},{"$f":"Quaddic!C11","v":"N"},{"$f":"Quaddic!D11","v":"Jim H"},{"$f":"Quaddic!N11","v":4.3899999999999997},null,2,"N","Morrie",2.06,null,2.06,11,8,9,8.91,null,{"$f":"Lilly!B11","v":4},{"$f":"Lilly!C11","v":"N"},{"$f":"Lilly!D11","v":"Jim H"},{"$f":"Lilly!N11","v":2.89},null,1,"N","Steve S",2.04,null,0,"",8,4,6.4399999999999995]
[{"$f":"Quaddic!B12","v":9},{"$f":"Quaddic!C12","v":"N"},{"$f":"Quaddic!D12","v":"Joe"},{"$f":"Quaddic!N12","v":4.37},null,2,"N","Steve S",0,null,0,"",9,11,3.43,null,{"$f":"Lilly!B12","v":3},{"$f":"Lilly!C12","v":"N"},{"$f":"Lilly!D12","v":"Joe"},{"$f":"Lilly!N12","v":5.54},null,2,"N","Armand F.",5.74,null,13.73,1,9,6,5.78]
[{"$f":"Quaddic!B13","v":10},{"$f":"Quaddic!C13","v":"N"},{"$f":"Quaddic!D13","v":"Kevin"},{"$f":"Quaddic!N13","v":4.88},null,3,"N","Rich T",4.6100000000000003,null,11.47,1,10,5,2.56,null,{"$f":"Lilly!B13","v":1},{"$f":"Lilly!C13","v":"N"},{"$f":"Lilly!D13","v":"Kevin"},{"$f":"Lilly!N13","v":8.25},null,2,"N","Jeff",7.9899999999999993,null,0,"",10,7,3.48]
[{"$f":"Quaddic!B14","v":5},{"$f":"Quaddic!C14","v":"N"},{"$f":"Quaddic!D14","v":"Mike"},{"$f":"Quaddic!N14","v":2.56},null,3,"N","Steve D",6.86,null,0,"",11,2,2.06,null,{"$f":"Lilly!B14","v":5},{"$f":"Lilly!C14","v":"N"},{"$f":"Lilly!D14","v":"Mike"},{"$f":"Lilly!N14","v":1.02},null,3,"N","Joe",5.54,null,12.98,2,"",0,0]
[{"$f":"Quaddic!B15","v":2},{"$f":"Quaddic!C15","v":"N"},{"$f":"Quaddic!D15","v":"Morrie"},{"$f":"Quaddic!N15","v":2.06},null,4,"N","Jim H",4.3899999999999997,null,9.44,3,"",0,0,null,{"$f":"Lilly!B15","v":10},{"$f":"Lilly!C15","v":"N"},{"$f":"Lilly!D15","v":"Morrie"},{"$f":"Lilly!N15","v":8.3800000000000008},null,3,"N","Steve D",7.44,null,0,"","",0,0]
[{"$f":"Quaddic!B16","v":7},{"$f":"Quaddic!C16","v":"N"},{"$f":"Quaddic!D16","v":"Pete"},{"$f":"Quaddic!N16","v":6.45},null,4,"N","Scott",5.05,null,0,"","",0,0,null,{"$f":"Lilly!B16","v":6},{"$f":"Lilly!C16","v":"N"},{"$f":"Lilly!D16","v":"Pete"},{"$f":"Lilly!N16","v":3.92},null,4,"N","Jim H",2.89,null,6.4399999999999995,8,"",0,0]
[{"$f":"Quaddic!B17","v":5},{"$f":"Quaddic!C17","v":"N"},{"$f":"Quaddic!D17","v":"Rich B"},{"$f":"Quaddic!N17","v":0},null,5,"N","Mike",2.56,null,2.56,10,"",0,0,null,{"$f":"Lilly!B17","v":9},{"$f":"Lilly!C17","v":"N"},{"$f":"Lilly!D17","v":"Rich B"},{"$f":"Lilly!N17","v":4.9399999999999995},null,4,"N","Tom",3.55,null,0,"","",0,0]
[{"$f":"Quaddic!B18","v":3},{"$f":"Quaddic!C18","v":"N"},{"$f":"Quaddic!D18","v":"Rich T"},{"$f":"Quaddic!N18","v":4.6100000000000003},null,5,"N","Rich B",0,null,0,"","",0,0,null,{"$f":"Lilly!B18","v":8},{"$f":"Lilly!C18","v":"N"},{"$f":"Lilly!D18","v":"Rich T"},{"$f":"Lilly!N18","v":4.84},null,5,"N","Jason",7.79,null,8.81,7,"",0,0]
[{"$f":"Quaddic!B19","v":11},{"$f":"Quaddic!C19","v":"N"},{"$f":"Quaddic!D19","v":"Ron"},{"$f":"Quaddic!N19","v":3.43},null,6,"N","Jack",3.04,null,9.23,6,"",0,0,null,{"$f":"Lilly!B19","v":7},{"$f":"Lilly!C19","v":"N"},{"$f":"Lilly!D19","v":"Ron"},{"$f":"Lilly!N19","v":3.48},null,5,"N","Mike",1.02,null,0,"","",0,0]
[{"$f":"Quaddic!B20","v":4},{"$f":"Quaddic!C20","v":"N"},{"$f":"Quaddic!D20","v":"Scott"},{"$f":"Quaddic!N20","v":5.05},null,6,"N","Jeff",6.19,null,0,"","",1,0,null,{"$f":"Lilly!B20","v":6},{"$f":"Lilly!C20","v":"N"},{"$f":"Lilly!D20","v":"Scott"},{"$f":"Lilly!N20","v":1.86},null,6,"N","Pete",3.92,null,5.78,9,"",1,0]
[{"$f":"Quaddic!B21","v":3},{"$f":"Quaddic!C21","v":"N"},{"$f":"Quaddic!D21","v":"Steve D"},{"$f":"Quaddic!N21","v":6.86},null,7,"N","Dean",2.85,null,9.3000000000000007,5,"",2,0,null,{"$f":"Lilly!B21","v":3},{"$f":"Lilly!C21","v":"N"},{"$f":"Lilly!D21","v":"Steve D"},{"$f":"Lilly!N21","v":7.44},null,6,"N","Scott",1.86,null,0,"","",2,0]
[{"$f":"Quaddic!B22","v":2},{"$f":"Quaddic!C22","v":"N"},{"$f":"Quaddic!D22","v":"Steve S"},{"$f":"Quaddic!N22","v":0},null,7,"N","Pete",6.45,null,0,"","",3,0,null,{"$f":"Lilly!B22","v":1},{"$f":"Lilly!C22","v":"N"},{"$f":"Lilly!D22","v":"Steve S"},{"$f":"Lilly!N22","v":2.04},null,7,"N","Jim B",0,null,3.48,10,"",3,0]
[{"$f":"Quaddic!B23","v":1},{"$f":"Quaddic!C23","v":"N"},{"$f":"Quaddic!D23","v":"Tom"},{"$f":"Quaddic!N23","v":6.7299999999999995},null,8,"Y","Jason",5.62,null,8.9269999999999996,7,"",4,0,null,{"$f":"Lilly!B23","v":4},{"$f":"Lilly!C23","v":"N"},{"$f":"Lilly!D23","v":"Tom"},{"$f":"Lilly!N23","v":3.55},null,7,"N","Ron",3.48,null,0,"","",4,0]
[{"$f":"Quaddic!B24","v":10},{"$f":"Quaddic!C24","v":"N"},{"$f":"Quaddic!D24","v":"Vinny"},{"$f":"Quaddic!N24","v":4.54},null,9,"N","Armand F.",4.54,null,8.91,8,"",5,0,null,{"$f":"Lilly!B24","v":0},{"$f":"Lilly!C24","v":"N"},{"$f":"Lilly!D24","v":"Vinny"},{"$f":"Lilly!N24","v":0},null,8,"N","Dean",7.17,null,12.01,4,"",5,0]
[{"$f":"Quaddic!B25","v":0},{"$f":"Quaddic!C25","v":"N"},{"$f":"Quaddic!D25","v":"X"},{"$f":"Quaddic!N25","v":0},null,9,"N","Joe",4.37,null,0,"","",6,0,null,{"$f":"Lilly!B25","v":0},{"$f":"Lilly!C25","v":"N"},{"$f":"Lilly!D25","v":"X"},{"$f":"Lilly!N25","v":0},null,8,"N","Rich T",4.84,null,0,"","",6,0]
[{"$f":"Quaddic!B26","v":0},{"$f":"Quaddic!C26","v":"N"},{"$f":"Quaddic!D26","v":"X"},{"$f":"Quaddic!N26","v":0},null,10,"N","Kevin",4.88,null,9.42,4,"",7,0,null,{"$f":"Lilly!B26","v":0},{"$f":"Lilly!C26","v":"N"},{"$f":"Lilly!D26","v":"X"},{"$f":"Lilly!N26","v":0},null,9,"N","Jack",6.18,null,11.12,5,"",7,0]
[{"$f":"Quaddic!B27","v":0},{"$f":"Quaddic!C27","v":"N"},{"$f":"Quaddic!D27","v":"X"},{"$f":"Quaddic!N27","v":0},null,10,"N","Vinny",4.54,null,0,"","",9,0,null,{"$f":"Lilly!B27","v":0},{"$f":"Lilly!C27","v":"N"},{"$f":"Lilly!D27","v":"X"},{"$f":"Lilly!N27","v":0},null,9,"N","Rich B",4.9399999999999995,null,0,"","",8,0]
[{"$f":"Quaddic!B28","v":0},{"$f":"Quaddic!C28","v":"N"},{"$f":"Quaddic!D28","v":"X"},{"$f":"Quaddic!N28","v":0},null,11,"N","Bill",0,null,3.43,9,"",10,0,null,{"$f":"Lilly!B28","v":0},{"$f":"Lilly!C28","v":"N"},{"$f":"Lilly!D28","v":"X"},{"$f":"Lilly!N28","v":0},null,10,"N","Bill",4.08,null,12.46,3,"",9,0]
[{"$f":"Quaddic!B29","v":0},{"$f":"Quaddic!C29","v":"N"},{"$f":"Quaddic!D29","v":"X"},{"$f":"Quaddic!N29","v":0},null,11,"N","Ron",3.43,null,0,"","",11,0,null,{"$f":"Lilly!B29","v":0},{"$f":"Lilly!C29","v":"N"},{"$f":"Lilly!D29","v":"X"},{"$f":"Lilly!N29","v":0},null,10,"N","Morrie",8.3800000000000008,null,0,"","",10,0]
[null,"Macro","CTL+H","Teams",3,null,null,"NB Avg",{"$f":"Quaddic!Q31","v":3.3069999999999999},null,null,null,null,null,null,null,null,"Macro","CTL+E","Teams",7,null,null,"NB Avg",{"$f":"Lilly!Q31","v":3.6249999999999991}]
[]
[{"$f":"YTD!L18","v":"Candlewood "},null,null,null,null,null,null,null,null,null,null,null,"Sort","Copy","Sort",null,{"$f":"YTD!L22","v":"Highland"},null,null,null,null,null,null,null,null,null,null,null,"Sort","Copy","Sort"]
["Team #","Alone?","Name","Net Wt",null,"Team #","Alone?","Name","Net Wt",null,"Totals","Rank","Rank","Team #","Tot Wt",null,"Team #","Alone?","Name","Net Wt",null,"Team #","Alone?","Name","Net Wt",null,"Totals","Rank","Rank","Team #","Tot Wt"]
[{"$f":"Candlewood!B4","v":1},{"$f":"Candlewood!C4","v":"N"},{"$f":"Candlewood!D4","v":"Armand F."},{"$f":"Candlewood!N4","v":7.49},null,0,"N","X",0,null,{"$f":"IF(F94=20,0,IF(F94=F95,I94+I95,IF(G94=\"Y\",I94+I$120,0)))","v":0},{"$f":"IF(K94>0,RANK(K94,K$94:K$119,0),\"\")","v":""},1,1,19.82,null,{"$f":"Highland!B4","v":9},{"$f":"Highland!C4","v":"N"},{"$f":"Highland!D4","v":"Armand F."},{"$f":"Highland!N4","v":7.23},null,0,"N","Dean",0,null,{"$f":"IF(V94=20,0,IF(V94=V95,Y94+Y95,IF(W94=\"Y\",Y94+Y$120,0)))","v":0},{"$f":"IF(AA94>0,RANK(AA94,AA$94:AA$119,0),\"\")","v":""},1,9,9.02]
[{"$f":"Candlewood!B5","v":4},{"$f":"Candlewood!C5","v":"N"},{"$f":"Candlewood!D5","v":"Bill"},{"$f":"Candlewood!N5","v":1.43},null,0,"N","X",0,null,{"$f":"IF(F95=20,0,IF(F95=F96,I95+I96,IF(G95=\"Y\",I95+I$120,0)))","v":0},{"$f":"IF(K95>0,RANK(K95,K$94:K$119,0),\"\")","v":""},2,5,15.790000000000001,null,{"$f":"Highland!B5","v":5},{"$f":"Highland!C5","v":"N"},{"$f":"Highland!D5","v":"Bill"},{"$f":"Highland!N5","v":1.03},null,0,"N","Jim B",0,null,{"$f":"IF(V95=20,0,IF(V95=V96,Y95+Y96,IF(W95=\"Y\",Y95+Y$120,0)))","v":0},{"$f":"IF(AA95>0,RANK(AA95,AA$94:AA$119,0),\"\")","v":""},2,7,8.48]
[{"$f":"Candlewood!B6","v":7},{"$f":"Candlewood!C6","v":"Y"},{"$f":"Candlewood!D6","v":"Dean"},{"$f":"Candlewood!N6","v":8.7799999999999994},null,0,"N","X",0,null,0,"",3,7,12.992999999999999,null,{"$f":"Highland!B6","v":0},{"$f":"Highland!C6","v":"N"},{"$f":"Highland!D6","v":"Dean"},{"$f":"Highland!N6","v":0},null,0,"N","Rich T",0,null,0,"",3,4,7.3614285714285712]
[{"$f":"Candlewood!B7","v":1},{"$f":"Candlewood!C7","v":"N"},{"$f":"Candlewood!D7","v":"Jack"},{"$f":"Candlewood!N7","v":12.33},null,0,"N","X",0,null,0,"",4,11,12.48,null,{"$f":"Highland!B7","v":7},{"$f":"Highland!C7","v":"N"},{"$f":"Highland!D7","v":"Jack"},{"$f":"Highland!N7","v":1.1100000000000001},null,0,"N","Ron",0,null,0,"",4,2,6.3814285714285717]
[{"$f":"Candlewood!B8","v":9},{"$f":"Candlewood!C8","v":"N"},{"$f":"Candlewood!D8","v":"Jason"},{"$f":"Candlewood!N8","v":2.89},null,0,"N","X",0,null,0,"",5,3,11.68,null,{"$f":"Highland!B8","v":8},{"$f":"Highland!C8","v":"N"},{"$f":"Highland!D8","v":"Jason"},{"$f":"Highland!N8","v":4.09},null,0,"N","Vinny",0,null,0,"",5,3,5.54]
[{"$f":"Candlewood!B9","v":4},{"$f":"Candlewood!C9","v":"N"},{"$f":"Candlewood!D9","v":"Jeff"},{"$f":"Candlewood!N9","v":8.0399999999999991},null,1,"N","Armand F.",7.49,null,19.82,1,6,6,10.92,null,{"$f":"Highland!B9","v":2},{"$f":"Highland!C9","v":"y"},{"$f":"Highland!D9","v":"Jeff"},{"$f":"Highland!N9","v":5.82},null,0,"N","X",0,null,0,"",6,5,4.4800000000000004]
[{"$f":"Candlewood!B10","v":3},{"$f":"Candlewood!C10","v":"N"},{"$f":"Candlewood!D10","v":"Jim B"},{"$f":"Candlewood!N10","v":3.41},null,1,"N","Jack",12.33,null,0,"",7,4,9.4699999999999989,null,{"$f":"Highland!B10","v":0},{"$f":"Highland!C10","v":"N"},{"$f":"Highland!D10","v":"Jim B"},{"$f":"Highland!N10","v":0},null,0,"N","X",0,null,0,"",7,8,4.09]
[{"$f":"Candlewood!B11","v":2},{"$f":"Candlewood!C11","v":"N"},{"$f":"Candlewood!D11","v":"Jim H"},{"$f":"Candlewood!N11","v":3.36},null,2,"N","Jim H",3.36,null,4.97,10,8,8,8.77,null,{"$f":"Highland!B11","v":1},{"$f":"Highland!C11","v":"N"},{"$f":"Highland!D11","v":"Jim H"},{"$f":"Highland!N11","v":0},null,0,"N","X",0,null,0,"","",0,0]
[{"$f":"Candlewood!B12","v":8},{"$f":"Candlewood!C12","v":"N"},{"$f":"Candlewood!D12","v":"Joe"},{"$f":"Candlewood!N12","v":2.2599999999999998},null,2,"N","Morrie",1.61,null,0,"",9,10,6.47,null,{"$f":"Highland!B12","v":3},{"$f":"Highland!C12","v":"N"},{"$f":"Highland!D12","v":"Joe"},{"$f":"Highland!N12","v":0},null,0,"N","X",0,null,0,"","",0,0]
[{"$f":"Candlewood!B13","v":3},{"$f":"Candlewood!C13","v":"N"},{"$f":"Candlewood!D13","v":"Kevin"},{"$f":"Candlewood!N13","v":8.27},null,3,"N","Jim B",3.41,null,11.68,5,10,2,4.97,null,{"$f":"Highland!B13","v":1},{"$f":"Highland!C13","v":"N"},{"$f":"Highland!D13","v":"Kevin"},{"$f":"Highland!N13","v":0},null,0,"N","X",0,null,0,"","",0,0]
[{"$f":"Candlewood!B14","v":5},{"$f":"Candlewood!C14","v":"N"},{"$f":"Candlewood!D14","v":"Mike"},{"$f":"Candlewood!N14","v":5.57},null,3,"N","Kevin",8.27,null,0,"",11,9,2.89,null,{"$f":"Highland!B14","v":9},{"$f":"Highland!C14","v":"N"},{"$f":"Highland!D14","v":"Mike"},{"$f":"Highland!N14","v":1.79},null,1,"N","Jim H",0,null,0,"","",0,0]
[{"$f":"Candlewood!B15","v":2},{"$f":"Candlewood!C15","v":"N"},{"$f":"Candlewood!D15","v":"Morrie"},{"$f":"Candlewood!N15","v":1.61},null,4,"N","Bill",1.43,null,9.4699999999999989,7,"",0,0,null,{"$f":"Highland!B15","v":6},{"$f":"Highland!C15","v":"N"},{"$f":"Highland!D15","v":"Morrie"},{"$f":"Highland!N15","v":0},null,1,"N","Kevin",0,null,0,"","",0,0]
[{"$f":"Candlewood!B16","v":11},{"$f":"Candlewood!C16","v":"N"},{"$f":"Candlewood!D16","v":"Pete"},{"$f":"Candlewood!N16","v":4.4800000000000004},null,4,"N","Jeff",8.0399999999999991,null,0,"","",0,0,null,{"$f":"Highland!B16","v":6},{"$f":"Highland!C16","v":"N"},{"$f":"Highland!D16","v":"Pete"},{"$f":"Highland!N16","v":0},null,2,"y","Jeff",5.82,null,6.3814285714285717,4,"",0,0]
[{"$f":"Candlewood!B17","v":10},{"$f":"Candlewood!C17","v":"N"},{"$f":"Candlewood!D17","v":"Rich B"},{"$f":"Candlewood!N17","v":4.96},null,5,"N","Mike",5.57,null,15.790000000000001,2,"",0,0,null,{"$f":"Highland!B17","v":5},{"$f":"Highland!C17","v":"N"},{"$f":"Highland!D17","v":"Rich B"},{"$f":"Highland!N17","v":3.45},null,3,"N","Joe",0,null,5.54,5,"",0,0]
[{"$f":"Candlewood!B18","v":6},{"$f":"Candlewood!C18","v":"N"},{"$f":"Candlewood!D18","v":"Rich T"},{"$f":"Candlewood!N18","v":7.78},null,5,"N","Steve D",10.220000000000001,null,0,"","",0,0,null,{"$f":"Highland!B18","v":0},{"$f":"Highland!C18","v":"N"},{"$f":"Highland!D18","v":"Rich T"},{"$f":"Highland!N18","v":0},null,3,"N","Tom",5.54,null,0,"","",0,0]
[{"$f":"Candlewood!B19","v":11},{"$f":"Candlewood!C19","v":"N"},{"$f":"Candlewood!D19","v":"Ron"},{"$f":"Candlewood!N19","v":8},null,6,"N","Rich T",7.78,null,10.92,6,"",0,0,null,{"$f":"Highland!B19","v":0},{"$f":"Highland!C19","v":"N"},{"$f":"Highland!D19","v":"Ron"},{"$f":"Highland!N19","v":0},null,4,"y","Scott",6.8,null,7.3614285714285712,3,"",0,0]
[{"$f":"Candlewood!B20","v":8},{"$f":"Candlewood!C20","v":"N"},{"$f":"Candlewood!D20","v":"Scott"},{"$f":"Candlewood!N20","v":6.51},null,6,"N","Tom",3.1399999999999997,null,0,"","",1,0,null,{"$f":"Highland!B20","v":4},{"$f":"Highland!C20","v":"y"},{"$f":"Highland!D20","v":"Scott"},{"$f":"Highland!N20","v":6.8},null,5,"N","Bill",1.03,null,4.4800000000000004,6,"",0,0]
[{"$f":"Candlewood!B21","v":5},{"$f":"Candlewood!C21","v":"N"},{"$f":"Candlewood!D21","v":"Steve D"},{"$f":"Candlewood!N21","v":10.220000000000001},null,7,"Y","Dean",8.7799999999999994,null,12.992999999999999,3,"",2,0,null,{"$f":"Highland!B21","v":7},{"$f":"Highland!C21","v":"N"},{"$f":"Highland!D21","v":"Steve D"},{"$f":"Highland!N21","v":7.37},null,5,"N","Rich B",3.45,null,0,"","",1,0]
[{"$f":"Candlewood!B22","v":10},{"$f":"Candlewood!C22","v":"N"},{"$f":"Candlewood!D22","v":"Steve S"},{"$f":"Candlewood!N22","v":1.51},null,8,"N","Joe",2.2599999999999998,null,8.77,8,"",3,0,null,{"$f":"Highland!B22","v":8},{"$f":"Highland!C22","v":"N"},{"$f":"Highland!D22","v":"Steve S"},{"$f":"Highland!N22","v":0},null,6,"N","Morrie",0,null,0,"","",1,0]
[{"$f":"Candlewood!B23","v":6},{"$f":"Candlewood!C23","v":"N"},{"$f":"Candlewood!D23","v":"Tom"},{"$f":"Candlewood!N23","v":3.1399999999999997},null,8,"N","Scott",6.51,null,0,"","",4,0,null,{"$f":"Highland!B23","v":3},{"$f":"Highland!C23","v":"N"},{"$f":"Highland!D23","v":"Tom"},{"$f":"Highland!N23","v":5.54},null,6,"N","Pete",0,null,0,"","",3,0]
[{"$f":"Candlewood!B24","v":9},{"$f":"Candlewood!C24","v":"N"},{"$f":"Candlewood!D24","v":"Vinny"},{"$f":"Candlewood!N24","v":0},null,9,"N","Jason",2.89,null,2.89,11,"",5,0,null,{"$f":"Highland!B24","v":0},{"$f":"Highland!C24","v":"N"},{"$f":"Highland!D24","v":"Vinny"},{"$f":"Highland!N24","v":0},null,7,"N","Jack",1.1100000000000001,null,8.48,2,"",5,0]
[{"$f":"Candlewood!B25","v":0},{"$f":"Candlewood!C25","v":"N"},{"$f":"Candlewood!D25","v":"X"},{"$f":"Candlewood!N25","v":0},null,9,"N","Vinny",0,null,0,"","",6,0,null,{"$f":"Highland!B25","v":0},{"$f":"Highland!C25","v":"N"},{"$f":"Highland!D25","v":"X"},{"$f":"Highland!N25","v":0},null,7,"N","Steve D",7.37,null,0,"","",6,0]
[{"$f":"Candlewood!B26","v":0},{"$f":"Candlewood!C26","v":"N"},{"$f":"Candlewood!D26","v":"X"},{"$f":"Candlewood!N26","v":0},null,10,"N","Rich B",4.96,null,6.47,9,"",8,0,null,{"$f":"Highland!B26","v":0},{"$f":"Highland!C26","v":"N"},{"$f":"Highland!D26","v":"X"},{"$f":"Highland!N26","v":0},null,8,"N","Jason",4.09,null,4.09,7,"",6,0]
[{"$f":"Candlewood!B27","v":0},{"$f":"Candlewood!C27","v":"N"},{"$f":"Candlewood!D27","v":"X"},{"$f":"Candlewood!N27","v":0},null,10,"N","Steve S",1.51,null,0,"","",9,0,null,{"$f":"Highland!B27","v":0},{"$f":"Highland!C27","v":"N"},{"$f":"Highland!D27","v":"X"},{"$f":"Highland!N27","v":0},null,8,"N","Steve S",0,null,0,"","",7,0]
[{"$f":"Candlewood!B28","v":0},{"$f":"Candlewood!C28","v":"N"},{"$f":"Candlewood!D28","v":"X"},{"$f":"Candlewood!N28","v":0},null,11,"N","Pete",4.4800000000000004,null,12.48,4,"",10,0,null,{"$f":"Highland!B28","v":0},{"$f":"Highland!C28","v":"N"},{"$f":"Highland!D28","v":"X"},{"$f":"Highland!N28","v":0},null,9,"N","Armand F.",7.23,null,9.02,1,"",8,0]
[{"$f":"Candlewood!B29","v":0},{"$f":"Candlewood!C29","v":"N"},{"$f":"Candlewood!D29","v":"X"},{"$f":"Candlewood!N29","v":0},null,11,"N","Ron",8,null,0,"","",11,0,null,{"$f":"Highland!B29","v":0},{"$f":"Highland!C29","v":"N"},{"$f":"Highland!D29","v":"X"},{"$f":"Highland!N29","v":0},null,9,"N","Mike",1.79,null,0,"","",9,0]
[null,"Macro","CTL+N","Teams",4,null,null,"NB Avg",{"$f":"Candlewood!Q31","v":4.2130000000000001},null,null,null,null,null,null,null,null,"Macro","CTL+Q","Teams",8,null,null,"NB Avg",{"$f":"Highland!Q31","v":0.5614285714285715}]

{"sheet":"YTD","index":9,"n_rows":103,"n_cols":34,"rows_kept":103,"cut":false,"hidden":false,"merged":[[74,15,74,17],[74,18,74,20],[74,21,74,23],[15,11,15,12],[16,11,16,12],[17,11,17,12],[73,0,73,23],[74,0,74,2],[74,3,74,5],[74,6,74,8],[12,22,12,28],[43,0,43,16],[44,18,44,19],[44,0,44,1],[44,6,44,7],[14,11,14,12],[44,2,44,3],[44,4,44,5],[20,11,20,12],[44,10,44,11],[74,9,74,11],[74,12,74,14],[13,8,13,9],[14,32,14,33],[14,20,14,21],[14,22,14,23],[14,26,14,27],[14,28,14,29],[14,18,14,19],[19,11,19,12],[13,18,13,33],[14,30,14,31],[14,24,14,25],[44,12,44,13],[44,14,44,15],[44,8,44,9],[18,11,18,12],[21,11,21,12],[13,11,13,12]]}
[null,{"$f":"P15","v":"Armand F."},{"$f":"P16","v":"Bill"},{"$f":"P17","v":"Dean"},{"$f":"P18","v":"Jack"},{"$f":"P19","v":"Jason"},{"$f":"P20","v":"Jeff"},{"$f":"P21","v":"Jim B"},{"$f":"P22","v":"Jim H"},{"$f":"P23","v":"Joe"},{"$f":"P24","v":"Kevin"},{"$f":"P25","v":"Mike"},{"$f":"P26","v":"Morrie"},{"$f":"P27","v":"Pete"},{"$f":"P28","v":"Rich B"},{"$f":"P29","v":"Rich T"},{"$f":"P30","v":"Ron"},{"$f":"P31","v":"Scott"},{"$f":"P32","v":"Steve D"},{"$f":"P33","v":"Steve S"},{"$f":"P34","v":"Tom"},{"$f":"P35","v":"Vinny"},{"$f":"P36","v":"X"},{"$f":"P37","v":"X"},{"$f":"P38","v":"X"},{"$f":"P39","v":"X"},{"$f":"P40","v":"X"}]
[null,{"$f":"Highland!O4","v":2},{"$f":"Highland!O5","v":10},{"$f":"Candlewood!O6","v":3},{"$f":"Candlewood!O7","v":1},{"$f":"'CT River'!O8","v":1},{"$f":"Hamilton!O9","v":1},{"$f":"Zoar!O10","v":2},{"$f":"Zoar!O11","v":7},{"$f":"Hamilton!O12","v":8},{"$f":"Pachuag!O13","v":2},{"$f":"Zoar!O14","v":5},{"$f":"Lilly!O15","v":1},{"$f":"Pachuag!O16","v":1},{"$f":"'CT River'!O17","v":3},{"$f":"Pachuag!O18","v":7},{"$f":"'CT River'!O19","v":4},{"$f":"Pachuag!O20","v":3},{"$f":"Zoar!O21","v":1},{"$f":"Pachuag!O22","v":5},{"$f":"Quaddic!O23","v":2},{"$f":"Hamilton!O24","v":2},{"$f":"Zoar!O25","v":35},{"$f":"Hamilton!O26","v":35},{"$f":"Candlewood!O27","v":35},{"$f":"'CT River'!O28","v":35},{"$f":"Highland!O29","v":35}]
[null,{"$f":"Pachuag!O4","v":4},{"$f":"'CT River'!O5","v":11},{"$f":"Lilly!O6","v":6},{"$f":"'CT River'!O7","v":2},{"$f":"Lilly!O8","v":4},{"$f":"Lilly!O9","v":3},{"$f":"Candlewood!O10","v":13},{"$f":"Pachuag!O11","v":11},{"$f":"Lilly!O12","v":9},{"$f":"Lilly!O13","v":2},{"$f":"Highland!O14","v":8},{"$f":"Pachuag!O15","v":13},{"$f":"Quaddic!O16","v":3},{"$f":"Highland!O17","v":7},{"$f":"'CT River'!O18","v":7},{"$f":"Hamilton!O19","v":4},{"$f":"Highland!O20","v":3},{"$f":"Quaddic!O21","v":1},{"$f":"Zoar!O22","v":6},{"$f":"Highland!O23","v":5},{"$f":"Quaddic!O24","v":9},{"$f":"Quaddic!O25","v":35},{"$f":"Lilly!O26","v":35},{"$f":"Hamilton!O27","v":35},{"$f":"Quaddic!O28","v":35},{"$f":"Pachuag!O29","v":35}]
[null,{"$f":"Hamilton!O4","v":6},{"$f":"Hamilton!O5","v":12},{"$f":"Zoar!O6","v":11},{"$f":"Lilly!O7","v":7},{"$f":"Quaddic!O8","v":5},{"$f":"Zoar!O9","v":4},{"$f":"Hamilton!O10","v":13},{"$f":"Quaddic!O11","v":11},{"$f":"Quaddic!O12","v":12},{"$f":"Zoar!O13","v":3},{"$f":"Candlewood!O14","v":10},{"$f":"Hamilton!O15","v":16},{"$f":"Hamilton!O16","v":3},{"$f":"Pachuag!O17","v":10},{"$f":"Candlewood!O18","v":7},{"$f":"Candlewood!O19","v":6},{"$f":"Hamilton!O20","v":5},{"$f":"Highland!O21","v":1},{"$f":"'CT River'!O22","v":12},{"$f":"Hamilton!O23","v":7},{"$f":"'CT River'!O24","v":30},{"$f":"Candlewood!O25","v":35},{"$f":"Quaddic!O26","v":35},{"$f":"Zoar!O27","v":35},{"$f":"Highland!O28","v":35},{"$f":"'CT River'!O29","v":35}]
[null,{"$f":"Candlewood!O4","v":8},{"$f":"Lilly!O5","v":12},{"$f":"'CT River'!O6","v":14},{"$f":"Pachuag!O7","v":8},{"$f":"Highland!O8","v":6},{"$f":"Quaddic!O9","v":4},{"$f":"Quaddic!O10","v":14},{"$f":"Candlewood!O11","v":14},{"$f":"Candlewood!O12","v":17},{"$f":"Candlewood!O13","v":4},{"$f":"Hamilton!O14","v":10},{"$f":"Quaddic!O15","v":18},{"$f":"Zoar!O16","v":10},{"$f":"Lilly!O17","v":10},{"$f":"Quaddic!O18","v":8},{"$f":"Pachuag!O19","v":9},{"$f":"Quaddic!O20","v":6},{"$f":"Candlewood!O21","v":2},{"$f":"Lilly!O22","v":17},{"$f":"Zoar!O23","v":9},{"$f":"Candlewood!O24","v":30},{"$f":"Pachuag!O25","v":35},{"$f":"Zoar!O26","v":35},{"$f":"Highland!O27","v":35},{"$f":"Pachuag!O28","v":35},{"$f":"Candlewood!O29","v":35}]
[null,{"$f":"Lilly!O4","v":8},{"$f":"Candlewood!O5","v":20},{"$f":"Quaddic!O6","v":16},{"$f":"Hamilton!O7","v":9},{"$f":"Zoar!O8","v":8},{"$f":"Highland!O9","v":4},{"$f":"Lilly!O10","v":30},{"$f":"Lilly!O11","v":16},{"$f":"Pachuag!O12","v":30},{"$f":"Quaddic!O13","v":7},{"$f":"'CT River'!O14","v":13},{"$f":"Candlewood!O15","v":18},{"$f":"Candlewood!O16","v":12},{"$f":"Candlewood!O17","v":11},{"$f":"Lilly!O18","v":11},{"$f":"Quaddic!O19","v":13},{"$f":"'CT River'!O20","v":6},{"$f":"'CT River'!O21","v":5},{"$f":"Hamilton!O22","v":18},{"$f":"Lilly!O23","v":14},{"$f":"Highland!O24","v":35},{"$f":"Hamilton!O25","v":35},{"$f":"Pachuag!O26","v":35},{"$f":"'CT River'!O27","v":35},{"$f":"Candlewood!O28","v":35},{"$f":"Zoar!O29","v":35}]
[null,{"$f":"Quaddic!O4","v":9},{"$f":"Quaddic!O5","v":30},{"$f":"Pachuag!O6","v":30},{"$f":"Highland!O7","v":9},{"$f":"Pachuag!O8","v":11},{"$f":"Candlewood!O9","v":5},{"$f":"'CT River'!O10","v":35},{"$f":"'CT River'!O11","v":30},{"$f":"Zoar!O12","v":30},{"$f":"'CT River'!O13","v":9},{"$f":"Quaddic!O14","v":17},{"$f":"Zoar!O15","v":30},{"$f":"Lilly!O16","v":13},{"$f":"Zoar!O17","v":13},{"$f":"Hamilton!O18","v":19},{"$f":"Zoar!O19","v":15},{"$f":"Candlewood!O20","v":9},{"$f":"Lilly!O21","v":5},{"$f":"Candlewood!O22","v":19},{"$f":"Candlewood!O23","v":15},{"$f":"Lilly!O24","v":35},{"$f":"Lilly!O25","v":35},{"$f":"Highland!O26","v":35},{"$f":"Pachuag!O27","v":35},{"$f":"Zoar!O28","v":35},{"$f":"Quaddic!O29","v":35}]
[null,{"$f":"'CT River'!O4","v":10},{"$f":"Zoar!O5","v":35},{"$f":"Highland!O6","v":35},{"$f":"Quaddic!O7","v":15},{"$f":"Hamilton!O8","v":15},{"$f":"'CT River'!O9","v":8},{"$f":"Highland!O10","v":35},{"$f":"Highland!O11","v":30},{"$f":"'CT River'!O12","v":30},{"$f":"Hamilton!O13","v":11},{"$f":"Lilly!O14","v":19},{"$f":"'CT River'!O15","v":30},{"$f":"'CT River'!O16","v":30},{"$f":"Hamilton!O17","v":17},{"$f":"Zoar!O18","v":30},{"$f":"Lilly!O19","v":15},{"$f":"Zoar!O20","v":14},{"$f":"Pachuag!O21","v":6},{"$f":"Quaddic!O22","v":30},{"$f":"Pachuag!O23","v":30},{"$f":"Zoar!O24","v":35},{"$f":"'CT River'!O25","v":35},{"$f":"'CT River'!O26","v":35},{"$f":"Lilly!O27","v":35},{"$f":"Hamilton!O28","v":35},{"$f":"Hamilton!O29","v":35}]
[null,{"$f":"Zoar!O4","v":12},{"$f":"Pachuag!O5","v":35},{"$f":"Hamilton!O6","v":35},{"$f":"Zoar!O7","v":30},{"$f":"Candlewood!O8","v":16},{"$f":"Pachuag!O9","v":30},{"$f":"Pachuag!O10","v":35},{"$f":"Hamilton!O11","v":35},{"$f":"Highland!O12","v":30},{"$f":"Highland!O13","v":30},{"$f":"Pachuag!O14","v":35},{"$f":"Highland!O15","v":30},{"$f":"Highland!O16","v":30},{"$f":"Quaddic!O17","v":30},{"$f":"Highland!O18","v":35},{"$f":"Highland!O19","v":35},{"$f":"Lilly!O20","v":18},{"$f":"Hamilton!O21","v":14},{"$f":"Highland!O22","v":30},{"$f":"'CT River'!O23","v":30},{"$f":"Pachuag!O24","v":35},{"$f":"Highland!O25","v":35},{"$f":"Candlewood!O26","v":35},{"$f":"Quaddic!O27","v":35},{"$f":"Lilly!O28","v":35},{"$f":"Lilly!O29","v":35}]
["Pts. YTD",{"$f":"SUM(B2:B7)","v":37},95,80,36,35,21,107,{"$f":"SUM(I2:I7)","v":89},106,27,63,96,42,54,59,51,{"$f":"SUM(R2:R7)","v":32},15,77,52,141,210,210,210,210,210]
["Position",{"$f":"RANK(B10,Pts._YTD,1)","v":7},17,15,6,5,2,20,16,{"$f":"RANK(J10,Pts._YTD,1)","v":19},3,{"$f":"RANK(L10,Pts._YTD,1)","v":13},18,8,11,12,9,4,{"$f":"RANK(S10,Pts._YTD,1)","v":1},14,10,21,22,22,22,22,22]
[]
[null,null,null,null,null,null,null,null,null,null,null,null,null,null,null,null,null,null,null,null,null,null,"Use macro ctl-f"]
["Name","Position","Pts. YTD",null,"Name","Position","Pts. YTD",null,"Total Weight",null,null,"Lake / River 2015",null,null,null,"Members",null,null,"Top 3 Finishers for Each Tournament"]
[{"$f":"B1","v":"Armand F."},{"$f":"B11","v":7},{"$f":"B10","v":37},null,"Steve D",1,15,null,{"$f":"P15","v":"Armand F."},{"$f":"Highland!N4+Pachuag!N4+Hamilton!N4+Quaddic!N4+Lilly!N4+Zoar!N4+Candlewood!N4+'CT River'!N4","v":41.170000000000009},null,"Pachaug",null,null,null,"Armand F.",null,null,{"$f":"L15","v":"Pachaug"},null,{"$f":"L16","v":"Zoar"},null,{"$f":"L17","v":"Quaddick"},null,{"$f":"L18","v":"Candlewood "},null,{"$f":"L19","v":"CT River"},null,{"$f":"L20","v":"Hamilton"},null,{"$f":"L21","v":"Lilly"},null,{"$f":"L22","v":"Highland"}]
[{"$f":"C1","v":"Bill"},{"$f":"C11","v":17},{"$f":"C10","v":95},null,"Jeff",2,21,null,"Bill",{"$f":"Highland!N5+Pachuag!N5+Hamilton!N5+Quaddic!N5+Lilly!N5+Zoar!N5+Candlewood!N5+'CT River'!N5","v":12.43},null,"Zoar",null,null,null,"Bill",null,null,{"$f":"Pachuag!D16","v":"Pete"},{"$f":"Pachuag!O16","v":1},{"$f":"Zoar!D21","v":"Steve D"},{"$f":"Zoar!O21","v":1},{"$f":"Quaddic!D21","v":"Steve D"},{"$f":"Quaddic!O21","v":1},{"$f":"Candlewood!D7","v":"Jack"},{"$f":"Candlewood!O7","v":1},{"$f":"'CT River'!D8","v":"Jason"},{"$f":"'CT River'!O8","v":1},{"$f":"Hamilton!D9","v":"Jeff"},{"$f":"Hamilton!O9","v":1},{"$f":"Lilly!D15","v":"Morrie"},{"$f":"Lilly!O15","v":1},{"$f":"Highland!D21","v":"Steve D"},{"$f":"Highland!O21","v":1}]
[{"$f":"D1","v":"Dean"},{"$f":"D11","v":15},{"$f":"D10","v":80},null,"Kevin",3,27,null,"Dean",{"$f":"Highland!N6+Pachuag!N6+Hamilton!N6+Quaddic!N6+Lilly!N6+Zoar!N6+Candlewood!N6+'CT River'!N6","v":23.080000000000002},null,"Quaddick",null,null,null,"Dean",null,null,{"$f":"Pachuag!D13","v":"Kevin"},{"$f":"Pachuag!O13","v":2},{"$f":"Zoar!D10","v":"Jim B"},{"$f":"Zoar!O10","v":2},{"$f":"Quaddic!D23","v":"Tom"},{"$f":"Quaddic!O23","v":2},{"$f":"Candlewood!D21","v":"Steve D"},{"$f":"Candlewood!O21","v":2},{"$f":"'CT River'!D7","v":"Jack"},{"$f":"'CT River'!O7","v":2},{"$f":"Hamilton!D24","v":"Vinny"},{"$f":"Hamilton!O24","v":2},{"$f":"Lilly!D13","v":"Kevin"},{"$f":"Lilly!O13","v":2},{"$f":"Highland!D4","v":"Armand F."},{"$f":"Highland!O4","v":2}]
[{"$f":"E1","v":"Jack"},{"$f":"E11","v":6},{"$f":"E10","v":36},null,"Scott",4,32,null,"Jack",{"$f":"Highland!N7+Pachuag!N7+Hamilton!N7+Quaddic!N7+Lilly!N7+Zoar!N7+Candlewood!N7+'CT River'!N7","v":33.39},null,"Candlewood ",null,null,null,"Jack",null,null,{"$f":"Pachuag!D20","v":"Scott"},{"$f":"Pachuag!O20","v":3},{"$f":"Zoar!D13","v":"Kevin"},{"$f":"Zoar!O13","v":3},{"$f":"Quaddic!D16","v":"Pete"},{"$f":"Quaddic!O16","v":3},{"$f":"Candlewood!D6","v":"Dean"},{"$f":"Candlewood!O6","v":3},{"$f":"'CT River'!D17","v":"Rich B"},{"$f":"'CT River'!O17","v":3},{"$f":"Hamilton!D16","v":"Pete"},{"$f":"Hamilton!O16","v":3},{"$f":"Lilly!D9","v":"Jeff"},{"$f":"Lilly!O9","v":3},{"$f":"Highland!D20","v":"Scott"},{"$f":"Highland!O20","v":3}]
[{"$f":"F1","v":"Jason"},{"$f":"F11","v":5},{"$f":"F10","v":35},null,"Jason",5,35,null,"Jason",{"$f":"Highland!N8+Pachuag!N8+Hamilton!N8+Quaddic!N8+Lilly!N8+Zoar!N8+Candlewood!N8+'CT River'!N8","v":34.56},null,"CT River",null,null,null,"Jason",null,null,{"$f":"Pachuag!D4","v":"Armand F."},{"$f":"Pachuag!O4","v":4},{"$f":"Zoar!D9","v":"Jeff"},{"$f":"Zoar!O9","v":4},{"$f":"Quaddic!D9","v":"Jeff"},{"$f":"Quaddic!O9","v":4},{"$f":"Candlewood!D13","v":"Kevin"},{"$f":"Candlewood!O13","v":4},{"$f":"'CT River'!D19","v":"Ron"},{"$f":"'CT River'!O19","v":4},{"$f":"Hamilton!D19","v":"Ron"},{"$f":"Hamilton!O19","v":4},{"$f":"Lilly!D8","v":"Jason"},{"$f":"Lilly!O8","v":4},{"$f":"Highland!D9","v":"Jeff"},{"$f":"Highland!O9","v":4}]
[{"$f":"G1","v":"Jeff"},{"$f":"G11","v":2},{"$f":"G10","v":21},null,"Jack",6,36,null,"Jeff",{"$f":"Highland!N9+Pachuag!N9+Hamilton!N9+Quaddic!N9+Lilly!N9+Zoar!N9+Candlewood!N9+'CT River'!N9","v":43.300000000000004},null,"Hamilton",null,null,null,"Jeff",null,null,{"$f":"Pachuag!D22","v":"Steve S"},{"$f":"Pachuag!O22","v":5},{"$f":"Zoar!D14","v":"Mike"},{"$f":"Zoar!O14","v":5},{"$f":"Quaddic!D8","v":"Jason"},{"$f":"Quaddic!O8","v":5},{"$f":"Candlewood!D9","v":"Jeff"},{"$f":"Candlewood!O9","v":5},{"$f":"'CT River'!D21","v":"Steve D"},{"$f":"'CT River'!O21","v":5},{"$f":"Hamilton!D20","v":"Scott"},{"$f":"Hamilton!O20","v":5},{"$f":"Lilly!D21","v":"Steve D"},{"$f":"Lilly!O21","v":5},{"$f":"Highland!D23","v":"Tom"},{"$f":"Highland!O23","v":5}]
[{"$f":"H1","v":"Jim B"},{"$f":"H11","v":20},{"$f":"H10","v":107},null,"Armand F.",7,37,null,"Jim B",{"$f":"Highland!N10+Pachuag!N10+Hamilton!N10+Quaddic!N10+Lilly!N10+Zoar!N10+Candlewood!N10+'CT River'!N10","v":15.6},null,"Lilly",null,null,null,"Jim B",null,null,{"$f":"Pachuag!D21","v":"Steve D"},{"$f":"Pachuag!O21","v":6},{"$f":"Zoar!D22","v":"Steve S"},{"$f":"Zoar!O22","v":6},{"$f":"Quaddic!D20","v":"Scott"},{"$f":"Quaddic!O20","v":6},{"$f":"Candlewood!D19","v":"Ron"},{"$f":"Candlewood!O19","v":6},{"$f":"'CT River'!D20","v":"Scott"},{"$f":"'CT River'!O20","v":6},{"$f":"Hamilton!D4","v":"Armand F."},{"$f":"Hamilton!O4","v":6},{"$f":"Lilly!D6","v":"Dean"},{"$f":"Lilly!O6","v":6},{"$f":"Highland!D8","v":"Jason"},{"$f":"Highland!O8","v":6}]
[{"$f":"I1","v":"Jim H"},{"$f":"I11","v":16},{"$f":"I10","v":89},null,"Pete",8,42,null,"Jim H",{"$f":"Highland!N11+Pachuag!N11+Hamilton!N11+Quaddic!N11+Lilly!N11+Zoar!N11+Candlewood!N11+'CT River'!N11","v":16.54},null,"Highland",null,null,null,"Jim H",null,null,{"$f":"Pachuag!D18","v":"Rich T"},{"$f":"Pachuag!O18","v":7},{"$f":"Zoar!D11","v":"Jim H"},{"$f":"Zoar!O11","v":7},{"$f":"Quaddic!D13","v":"Kevin"},{"$f":"Quaddic!O13","v":7},{"$f":"Candlewood!D18","v":"Rich T"},{"$f":"Candlewood!O18","v":7},{"$f":"'CT River'!D18","v":"Rich T"},{"$f":"'CT River'!O18","v":7},{"$f":"Hamilton!D23","v":"Tom"},{"$f":"Hamilton!O23","v":7},{"$f":"Lilly!D7","v":"Jack"},{"$f":"Lilly!O7","v":7},{"$f":"Highland!D17","v":"Rich B"},{"$f":"Highland!O17","v":7}]
[{"$f":"J1","v":"Joe"},{"$f":"J11","v":19},{"$f":"J10","v":106},null,"Ron",9,51,null,"Joe",{"$f":"Highland!N12+Pachuag!N12+Hamilton!N12+Quaddic!N12+Lilly!N12+Zoar!N12+Candlewood!N12+'CT River'!N12","v":16.509999999999998},null,null,null,null,null,"Joe",null,null,{"$f":"Pachuag!D7","v":"Jack"},{"$f":"Pachuag!O7","v":8},{"$f":"Zoar!D8","v":"Jason"},{"$f":"Zoar!O8","v":8},{"$f":"Quaddic!D18","v":"Rich T"},{"$f":"Quaddic!O18","v":8},{"$f":"Candlewood!D4","v":"Armand F."},{"$f":"Candlewood!O4","v":8},{"$f":"'CT River'!D9","v":"Jeff"},{"$f":"'CT River'!O9","v":8},{"$f":"Hamilton!D12","v":"Joe"},{"$f":"Hamilton!O12","v":8},{"$f":"Lilly!D4","v":"Armand F."},{"$f":"Lilly!O4","v":8},{"$f":"Highland!D14","v":"Mike"},{"$f":"Highland!O14","v":8}]
[{"$f":"K1","v":"Kevin"},{"$f":"K11","v":3},{"$f":"K10","v":27},null,"Tom",10,52,null,"Kevin",{"$f":"Highland!N13+Pachuag!N13+Hamilton!N13+Quaddic!N13+Lilly!N13+Zoar!N13+Candlewood!N13+'CT River'!N13","v":40.22},null,null,null,null,null,"Kevin",null,null,{"$f":"Pachuag!D19","v":"Ron"},{"$f":"Pachuag!O19","v":9},{"$f":"Zoar!D23","v":"Tom"},{"$f":"Zoar!O23","v":9},{"$f":"Quaddic!D4","v":"Armand F."},{"$f":"Quaddic!O4","v":9},{"$f":"Candlewood!D20","v":"Scott"},{"$f":"Candlewood!O20","v":9},{"$f":"'CT River'!D13","v":"Kevin"},{"$f":"'CT River'!O13","v":9},{"$f":"Hamilton!D7","v":"Jack"},{"$f":"Hamilton!O7","v":9},{"$f":"Lilly!D12","v":"Joe"},{"$f":"Lilly!O12","v":9},{"$f":"Highland!D7","v":"Jack"},{"$f":"Highland!O7","v":9}]
[{"$f":"L1","v":"Mike"},{"$f":"L11","v":13},{"$f":"L10","v":63},null,"Rich B",11,54,null,"Mike",{"$f":"Highland!N14+Pachuag!N14+Hamilton!N14+Quaddic!N14+Lilly!N14+Zoar!N14+Candlewood!N14+'CT River'!N14","v":20.950000000000003},null,null,null,null,null,"Mike",null,null,{"$f":"Pachuag!D17","v":"Rich B"},{"$f":"Pachuag!O17","v":10},{"$f":"Zoar!D16","v":"Pete"},{"$f":"Zoar!O16","v":10},{"$f":"Quaddic!D24","v":"Vinny"},{"$f":"Quaddic!O24","v":9},{"$f":"Candlewood!D14","v":"Mike"},{"$f":"Candlewood!O14","v":10},{"$f":"'CT River'!D4","v":"Armand F."},{"$f":"'CT River'!O4","v":10},{"$f":"Hamilton!D14","v":"Mike"},{"$f":"Hamilton!O14","v":10},{"$f":"Lilly!D17","v":"Rich B"},{"$f":"Lilly!O17","v":10},{"$f":"Highland!D5","v":"Bill"},{"$f":"Highland!O5","v":10}]
[{"$f":"M1","v":"Morrie"},{"$f":"M11","v":18},{"$f":"M10","v":96},null,"Rich T",12,59,null,"Morrie",{"$f":"Highland!N15+Pachuag!N15+Hamilton!N15+Quaddic!N15+Lilly!N15+Zoar!N15+Candlewood!N15+'CT River'!N15","v":15.51},null,"Macros",null,null,null,"Morrie",null,null,{"$f":"Pachuag!D11","v":"Jim H"},{"$f":"Pachuag!O11","v":11},{"$f":"Zoar!D6","v":"Dean"},{"$f":"Zoar!O6","v":11},{"$f":"Quaddic!D11","v":"Jim H"},{"$f":"Quaddic!O11","v":11},{"$f":"Candlewood!D17","v":"Rich B"},{"$f":"Candlewood!O17","v":11},{"$f":"'CT River'!D5","v":"Bill"},{"$f":"'CT River'!O5","v":11},{"$f":"Hamilton!D13","v":"Kevin"},{"$f":"Hamilton!O13","v":11},{"$f":"Lilly!D18","v":"Rich T"},{"$f":"Lilly!O18","v":11},{"$f":"Highland!D22","v":"Steve S"},{"$f":"Highland!O22","v":30}]
[{"$f":"N1","v":"Pete"},{"$f":"N11","v":8},{"$f":"N10","v":42},null,"Mike",13,63,null,"Pete",{"$f":"Highland!N16+Pachuag!N16+Hamilton!N16+Quaddic!N16+Lilly!N16+Zoar!N16+Candlewood!N16+'CT River'!N16","v":33.26},null,"ctl-S   Sort Upper Section",null,null,null,"Pete",null,null,{"$f":"Pachuag!D8","v":"Jason"},{"$f":"Pachuag!O8","v":11},{"$f":"Zoar!D4","v":"Armand F."},{"$f":"Zoar!O4","v":12},{"$f":"Quaddic!D12","v":"Joe"},{"$f":"Quaddic!O12","v":12},{"$f":"Candlewood!D16","v":"Pete"},{"$f":"Candlewood!O16","v":12},{"$f":"'CT River'!D22","v":"Steve S"},{"$f":"'CT River'!O22","v":12},{"$f":"Hamilton!D5","v":"Bill"},{"$f":"Hamilton!O5","v":12},{"$f":"Lilly!D5","v":"Bill"},{"$f":"Lilly!O5","v":12},{"$f":"Highland!D16","v":"Pete"},{"$f":"Highland!O16","v":30}]
[{"$f":"O1","v":"Rich B"},{"$f":"O11","v":11},{"$f":"O10","v":54},null,"Steve S",14,77,null,"Rich B",{"$f":"Highland!N17+Pachuag!N17+Hamilton!N17+Quaddic!N17+Lilly!N17+Zoar!N17+Candlewood!N17+'CT River'!N17","v":24.83},null,"ctl-K   Copy and Paste for Position",null,null,null,"Rich B",null,null,{"$f":"Pachuag!D15","v":"Morrie"},{"$f":"Pachuag!O15","v":13},{"$f":"Zoar!D17","v":"Rich B"},{"$f":"Zoar!O17","v":13},{"$f":"Quaddic!D19","v":"Ron"},{"$f":"Quaddic!O19","v":13},{"$f":"Candlewood!D10","v":"Jim B"},{"$f":"Candlewood!O10","v":13},{"$f":"'CT River'!D14","v":"Mike"},{"$f":"'CT River'!O14","v":13},{"$f":"Hamilton!D10","v":"Jim B"},{"$f":"Hamilton!O10","v":13},{"$f":"Lilly!D16","v":"Pete"},{"$f":"Lilly!O16","v":13},{"$f":"Highland!D13","v":"Kevin"},{"$f":"Highland!O13","v":30}]
[{"$f":"P1","v":"Rich T"},{"$f":"P11","v":12},{"$f":"P10","v":59},null,"Dean",15,80,null,"Rich T",{"$f":"Highland!N18+Pachuag!N18+Hamilton!N18+Quaddic!N18+Lilly!N18+Zoar!N18+Candlewood!N18+'CT River'!N18","v":22.71},null,"ctl-L    Sort For Lunker",null,null,null,"Rich T",null,null,{"$f":"Pachuag!D9","v":"Jeff"},{"$f":"Pachuag!O9","v":30},{"$f":"Zoar!D20","v":"Scott"},{"$f":"Zoar!O20","v":14},{"$f":"Quaddic!D10","v":"Jim B"},{"$f":"Quaddic!O10","v":14},{"$f":"Candlewood!D11","v":"Jim H"},{"$f":"Candlewood!O11","v":14},{"$f":"'CT River'!D6","v":"Dean"},{"$f":"'CT River'!O6","v":14},{"$f":"Hamilton!D21","v":"Steve D"},{"$f":"Hamilton!O21","v":14},{"$f":"Lilly!D23","v":"Tom"},{"$f":"Lilly!O23","v":14},{"$f":"Highland!D11","v":"Jim H"},{"$f":"Highland!O11","v":30}]
[{"$f":"Q1","v":"Ron"},{"$f":"Q11","v":9},{"$f":"Q10","v":51},null,"Jim H",16,89,null,"Ron",{"$f":"Highland!N19+Pachuag!N19+Hamilton!N19+Quaddic!N19+Lilly!N19+Zoar!N19+Candlewood!N19+'CT River'!N19","v":28},null,"ctl-F   Sort Top 3 Finishers",null,null,null,"Ron",null,null,{"$f":"Pachuag!D6","v":"Dean"},{"$f":"Pachuag!O6","v":30},{"$f":"Zoar!D19","v":"Ron"},{"$f":"Zoar!O19","v":15},{"$f":"Quaddic!D7","v":"Jack"},{"$f":"Quaddic!O7","v":15},{"$f":"Candlewood!D23","v":"Tom"},{"$f":"Candlewood!O23","v":15},{"$f":"'CT River'!D15","v":"Morrie"},{"$f":"'CT River'!O15","v":30},{"$f":"Hamilton!D8","v":"Jason"},{"$f":"Hamilton!O8","v":15},{"$f":"Lilly!D19","v":"Ron"},{"$f":"Lilly!O19","v":15},{"$f":"Highland!D15","v":"Morrie"},{"$f":"Highland!O15","v":30}]
[{"$f":"R1","v":"Scott"},{"$f":"R11","v":4},{"$f":"R10","v":32},null,"Bill",17,95,null,"Scott",{"$f":"Highland!N20+Pachuag!N20+Hamilton!N20+Quaddic!N20+Lilly!N20+Zoar!N20+Candlewood!N20+'CT River'!N20","v":35.44},null,"ctl-W   Sort for Total Weight",null,null,null,"Scott",null,null,{"$f":"Pachuag!D12","v":"Joe"},{"$f":"Pachuag!O12","v":30},{"$f":"Zoar!D18","v":"Rich T"},{"$f":"Zoar!O18","v":30},{"$f":"Quaddic!D6","v":"Dean"},{"$f":"Quaddic!O6","v":16},{"$f":"Candlewood!D8","v":"Jason"},{"$f":"Candlewood!O8","v":16},{"$f":"'CT River'!D12","v":"Joe"},{"$f":"'CT River'!O12","v":30},{"$f":"Hamilton!D15","v":"Morrie"},{"$f":"Hamilton!O15","v":16},{"$f":"Lilly!D11","v":"Jim H"},{"$f":"Lilly!O11","v":16},{"$f":"Highland!D12","v":"Joe"},{"$f":"Highland!O12","v":30}]
[{"$f":"S1","v":"Steve D"},{"$f":"S11","v":1},{"$f":"S10","v":15},null,"Morrie",18,96,null,"Steve D",{"$f":"Highland!N21+Pachuag!N21+Hamilton!N21+Quaddic!N21+Lilly!N21+Zoar!N21+Candlewood!N21+'CT River'!N21","v":49.12},null,null,null,null,null,"Steve D",null,null,{"$f":"Pachuag!D23","v":"Tom"},{"$f":"Pachuag!O23","v":30},{"$f":"Zoar!D7","v":"Jack"},{"$f":"Zoar!O7","v":30},{"$f":"Quaddic!D14","v":"Mike"},{"$f":"Quaddic!O14","v":17},{"$f":"Candlewood!D12","v":"Joe"},{"$f":"Candlewood!O12","v":17},{"$f":"'CT River'!D24","v":"Vinny"},{"$f":"'CT River'!O24","v":30},{"$f":"Hamilton!D17","v":"Rich B"},{"$f":"Hamilton!O17","v":17},{"$f":"Lilly!D22","v":"Steve S"},{"$f":"Lilly!O22","v":17},{"$f":"Highland!D18","v":"Rich T"},{"$f":"Highland!O18","v":35}]
[{"$f":"T1","v":"Steve S"},{"$f":"T11","v":14},{"$f":"T10","v":77},null,"Joe",19,106,null,"Steve S",{"$f":"Highland!N22+Pachuag!N22+Hamilton!N22+Quaddic!N22+Lilly!N22+Zoar!N22+Candlewood!N22+'CT River'!N22","v":15.03},null,null,null,null,null,"Steve S",null,null,{"$f":"Pachuag!D5","v":"Bill"},{"$f":"Pachuag!O5","v":35},{"$f":"Zoar!D12","v":"Joe"},{"$f":"Zoar!O12","v":30},{"$f":"Quaddic!D15","v":"Morrie"},{"$f":"Quaddic!O15","v":18},{"$f":"Candlewood!D15","v":"Morrie"},{"$f":"Candlewood!O15","v":18},{"$f":"'CT River'!D11","v":"Jim H"},{"$f":"'CT River'!O11","v":30},{"$f":"Hamilton!D22","v":"Steve S"},{"$f":"Hamilton!O22","v":18},{"$f":"Lilly!D20","v":"Scott"},{"$f":"Lilly!O20","v":18},{"$f":"Highland!D19","v":"Ron"},{"$f":"Highland!O19","v":35}]
[{"$f":"U1","v":"Tom"},{"$f":"U11","v":10},{"$f":"U10","v":52},null,"Jim B",20,107,null,"Tom",{"$f":"Highland!N23+Pachuag!N23+Hamilton!N23+Quaddic!N23+Lilly!N23+Zoar!N23+Candlewood!N23+'CT River'!N23","v":28.24},null,null,null,null,null,"Tom",null,null,{"$f":"Pachuag!D10","v":"Jim B"},{"$f":"Pachuag!O10","v":35},{"$f":"Zoar!D15","v":"Morrie"},{"$f":"Zoar!O15","v":30},{"$f":"Quaddic!D17","v":"Rich B"},{"$f":"Quaddic!O17","v":30},{"$f":"Candlewood!D22","v":"Steve S"},{"$f":"Candlewood!O22","v":19},{"$f":"'CT River'!D23","v":"Tom"},{"$f":"'CT River'!O23","v":30},{"$f":"Hamilton!D18","v":"Rich T"},{"$f":"Hamilton!O18","v":19},{"$f":"Lilly!D14","v":"Mike"},{"$f":"Lilly!O14","v":19},{"$f":"Highland!D6","v":"Dean"},{"$f":"Highland!O6","v":35}]
[{"$f":"V1","v":"Vinny"},{"$f":"V11","v":21},{"$f":"V10","v":141},null,"Vinny",21,141,null,"Vinny",{"$f":"Highland!N24+Pachuag!N24+Hamilton!N24+Quaddic!N24+Lilly!N24+Zoar!N24+Candlewood!N24+'CT River'!N24","v":11.6},null,null,null,null,null,"Vinny",null,null,{"$f":"Pachuag!D14","v":"Mike"},{"$f":"Pachuag!O14","v":35},{"$f":"Zoar!D5","v":"Bill"},{"$f":"Zoar!O5","v":35},{"$f":"Quaddic!D22","v":"Steve S"},{"$f":"Quaddic!O22","v":30},{"$f":"Candlewood!D5","v":"Bill"},{"$f":"Candlewood!O5","v":20},{"$f":"'CT River'!D16","v":"Pete"},{"$f":"'CT River'!O16","v":30},{"$f":"Hamilton!D6","v":"Dean"},{"$f":"Hamilton!O6","v":35},{"$f":"Lilly!D10","v":"Jim B"},{"$f":"Lilly!O10","v":30},{"$f":"Highland!D10","v":"Jim B"},{"$f":"Highland!O10","v":35}]
[{"$f":"W1","v":"X"},{"$f":"W11","v":22},{"$f":"W10","v":210},null,"X",22,210,null,"X",{"$f":"Highland!N25+Pachuag!N25+Hamilton!N25+Quaddic!N25+Lilly!N25+Zoar!N25+Candlewood!N25+'CT River'!N25","v":0},null,null,null,null,null,"X",null,null,{"$f":"Pachuag!D24","v":"Vinny"},{"$f":"Pachuag!O24","v":35},{"$f":"Zoar!D24","v":"Vinny"},{"$f":"Zoar!O24","v":35},{"$f":"Quaddic!D5","v":"Bill"},{"$f":"Quaddic!O5","v":30},{"$f":"Candlewood!D24","v":"Vinny"},{"$f":"Candlewood!O24","v":30},{"$f":"'CT River'!D10","v":"Jim B"},{"$f":"'CT River'!O10","v":35},{"$f":"Hamilton!D11","v":"Jim H"},{"$f":"Hamilton!O11","v":35},{"$f":"Lilly!D24","v":"Vinny"},{"$f":"Lilly!O24","v":35},{"$f":"Highland!D24","v":"Vinny"},{"$f":"Highland!O24","v":35}]
[{"$f":"X1","v":"X"},{"$f":"X11","v":22},{"$f":"X10","v":210},null,"X",22,210,null,"X",{"$f":"Highland!N26+Pachuag!N26+Hamilton!N26+Quaddic!N26+Lilly!N26+Zoar!N26+Candlewood!N26+'CT River'!N26","v":0},null,null,null,null,null,"X",null,null,{"$f":"Pachuag!D25","v":"X"},{"$f":"Pachuag!O25","v":35},{"$f":"Zoar!D25","v":"X"},{"$f":"Zoar!O25","v":35},{"$f":"Quaddic!D25","v":"X"},{"$f":"Quaddic!O25","v":35},{"$f":"Candlewood!D25","v":"X"},{"$f":"Candlewood!O25","v":35},{"$f":"'CT River'!D25","v":"X"},{"$f":"'CT River'!O25","v":35},{"$f":"Hamilton!D25","v":"X"},{"$f":"Hamilton!O25","v":35},{"$f":"Lilly!D25","v":"X"},{"$f":"Lilly!O25","v":35},{"$f":"Highland!D25","v":"X"},{"$f":"Highland!O25","v":35}]
[{"$f":"Y1","v":"X"},{"$f":"Y11","v":22},{"$f":"Y10","v":210},null,"X",22,210,null,"X",{"$f":"Highland!N27+Pachuag!N27+Hamilton!N27+Quaddic!N27+Lilly!N27+Zoar!N27+Candlewood!N27+'CT River'!N27","v":0},null,null,null,null,null,"X",null,null,{"$f":"Pachuag!D26","v":"X"},{"$f":"Pachuag!O26","v":35},{"$f":"Zoar!D27","v":"X"},{"$f":"Zoar!O27","v":35},{"$f":"Quaddic!D26","v":"X"},{"$f":"Quaddic!O26","v":35},{"$f":"Candlewood!D26","v":"X"},{"$f":"Candlewood!O26","v":35},{"$f":"'CT River'!D26","v":"X"},{"$f":"'CT River'!O26","v":35},{"$f":"Hamilton!D26","v":"X"},{"$f":"Hamilton!O26","v":35},{"$f":"Lilly!D26","v":"X"},{"$f":"Lilly!O26","v":35},{"$f":"Highland!D26","v":"X"},{"$f":"Highland!O26","v":35}]
[{"$f":"Z1","v":"X"},{"$f":"Z11","v":22},{"$f":"Z10","v":210},null,"X",22,210,null,"X",{"$f":"Highland!N28+Pachuag!N28+Hamilton!N28+Quaddic!N28+Lilly!N28+Zoar!N28+Candlewood!N28+'CT River'!N28","v":0},null,null,null,null,null,"X",null,null,{"$f":"Pachuag!D27","v":"X"},{"$f":"Pachuag!O27","v":35},{"$f":"Zoar!D26","v":"X"},{"$f":"Zoar!O26","v":35},{"$f":"Quaddic!D27","v":"X"},{"$f":"Quaddic!O27","v":35},{"$f":"Candlewood!D27","v":"X"},{"$f":"Candlewood!O27","v":35},{"$f":"'CT River'!D27","v":"X"},{"$f":"'CT River'!O27","v":35},{"$f":"Hamilton!D27","v":"X"},{"$f":"Hamilton!O27","v":35},{"$f":"Lilly!D27","v":"X"},{"$f":"Lilly!O27","v":35},{"$f":"Highland!D27","v":"X"},{"$f":"Highland!O27","v":35}]
[{"$f":"AA1","v":"X"},{"$f":"AA11","v":22},{"$f":"AA10","v":210},null,"X",22,210,null,"X",{"$f":"Highland!N29+Pachuag!N29+Hamilton!N29+Quaddic!N29+Lilly!N29+Zoar!N29+Candlewood!N29+'CT River'!N29","v":0},null,null,null,null,null,"X",null,null,{"$f":"Pachuag!D28","v":"X"},{"$f":"Pachuag!O28","v":35},{"$f":"Zoar!D28","v":"X"},{"$f":"Zoar!O28","v":35},{"$f":"Quaddic!D28","v":"X"},{"$f":"Quaddic!O28","v":35},{"$f":"Candlewood!D28","v":"X"},{"$f":"Candlewood!O28","v":35},{"$f":"'CT River'!D28","v":"X"},{"$f":"'CT River'!O28","v":35},{"$f":"Hamilton!D28","v":"X"},{"$f":"Hamilton!O28","v":35},{"$f":"Lilly!D28","v":"X"},{"$f":"Lilly!O28","v":35},{"$f":"Highland!D28","v":"X"},{"$f":"Highland!O28","v":35}]
[null,null,null,null,null,null,null,null,null,null,null,null,null,null,null,null,null,null,{"$f":"Pachuag!D29","v":"X"},{"$f":"Pachuag!O29","v":35},{"$f":"Zoar!D29","v":"X"},{"$f":"Zoar!O29","v":35},{"$f":"Quaddic!D29","v":"X"},{"$f":"Quaddic!O29","v":35},{"$f":"Candlewood!D29","v":"X"},{"$f":"Candlewood!O29","v":35},{"$f":"'CT River'!D29","v":"X"},{"$f":"'CT River'!O29","v":35},{"$f":"Hamilton!D29","v":"X"},{"$f":"Hamilton!O29","v":35},{"$f":"Lilly!D29","v":"X"},{"$f":"Lilly!O29","v":35},{"$f":"Highland!D29","v":"X"},{"$f":"Highland!O29","v":35}]
[]
[]
["Total Weight"]
[{"$f":"L15","v":"Pachaug"},null,{"$f":"L16","v":"Zoar"},null,{"$f":"L17","v":"Quaddick"},null,{"$f":"L18","v":"Candlewood "},null,{"$f":"L19","v":"CT River"},null,{"$f":"L20","v":"Hamilton"},null,{"$f":"L21","v":"Lilly"},null,{"$f":"L22","v":"Highland"},null,"Lbs",null,"Total Weight YTD"]
["Name","Weight","Name","Weight","Name","Weight","Name","Weight","Name","Weight","Name","Weight","Name","Weight","Name","Weight","Ytd",null,"Name","Weight"]
[{"$f":"P15","v":"Armand F."},{"$f":"Pachuag!L4","v":4.28},"Armand F.",{"$f":"Zoar!L4","v":3.35},"Armand F.",{"$f":"Quaddic!L4","v":4.54},"Armand F.",{"$f":"Candlewood!L4","v":7.49},"Armand F.",{"$f":"'CT River'!L4","v":2.52},"Armand F.",{"$f":"Hamilton!L4","v":6.02},"Armand F.",{"$f":"Lilly!L4","v":5.74},"Armand F.",{"$f":"Highland!L4","v":7.23},{"$f":"SUM(A47:P47)","v":41.17},null,"Armand F.",{"$f":"Q47","v":41.17}]
[{"$f":"P16","v":"Bill"},{"$f":"Pachuag!L5","v":0},"Bill",{"$f":"Zoar!L5","v":0},"Bill",{"$f":"Quaddic!L5","v":0},"Bill",{"$f":"Candlewood!L5","v":1.43},"Bill",{"$f":"'CT River'!L5","v":2.2400000000000002},"Bill",{"$f":"Hamilton!L5","v":3.65},"Bill",{"$f":"Lilly!L5","v":4.08},"Bill",{"$f":"Highland!L5","v":1.03},12.43,null,"Bill",{"$f":"Q48","v":12.43}]
[{"$f":"P17","v":"Dean"},{"$f":"Pachuag!L6","v":0},"Dean",{"$f":"Zoar!L6","v":3.55},"Dean",{"$f":"Quaddic!L6","v":2.85},"Dean",{"$f":"Candlewood!L6","v":8.7799999999999994},"Dean",{"$f":"'CT River'!L6","v":0.73},"Dean",{"$f":"Hamilton!L6","v":0},"Dean",{"$f":"Lilly!L6","v":7.17},"Dean",{"$f":"Highland!L6","v":0},23.08,null,"Dean",23.08]
[{"$f":"P18","v":"Jack"},{"$f":"Pachuag!L7","v":1.47},"Jack",{"$f":"Zoar!L7","v":0},"Jack",{"$f":"Quaddic!L7","v":3.04},"Jack",{"$f":"Candlewood!L7","v":12.33},"Jack",{"$f":"'CT River'!L7","v":5.14},"Jack",{"$f":"Hamilton!L7","v":4.12},"Jack",{"$f":"Lilly!L7","v":6.18},"Jack",{"$f":"Highland!L7","v":1.1100000000000001},33.39,null,"Jack",33.39]
[{"$f":"P19","v":"Jason"},{"$f":"Pachuag!L8","v":1.08},"Jason",{"$f":"Zoar!L8","v":4.0599999999999996},"Jason",{"$f":"Quaddic!L8","v":5.62},"Jason",{"$f":"Candlewood!L8","v":2.89},"Jason",{"$f":"'CT River'!L8","v":5.88},"Jason",{"$f":"Hamilton!L8","v":3.15},"Jason",{"$f":"Lilly!L8","v":7.79},"Jason",{"$f":"Highland!L8","v":4.09},34.56,null,"Jason",34.56]
["Jeff",{"$f":"Pachuag!L9","v":0},"Jeff",{"$f":"Zoar!L9","v":5.36},"Jeff",{"$f":"Quaddic!L9","v":6.19},"Jeff",{"$f":"Candlewood!L9","v":8.0399999999999991},"Jeff",{"$f":"'CT River'!L9","v":2.81},"Jeff",{"$f":"Hamilton!L9","v":7.09},"Jeff",{"$f":"Lilly!L9","v":8.19},"Jeff",{"$f":"Highland!L9","v":5.82},43.5,null,"Jeff",43.5]
["Jim B",{"$f":"Pachuag!L10","v":0},"Jim B",{"$f":"Zoar!L10","v":5.55},"Jim B",{"$f":"Quaddic!L10","v":3.11},"Jim B",{"$f":"Candlewood!L10","v":3.41},"Jim B",{"$f":"'CT River'!L10","v":0},"Jim B",{"$f":"Hamilton!L10","v":3.73},"Jim B",{"$f":"Lilly!L10","v":0},"Jim B",{"$f":"Highland!L10","v":0},15.8,null,"Jim B",15.8]
["Jim H",{"$f":"Pachuag!L11","v":1.08},"Jim H",{"$f":"Zoar!L11","v":4.82},"Jim H",{"$f":"Quaddic!L11","v":4.3899999999999997},"Jim H",{"$f":"Candlewood!L11","v":3.36},"Jim H",{"$f":"'CT River'!L11","v":0},"Jim H",{"$f":"Hamilton!L11","v":0},"Jim H",{"$f":"Lilly!L11","v":2.89},"Jim H",{"$f":"Highland!L11","v":0},16.54,null,"Jim H",16.54]
["Joe",{"$f":"Pachuag!L12","v":0},"Joe",{"$f":"Zoar!L12","v":0},"Joe",{"$f":"Quaddic!L12","v":4.37},"Joe",{"$f":"Candlewood!L12","v":2.2599999999999998},"Joe",{"$f":"'CT River'!L12","v":0},"Joe",{"$f":"Hamilton!L12","v":4.34},"Joe",{"$f":"Lilly!L12","v":5.54},"Joe",{"$f":"Highland!L12","v":0},16.509999999999998,null,"Joe",16.509999999999998]
["Kevin",{"$f":"Pachuag!L13","v":6.76},"Kevin",{"$f":"Zoar!L13","v":5.54},"Kevin",{"$f":"Quaddic!L13","v":4.88},"Kevin",{"$f":"Candlewood!L13","v":8.27},"Kevin",{"$f":"'CT River'!L13","v":2.61},"Kevin",{"$f":"Hamilton!L13","v":3.91},"Kevin",{"$f":"Lilly!L13","v":8.25},"Kevin",{"$f":"Highland!L13","v":0},40.22,null,"Kevin",40.22]
["Mike",{"$f":"Pachuag!L14","v":0},"Mike",{"$f":"Zoar!L14","v":4.9400000000000004},"Mike",{"$f":"Quaddic!L14","v":2.56},"Mike",{"$f":"Candlewood!L14","v":5.57},"Mike",{"$f":"'CT River'!L14","v":1.03},"Mike",{"$f":"Hamilton!L14","v":4.04},"Mike",{"$f":"Lilly!L14","v":1.02},"Mike",{"$f":"Highland!L14","v":1.79},20.95,null,"Mike",20.95]
["Morrie",{"$f":"Pachuag!L15","v":0.64},"Morrie",{"$f":"Zoar!L15","v":0},"Morrie",{"$f":"Quaddic!L15","v":2.06},"Morrie",{"$f":"Candlewood!L15","v":1.61},"Morrie",{"$f":"'CT River'!L15","v":0},"Morrie",{"$f":"Hamilton!L15","v":2.82},"Morrie",{"$f":"Lilly!L15","v":8.3800000000000008},"Morrie",{"$f":"Highland!L15","v":0},15.510000000000002,null,"Morrie",15.510000000000002]
["Pete",{"$f":"Pachuag!L16","v":7.74},"Pete",{"$f":"Zoar!L16","v":3.63},"Pete",{"$f":"Quaddic!L16","v":6.45},"Pete",{"$f":"Candlewood!L16","v":4.4800000000000004},"Pete",{"$f":"'CT River'!L16","v":0},"Pete",{"$f":"Hamilton!L16","v":7.04},"Pete",{"$f":"Lilly!L16","v":3.92},"Pete",{"$f":"Highland!L16","v":0},33.26,null,"Pete",33.26]
["Rich B",{"$f":"Pachuag!L17","v":1.17},"Rich B",{"$f":"Zoar!L17","v":3.32},"Rich B",{"$f":"Quaddic!L17","v":0},"Rich B",{"$f":"Candlewood!L17","v":4.96},"Rich B",{"$f":"'CT River'!L17","v":4.45},"Rich B",{"$f":"Hamilton!L17","v":2.54},"Rich B",{"$f":"Lilly!L17","v":5.14},"Rich B",{"$f":"Highland!L17","v":3.45},25.029999999999998,null,"Rich B",25.029999999999998]
["Rich T",{"$f":"Pachuag!L18","v":1.71},"Rich T",{"$f":"Zoar!L18","v":0},"Rich T",{"$f":"Quaddic!L18","v":4.6100000000000003},"Rich T",{"$f":"Candlewood!L18","v":7.78},"Rich T",{"$f":"'CT River'!L18","v":2.84},"Rich T",{"$f":"Hamilton!L18","v":0.93},"Rich T",{"$f":"Lilly!L18","v":4.84},"Rich T",{"$f":"Highland!L18","v":0},22.71,null,"Rich T",22.71]
["Ron",{"$f":"Pachuag!L19","v":1.38},"Ron",{"$f":"Zoar!L19","v":0.79},"Ron",{"$f":"Quaddic!L19","v":3.43},"Ron",{"$f":"Candlewood!L19","v":8},"Ron",{"$f":"'CT River'!L19","v":3.99},"Ron",{"$f":"Hamilton!L19","v":6.93},"Ron",{"$f":"Lilly!L19","v":3.48},"Ron",{"$f":"Highland!L19","v":0},28,null,"Ron",28]
["Scott",{"$f":"Pachuag!L20","v":4.8600000000000003},"Scott",{"$f":"Zoar!L20","v":0.89},"Scott",{"$f":"Quaddic!L20","v":5.05},"Scott",{"$f":"Candlewood!L20","v":6.51},"Scott",{"$f":"'CT River'!L20","v":2.94},"Scott",{"$f":"Hamilton!L20","v":6.53},"Scott",{"$f":"Lilly!L20","v":1.86},"Scott",{"$f":"Highland!L20","v":6.8},35.440000000000005,null,"Scott",35.440000000000005]
["Steve D",{"$f":"Pachuag!L21","v":3.38},"Steve D",{"$f":"Zoar!L21","v":7.44},"Steve D",{"$f":"Quaddic!L21","v":6.86},"Steve D",{"$f":"Candlewood!L21","v":10.220000000000001},"Steve D",{"$f":"'CT River'!L21","v":3.11},"Steve D",{"$f":"Hamilton!L21","v":3.3},"Steve D",{"$f":"Lilly!L21","v":7.44},"Steve D",{"$f":"Highland!L21","v":7.37},49.11999999999999,null,"Steve D",49.11999999999999]
["Steve S",{"$f":"Pachuag!L22","v":3.59},"Steve S",{"$f":"Zoar!L22","v":4.8499999999999996},"Steve S",{"$f":"Quaddic!L22","v":0},"Steve S",{"$f":"Candlewood!L22","v":1.51},"Steve S",{"$f":"'CT River'!L22","v":1.1100000000000001},"Steve S",{"$f":"Hamilton!L22","v":1.93},"Steve S",{"$f":"Lilly!L22","v":2.04},"Steve S",{"$f":"Highland!L22","v":0},15.029999999999998,null,"Steve S",15.029999999999998]
["Tom",{"$f":"Pachuag!L23","v":0},"Tom",{"$f":"Zoar!L23","v":3.9},"Tom",{"$f":"Quaddic!L23","v":6.93},"Tom",{"$f":"Candlewood!L23","v":3.34},"Tom",{"$f":"'CT River'!L23","v":0},"Tom",{"$f":"Hamilton!L23","v":5.38},"Tom",{"$f":"Lilly!L23","v":3.55},"Tom",{"$f":"Highland!L23","v":5.54},28.64,null,"Tom",28.64]
[{"$f":"P35","v":"Vinny"},{"$f":"Pachuag!L24","v":0},"Vinny",{"$f":"Zoar!L24","v":0},"Vinny",{"$f":"Quaddic!L24","v":4.54},"Vinny",{"$f":"Candlewood!L24","v":0},"Vinny",{"$f":"'CT River'!L24","v":0},"Vinny",{"$f":"Hamilton!L24","v":7.06},"Vinny",{"$f":"Lilly!L24","v":0},"Vinny",{"$f":"Highland!L24","v":0},11.6,null,"Vinny",11.6]
["X",{"$f":"Pachuag!L25","v":0},"X",{"$f":"Zoar!L25","v":0},"X",{"$f":"Quaddic!L25","v":0},"X",{"$f":"Candlewood!L25","v":0},"X",{"$f":"'CT River'!L25","v":0},"X",{"$f":"Hamilton!L25","v":0},"X",{"$f":"Lilly!L25","v":0},"X",{"$f":"Highland!L25","v":0},0,null,"X",0]
["X",{"$f":"Pachuag!L26","v":0},"X",{"$f":"Zoar!L26","v":0},"X",{"$f":"Quaddic!L26","v":0},"X",{"$f":"Candlewood!L26","v":0},"X",{"$f":"'CT River'!L26","v":0},"X",{"$f":"Hamilton!L26","v":0},"X",{"$f":"Lilly!L26","v":0},"X",{"$f":"Highland!L26","v":0},0,null,"X",0]
["X",{"$f":"Pachuag!L27","v":0},"X",{"$f":"Zoar!L27","v":0},"X",{"$f":"Quaddic!L27","v":0},"X",{"$f":"Candlewood!L27","v":0},"X",{"$f":"'CT River'!L27","v":0},"X",{"$f":"Hamilton!L27","v":0},"X",{"$f":"Lilly!L27","v":0},"X",{"$f":"Highland!L27","v":0},0,null,"X",0]
["X",{"$f":"Pachuag!L28","v":0},"X",{"$f":"Zoar!L28","v":0},"X",{"$f":"Quaddic!L28","v":0},"X",{"$f":"Candlewood!L28","v":0},"X",{"$f":"'CT River'!L28","v":0},"X",{"$f":"Hamilton!L28","v":0},"X",{"$f":"Lilly!L28","v":0},"X",{"$f":"Highland!L28","v":0},0,null,"X",0]
["X",{"$f":"Pachuag!L29","v":0},"X",{"$f":"Zoar!L29","v":0},"X",{"$f":"Quaddic!L29","v":0},"X",{"$f":"Candlewood!L29","v":0},"X",{"$f":"'CT River'!L29","v":0},"X",{"$f":"Hamilton!L29","v":0},"X",{"$f":"Lilly!L29","v":0},"X",{"$f":"Highland!L29","v":0},0,null,"X",0]
[]
["Lunkers"]
[{"$f":"A45","v":"Pachaug"},null,null,{"$f":"C45","v":"Zoar"},null,null,{"$f":"E45","v":"Quaddick"},null,null,{"$f":"G45","v":"Candlewood "},null,null,{"$f":"I45","v":"CT River"},null,null,{"$f":"K45","v":"Hamilton"},null,null,{"$f":"M45","v":"Lilly"},null,null,{"$f":"O45","v":"Highland"}]
["Name","Weight","L or S","Name","Weight","L or S","Name","Weight","L or S","Name","Weight","L or S","Name","Weight","L or S","Name","Weight","L or S","Name","Weight","L or S","Name","Weight","L or S"]
["Armand F.",{"$f":"Pachuag!J4","v":0},{"$f":"Pachuag!K4","v":0},"Armand F.",{"$f":"Zoar!J4","v":0},{"$f":"Pachuag!N4","v":4.28},"Armand F.",{"$f":"Quaddic!J4","v":0},{"$f":"Quaddic!K4","v":0},"Armand F.",{"$f":"Candlewood!J4","v":0},{"$f":"Candlewood!K4","v":0},"Armand F.",{"$f":"'CT River'!J4","v":0},{"$f":"'CT River'!K4","v":0},"Armand F.",{"$f":"Hamilton!J4","v":0},{"$f":"Hamilton!K4","v":0},"Armand F.",{"$f":"Lilly!J4","v":0},{"$f":"Lilly!K4","v":0},"Armand F.",{"$f":"Highland!J4","v":0},{"$f":"Highland!K4","v":0}]
["Bill",{"$f":"Pachuag!J5","v":0},{"$f":"Pachuag!K5","v":0},"Bill",{"$f":"Zoar!J5","v":0},{"$f":"Pachuag!N5","v":0},"Bill",{"$f":"Quaddic!J25","v":0},{"$f":"Quaddic!K25","v":0},"Bill",{"$f":"Candlewood!J5","v":0},{"$f":"Candlewood!K5","v":0},"Bill",{"$f":"'CT River'!J24","v":0},{"$f":"'CT River'!K24","v":0},"Bill",{"$f":"Hamilton!J24","v":0},{"$f":"Hamilton!K24","v":0},"Bill",{"$f":"Lilly!J24","v":0},{"$f":"Lilly!K24","v":0},"Bill",{"$f":"Highland!J24","v":0},{"$f":"Highland!K24","v":0}]
["Dean",{"$f":"Pachuag!J6","v":0},{"$f":"Pachuag!K6","v":0},"Dean",{"$f":"Zoar!J6","v":0},{"$f":"Pachuag!N6","v":0},"Dean",{"$f":"Quaddic!J5","v":0},{"$f":"Quaddic!K5","v":0},"Dean",{"$f":"Candlewood!J6","v":0},{"$f":"Candlewood!K6","v":0},"Dean",{"$f":"'CT River'!J5","v":0},{"$f":"'CT River'!K5","v":0},"Dean",{"$f":"Hamilton!J5","v":0},{"$f":"Hamilton!K5","v":0},"Dean",{"$f":"Lilly!J5","v":0},{"$f":"Lilly!K5","v":0},"Dean",{"$f":"Highland!J5","v":0},{"$f":"Highland!K5","v":0}]
["Jack",{"$f":"Pachuag!J7","v":0},{"$f":"Pachuag!K7","v":0},"Jack",{"$f":"Zoar!J7","v":0},{"$f":"Pachuag!N7","v":1.47},"Jack",{"$f":"Quaddic!J6","v":0},{"$f":"Quaddic!K6","v":0},"Jason",{"$f":"Candlewood!J8","v":0},{"$f":"Candlewood!K8","v":0},"Jack",{"$f":"'CT River'!J6","v":0},{"$f":"'CT River'!K6","v":0},"Jack",{"$f":"Hamilton!J6","v":0},{"$f":"Hamilton!K6","v":0},"Jack",{"$f":"Lilly!J6","v":0},{"$f":"Lilly!K6","v":0},"Jack",{"$f":"Highland!J6","v":0},{"$f":"Highland!K6","v":0}]
["Jason",{"$f":"Pachuag!J8","v":0},{"$f":"Pachuag!K8","v":0},"Jason",{"$f":"Zoar!J8","v":0},{"$f":"Pachuag!N8","v":1.08},"Jason",{"$f":"Quaddic!J8","v":0},{"$f":"Quaddic!K8","v":0},"Jeff",{"$f":"Candlewood!J9","v":0},{"$f":"Candlewood!K9","v":0},"Jeff",{"$f":"'CT River'!J8","v":0},{"$f":"'CT River'!K8","v":0},"Jason",{"$f":"Hamilton!J7","v":0},{"$f":"Hamilton!K7","v":0},"Jason",{"$f":"Lilly!J7","v":0},{"$f":"Lilly!K7","v":0},"Jason",{"$f":"Highland!J7","v":0},{"$f":"Highland!K7","v":0}]
["Jeff",{"$f":"Pachuag!J9","v":0},{"$f":"Pachuag!K9","v":0},"Jeff",{"$f":"Zoar!J9","v":0},{"$f":"Pachuag!N9","v":0},"Jim B",{"$f":"Quaddic!J10","v":0},{"$f":"Quaddic!K10","v":0},"Jim B",{"$f":"Candlewood!J10","v":0},{"$f":"Candlewood!K10","v":0},"Jim B",{"$f":"'CT River'!J9","v":0},{"$f":"'CT River'!K9","v":0},"Jeff",{"$f":"Hamilton!J8","v":0},{"$f":"Hamilton!K8","v":0},"Jim B",{"$f":"Lilly!J9","v":0},{"$f":"Lilly!K9","v":0},"Jim H",{"$f":"Highland!J10","v":0},{"$f":"Highland!K10","v":0}]
["Jim B",{"$f":"Pachuag!J10","v":0},{"$f":"Pachuag!K10","v":0},"Jim B",{"$f":"Zoar!J10","v":0},{"$f":"Pachuag!N10","v":0},"Jim H",{"$f":"Quaddic!J11","v":0},{"$f":"Quaddic!K11","v":0},"Jim H",{"$f":"Candlewood!J11","v":0},{"$f":"Candlewood!K11","v":0},"Jim H",{"$f":"'CT River'!J10","v":0},{"$f":"'CT River'!K10","v":0},"Jim B",{"$f":"Hamilton!J9","v":0},{"$f":"Hamilton!K9","v":0},"Jim H",{"$f":"Lilly!J10","v":0},{"$f":"Lilly!K10","v":0},"Joe",{"$f":"Highland!J11","v":0},{"$f":"Highland!K11","v":0}]
["Jim H",{"$f":"Pachuag!J11","v":0},{"$f":"Pachuag!K11","v":0},"Jim H",{"$f":"Zoar!J11","v":0},{"$f":"Pachuag!N11","v":1.08},"Joe",{"$f":"Quaddic!J12","v":0},{"$f":"Quaddic!K12","v":0},"Joe",{"$f":"Candlewood!J12","v":0},{"$f":"Candlewood!K12","v":0},"Joe",{"$f":"'CT River'!J11","v":0},{"$f":"'CT River'!K11","v":0},"Jim H",{"$f":"Hamilton!J10","v":0},{"$f":"Hamilton!K10","v":0},"Joe",{"$f":"Lilly!J11","v":0},{"$f":"Lilly!K11","v":0},"Kevin",{"$f":"Highland!J12","v":0},{"$f":"Highland!K12","v":0}]
["Joe",{"$f":"Pachuag!J12","v":0},{"$f":"Pachuag!K12","v":0},"Joe",{"$f":"Zoar!J12","v":0},{"$f":"Pachuag!N12","v":0},"Kevin",{"$f":"Quaddic!J14","v":0},{"$f":"Quaddic!K14","v":0},"Kevin",{"$f":"Candlewood!J13","v":0},{"$f":"Candlewood!K13","v":0},"Kevin",{"$f":"'CT River'!J12","v":0},{"$f":"'CT River'!K12","v":0},"Joe",{"$f":"Hamilton!J11","v":0},{"$f":"Hamilton!K11","v":0},"Mike",{"$f":"Lilly!J13","v":0},{"$f":"Lilly!K13","v":0},"Mike",{"$f":"Highland!J13","v":0},{"$f":"Highland!K13","v":0}]
["Kevin",{"$f":"Pachuag!J13","v":0},{"$f":"Pachuag!K13","v":0},"Kevin",{"$f":"Zoar!J13","v":0},{"$f":"Pachuag!N13","v":6.76},"Mike",{"$f":"Quaddic!J15","v":0},{"$f":"Quaddic!K15","v":0},"Mike",{"$f":"Candlewood!J14","v":0},{"$f":"Candlewood!K14","v":0},"Mike",{"$f":"'CT River'!J13","v":0},{"$f":"'CT River'!K13","v":0},"Mike",{"$f":"Hamilton!J13","v":0},{"$f":"Hamilton!K13","v":0},"Morrie",{"$f":"Lilly!J14","v":0},{"$f":"Lilly!K14","v":0},"Morrie",{"$f":"Highland!J14","v":0},{"$f":"Highland!K14","v":0}]
["Mike",{"$f":"Pachuag!J14","v":0},{"$f":"Pachuag!K14","v":0},"Mike",{"$f":"Zoar!J14","v":0},{"$f":"Pachuag!N14","v":0},"Morrie",{"$f":"Quaddic!J16","v":0},{"$f":"Quaddic!K16","v":0},"Morrie",{"$f":"Candlewood!J15","v":0},{"$f":"Candlewood!K15","v":0},"Morrie",{"$f":"'CT River'!J14","v":0},{"$f":"'CT River'!K14","v":0},"Morrie",{"$f":"Hamilton!J14","v":0},{"$f":"Hamilton!K14","v":0},"Rich B",{"$f":"Lilly!J16","v":0},{"$f":"Lilly!K16","v":0},"Pete",{"$f":"Highland!J15","v":0},{"$f":"Highland!K15","v":0}]
["Morrie",{"$f":"Pachuag!J15","v":0},{"$f":"Pachuag!K15","v":0},"Morrie",{"$f":"Zoar!J15","v":0},{"$f":"Pachuag!N15","v":0.64},"Pete",{"$f":"Quaddic!J17","v":0},{"$f":"Quaddic!K17","v":0},"Pete",{"$f":"Candlewood!J16","v":0},{"$f":"Candlewood!K16","v":0},"Pete",{"$f":"'CT River'!J15","v":0},{"$f":"'CT River'!K15","v":0},"Rich B",{"$f":"Hamilton!J16","v":0},{"$f":"Hamilton!K16","v":0},"Rich T",{"$f":"Lilly!J17","v":0},{"$f":"Lilly!K17","v":0},"Rich B",{"$f":"Highland!J16","v":0},{"$f":"Highland!K16","v":0}]
["Pete",{"$f":"Pachuag!J16","v":0},{"$f":"Pachuag!K16","v":0},"Pete",{"$f":"Zoar!J16","v":0},{"$f":"Pachuag!N16","v":7.74},"Rich B",{"$f":"Quaddic!J18","v":0},{"$f":"Quaddic!K18","v":0},"Rich B",{"$f":"Candlewood!J17","v":0},{"$f":"Candlewood!K17","v":0},"Rich B",{"$f":"'CT River'!J16","v":0},{"$f":"'CT River'!K16","v":0},"Rich T",{"$f":"Hamilton!J17","v":0},{"$f":"Hamilton!K17","v":0},"Ron",{"$f":"Lilly!J18","v":0},{"$f":"Lilly!K18","v":0},"Rich T",{"$f":"Highland!J17","v":0},{"$f":"Highland!K17","v":0}]
["Rich B",{"$f":"Pachuag!J17","v":0},{"$f":"Pachuag!K17","v":0},"Rich B",{"$f":"Zoar!J17","v":0},{"$f":"Pachuag!N17","v":1.17},"Rich T",{"$f":"Quaddic!J20","v":0},{"$f":"Quaddic!K20","v":0},"Rich T",{"$f":"Candlewood!J18","v":0},{"$f":"Candlewood!K18","v":0},"Rich T",{"$f":"'CT River'!J17","v":0},{"$f":"'CT River'!K17","v":0},"Ron",{"$f":"Hamilton!J18","v":0},{"$f":"Hamilton!K18","v":0},"Scott",{"$f":"Lilly!J19","v":0},{"$f":"Lilly!K19","v":0},"Ron",{"$f":"Highland!J18","v":0},{"$f":"Highland!K18","v":0}]
["Rich T",{"$f":"Pachuag!J18","v":0},{"$f":"Pachuag!K18","v":0},"Rich T",{"$f":"Zoar!J18","v":0},{"$f":"Pachuag!N18","v":1.71},"Scott",{"$f":"Quaddic!J22","v":0},{"$f":"Quaddic!K22","v":0},"Ron",{"$f":"Candlewood!J19","v":0},{"$f":"Candlewood!K19","v":0},"Ron",{"$f":"'CT River'!J18","v":0},{"$f":"'CT River'!K18","v":0},"Scott",{"$f":"Hamilton!J19","v":0},{"$f":"Hamilton!K19","v":0},"Steve D",{"$f":"Lilly!J20","v":0},{"$f":"Lilly!K20","v":0},"Scott",{"$f":"Highland!J19","v":0},{"$f":"Highland!K19","v":0}]
["Ron",{"$f":"Pachuag!J19","v":0},{"$f":"Pachuag!K19","v":0},"Ron",{"$f":"Zoar!J19","v":0},{"$f":"Pachuag!N19","v":1.38},"Steve D",{"$f":"Quaddic!J23","v":0},{"$f":"Quaddic!K23","v":0},"Scott",{"$f":"Candlewood!J20","v":0},{"$f":"Candlewood!K20","v":0},"Scott",{"$f":"'CT River'!J19","v":0},{"$f":"'CT River'!K19","v":0},"Steve D",{"$f":"Hamilton!J20","v":0},{"$f":"Hamilton!K20","v":0},"Steve S",{"$f":"Lilly!J21","v":0},{"$f":"Lilly!K21","v":0},"Steve D",{"$f":"Highland!J20","v":0},{"$f":"Highland!K20","v":0}]
["Scott",{"$f":"Pachuag!J20","v":0},{"$f":"Pachuag!K20","v":0},"Scott",{"$f":"Zoar!J20","v":0},{"$f":"Pachuag!N20","v":4.8600000000000003},"Steve S",{"$f":"Quaddic!J24","v":0},{"$f":"Quaddic!K24","v":0},"Steve D",{"$f":"Candlewood!J21","v":0},{"$f":"Candlewood!K21","v":0},"Steve D",{"$f":"'CT River'!J20","v":0},{"$f":"'CT River'!K20","v":0},"Steve S",{"$f":"Hamilton!J21","v":0},{"$f":"Hamilton!K21","v":0},"Tom",{"$f":"Lilly!J22","v":0},{"$f":"Lilly!K22","v":0},"Steve S",{"$f":"Highland!J21","v":0},{"$f":"Highland!K21","v":0}]
["Steve D",{"$f":"Pachuag!J21","v":0},{"$f":"Pachuag!K21","v":0},"Steve D",{"$f":"Zoar!J21","v":0},{"$f":"Pachuag!N21","v":3.38},"Tom",{"$f":"Pachuag!P23","v":0},0,"Steve S",{"$f":"Candlewood!J22","v":0},{"$f":"Candlewood!K22","v":0},"Steve S",{"$f":"'CT River'!J21","v":0},{"$f":"'CT River'!K21","v":0},"Tom",{"$f":"Hamilton!J22","v":0},{"$f":"Hamilton!K22","v":0},"Vinny",{"$f":"Lilly!J23","v":0},{"$f":"Lilly!K23","v":0},"Tom",{"$f":"Highland!J22","v":0},{"$f":"Highland!K22","v":0}]
["Tom",{"$f":"Pachuag!J23","v":0},{"$f":"Pachuag!K23","v":0},"Tom",{"$f":"Zoar!J23","v":0},{"$f":"Pachuag!N23","v":0},"Vinny",{"$f":"Pachuag!P24","v":0},0,"Tom",{"$f":"Candlewood!J23","v":0},{"$f":"Candlewood!K23","v":0},"Tom",{"$f":"'CT River'!J22","v":0},{"$f":"'CT River'!K22","v":0},"X",{"$f":"Hamilton!J25","v":0},{"$f":"Hamilton!K25","v":0},"X",{"$f":"Lilly!J25","v":0},{"$f":"Lilly!K25","v":0},"X",{"$f":"Highland!J25","v":0},{"$f":"Highland!K25","v":0}]
["Vinny",{"$f":"Pachuag!J24","v":0},{"$f":"Pachuag!K24","v":0},"Vinny",{"$f":"Zoar!J24","v":0},{"$f":"Pachuag!N24","v":0},"X",{"$f":"Pachuag!P25","v":0},0,"Vinny",{"$f":"Candlewood!J24","v":0},{"$f":"Candlewood!K24","v":0},"Vinny",{"$f":"'CT River'!J23","v":0},{"$f":"'CT River'!K23","v":0},"X",{"$f":"Hamilton!J26","v":0},{"$f":"Hamilton!K26","v":0},"X",{"$f":"Lilly!J26","v":0},{"$f":"Lilly!K26","v":0},"X",{"$f":"Highland!J26","v":0},{"$f":"Highland!K26","v":0}]
["X",{"$f":"Pachuag!J25","v":0},{"$f":"Pachuag!K25","v":0},"X",{"$f":"Zoar!J25","v":0},{"$f":"Pachuag!N25","v":0},"X",{"$f":"Pachuag!P26","v":0},0,"X",{"$f":"Candlewood!J25","v":0},{"$f":"Candlewood!K25","v":0},"X",{"$f":"'CT River'!J24","v":0},{"$f":"'CT River'!K25","v":0},"X",{"$f":"Hamilton!J27","v":0},{"$f":"Hamilton!K27","v":0},"X",{"$f":"Lilly!J27","v":0},{"$f":"Lilly!K27","v":0},"X",{"$f":"Highland!J27","v":0},{"$f":"Highland!K27","v":0}]
["X",{"$f":"Pachuag!J26","v":0},{"$f":"Pachuag!K26","v":0},"X",{"$f":"Zoar!J26","v":0},{"$f":"Pachuag!N26","v":0},"X",{"$f":"Pachuag!P27","v":0},0,"X",{"$f":"Candlewood!J26","v":0},{"$f":"Candlewood!K26","v":0},"X",{"$f":"'CT River'!J25","v":0},{"$f":"'CT River'!K26","v":0},"X",{"$f":"Hamilton!J28","v":0},{"$f":"Hamilton!K28","v":0},"X",{"$f":"Lilly!J28","v":0},{"$f":"Lilly!K28","v":0},"X",{"$f":"Highland!J28","v":0},{"$f":"Highland!K28","v":0}]
["X",{"$f":"Pachuag!J27","v":0},{"$f":"Pachuag!K27","v":0},"X",{"$f":"Zoar!J27","v":0},{"$f":"Pachuag!N27","v":0},"X",{"$f":"Pachuag!P28","v":0},0,"X",{"$f":"Candlewood!J27","v":0},{"$f":"Candlewood!K27","v":0},"X",{"$f":"'CT River'!J26","v":0},{"$f":"'CT River'!K27","v":0},"X",{"$f":"Hamilton!J29","v":0},{"$f":"Hamilton!K29","v":0},"X",{"$f":"Lilly!J29","v":0},{"$f":"Lilly!K29","v":0},"X",{"$f":"Highland!J29","v":0},{"$f":"Highland!K29","v":0}]
["X",{"$f":"Pachuag!J28","v":0},{"$f":"Pachuag!K28","v":0},"X",{"$f":"Zoar!J28","v":0},{"$f":"Pachuag!N28","v":0},{"$f":"G99","v":"X"},{"$f":"H99","v":0},null,"X",{"$f":"Candlewood!J28","v":0},{"$f":"Candlewood!K28","v":0},"X",{"$f":"'CT River'!J27","v":0},{"$f":"'CT River'!K28","v":0},"Vinny",{"$f":"Hamilton!J23","v":1.27},{"$f":"Hamilton!K23","v":"LMB"},"Kevin",{"$f":"Lilly!J12","v":3.83},{"$f":"Lilly!K12","v":"LMB "},"Vinny",{"$f":"Highland!J23","v":2.04},{"$f":"Highland!K23","v":"lmb "}]
[{"$f":"P39","v":"X"},{"$f":"Pachuag!J29","v":0},{"$f":"Pachuag!K29","v":0},"X",{"$f":"Zoar!J29","v":0},{"$f":"Pachuag!N29","v":0},"Ron",{"$f":"Quaddic!J21","v":3.37},{"$f":"Quaddic!K21","v":0},"X",{"$f":"Candlewood!J29","v":0},{"$f":"Candlewood!K29","v":0},"X",{"$f":"'CT River'!J28","v":0},{"$f":"'CT River'!K29","v":0},"Kevin",{"$f":"Hamilton!J12","v":2.54},{"$f":"Hamilton!K12","v":"LMB"},"Pete",{"$f":"Lilly!J15","v":3.87},{"$f":"Lilly!K15","v":"LMB "},"Jeff",{"$f":"Highland!J8","v":3.15},{"$f":"Highland!K8","v":"smb"}]
["Steve S",{"$f":"Pachuag!J22","v":3.59},{"$f":"Pachuag!K22","v":"LMB "},"Steve S",{"$f":"Zoar!J22","v":3.57},{"$f":"Pachuag!N22","v":3.59},"Jeff",{"$f":"Quaddic!J9","v":3.62},{"$f":"Quaddic!K9","v":"lmb"},"Jack",{"$f":"Candlewood!J7","v":3.53},{"$f":"Candlewood!K7","v":"LMB"},"Jason",{"$f":"'CT River'!J7","v":2.0299999999999998},{"$f":"'CT River'!K7","v":"lmb "},"Pete",{"$f":"Hamilton!J15","v":2.82},{"$f":"Hamilton!K15","v":"LMB"},"Jeff",{"$f":"Lilly!J8","v":4.2300000000000004},{"$f":"Lilly!K8","v":"SMB"},"Jim B",{"$f":"Highland!J9","v":3.47},{"$f":"Highland!K9","v":"LMB "}]
[{"$f":"A102","v":"Steve S"},{"$f":"B102","v":3.59},{"$f":"C102","v":"LMB "},{"$f":"D102","v":"Steve S"},3.57,{"$f":"F102","v":3.59},{"$f":"G102","v":"Jeff"},{"$f":"H102","v":3.62},null,"Jack",3.53,"LMB","Jason",2.0299999999999998,"lmb ","Pete",2.82,"LMB","Jeff",4.2300000000000004,"SMB","Jim B",3.47,"LMB "]

{"sheet":"Report","index":10,"n_rows":34,"n_cols":12,"rows_kept":34,"cut":false,"hidden":false,"merged":[[48,0,48,2],[2,10,2,11],[2,4,2,8],[2,0,2,2],[27,5,27,6],[30,5,30,6],[25,5,25,6],[25,7,25,8],[26,5,26,6],[28,5,28,6],[29,5,29,6],[30,7,30,8],[0,0,0,11],[26,7,26,8],[28,7,28,8],[29,7,29,8],[27,7,27,8],[31,7,31,8],[31,5,31,6],[32,5,32,6],[33,5,33,6],[32,7,32,8],[33,7,33,8]]}
["MVBC 2015 Year-To-Date Report"]
[]
["Individual Standings",null,null,null,"Lunkers",null,null,null,null,null,"Individual Total Weight"]
["Name","Position","Points",null,"Lake / River","Name","Weight","Species","Trophy",null,"Name","Weight"]
[{"$f":"YTD!E15","v":"Steve D"},{"$f":"YTD!F15","v":1},{"$f":"YTD!G15","v":15},null,{"$f":"YTD!L15","v":"Pachaug"},{"$f":"IF(YTD!A103=\"X\",\"N/A\",YTD!A103)","v":"Steve S"},{"$f":"YTD!B103","v":3.59},{"$f":"IF(YTD!C103=0,\"N/A\",YTD!C103)","v":"LMB "},{"$f":"IF((H5=\"LMB\")*AND(G5>=6),\"Yes\",IF((H5=\"SMB\")*AND(G5>=4),\"Yes\",\"No\"))","v":"No"},null,{"$f":"YTD!S64","v":"Steve D"},{"$f":"YTD!T64","v":49.11999999999999}]
[{"$f":"YTD!E16","v":"Jeff"},{"$f":"YTD!F16","v":2},{"$f":"YTD!G16","v":21},null,{"$f":"YTD!L16","v":"Zoar"},{"$f":"IF(YTD!D103=\"X\",\"N/A\",YTD!D103)","v":"Steve S"},{"$f":"YTD!E103","v":3.57},"SMB",{"$f":"IF((H6=\"LMB\")*AND(G6>=6),\"Yes\",IF((H6=\"SMB\")*AND(G6>=4),\"Yes\",\"No\"))","v":"No"},null,{"$f":"YTD!S52","v":"Jeff"},{"$f":"YTD!T52","v":43.5}]
[{"$f":"YTD!E17","v":"Kevin"},{"$f":"YTD!F17","v":3},{"$f":"YTD!G17","v":27},null,{"$f":"YTD!L17","v":"Quaddick"},{"$f":"IF(YTD!G103=\"X\",\"N/A\",YTD!G103)","v":"Jeff"},{"$f":"YTD!H103","v":3.62},{"$f":"IF(YTD!I103=0,\"N/A\",YTD!I103)","v":"N/A"},"No",null,{"$f":"YTD!S47","v":"Armand F."},{"$f":"YTD!T47","v":41.17}]
[{"$f":"YTD!E18","v":"Scott"},{"$f":"YTD!F18","v":4},{"$f":"YTD!G18","v":32},null,{"$f":"YTD!L18","v":"Candlewood "},{"$f":"IF(YTD!J103=\"X\",\"N/A\",YTD!J103)","v":"Jack"},{"$f":"YTD!K103","v":3.53},{"$f":"IF(YTD!L103=0,\"N/A\",YTD!L103)","v":"LMB"},"No",null,{"$f":"YTD!S56","v":"Kevin"},{"$f":"YTD!T56","v":40.22}]
[{"$f":"YTD!E19","v":"Jason"},{"$f":"YTD!F19","v":5},{"$f":"YTD!G19","v":35},null,{"$f":"YTD!L19","v":"CT River"},{"$f":"IF(YTD!M103=\"X\",\"N/A\",YTD!J103)","v":"Jack"},{"$f":"YTD!N103","v":2.0299999999999998},{"$f":"IF(YTD!O103=0,\"N/A\",YTD!O103)","v":"lmb "},{"$f":"IF((H9=\"LMB\")*AND(G9>=6),\"Yes\",IF((H9=\"SMB\")*AND(G9>=4),\"Yes\",\"No\"))","v":"No"},null,{"$f":"YTD!S63","v":"Scott"},{"$f":"YTD!T63","v":35.440000000000005}]
[{"$f":"YTD!E20","v":"Jack"},{"$f":"YTD!F20","v":6},{"$f":"YTD!G20","v":36},null,{"$f":"YTD!L20","v":"Hamilton"},"Morrie",{"$f":"YTD!Q103","v":2.82},{"$f":"IF(YTD!R103=0,\"N/A\",YTD!R103)","v":"LMB"},{"$f":"IF((H10=\"LMB\")*AND(G10>=6),\"Yes\",IF((H10=\"SMB\")*AND(G10>=4),\"Yes\",\"No\"))","v":"No"},null,{"$f":"YTD!S51","v":"Jason"},{"$f":"YTD!T51","v":34.56}]
[{"$f":"YTD!E21","v":"Armand F."},{"$f":"YTD!F21","v":7},{"$f":"YTD!G21","v":37},null,{"$f":"YTD!L21","v":"Lilly"},"Jason",{"$f":"YTD!T103","v":4.2300000000000004},{"$f":"IF(YTD!U103=0,\"N/A\",YTD!U103)","v":"SMB"},"Yes",null,{"$f":"YTD!S50","v":"Jack"},{"$f":"YTD!T50","v":33.39}]
[{"$f":"YTD!E22","v":"Pete"},{"$f":"YTD!F22","v":8},{"$f":"YTD!G22","v":42},null,{"$f":"YTD!L22","v":"Highland"},"Jeff",{"$f":"YTD!W103","v":3.47},{"$f":"IF(YTD!X103=0,\"N/A\",YTD!X103)","v":"LMB "},{"$f":"IF((H12=\"LMB\")*AND(G12>=6),\"Yes\",IF((H12=\"SMB\")*AND(G12>=4),\"Yes\",\"No\"))","v":"No"},null,{"$f":"YTD!S59","v":"Pete"},{"$f":"YTD!T59","v":33.26}]
[{"$f":"YTD!E23","v":"Ron"},{"$f":"YTD!F23","v":9},{"$f":"YTD!G23","v":51},null,null,null,null,null,null,null,{"$f":"YTD!S66","v":"Tom"},{"$f":"YTD!T66","v":28.64}]
[{"$f":"YTD!E24","v":"Tom"},{"$f":"YTD!F24","v":10},{"$f":"YTD!G24","v":52},null,"Statistics",null,null,null,null,null,{"$f":"YTD!S62","v":"Ron"},{"$f":"YTD!T62","v":28}]
[{"$f":"YTD!E25","v":"Rich B"},{"$f":"YTD!F25","v":11},{"$f":"YTD!G25","v":54},null,"Lake / River","Anglers","Fish","Total Wt","Avg Wt",null,{"$f":"YTD!S60","v":"Rich B"},{"$f":"YTD!T60","v":25.029999999999998}]
[{"$f":"YTD!E26","v":"Rich T"},{"$f":"YTD!F26","v":12},{"$f":"YTD!G26","v":59},null,{"$f":"YTD!L15","v":"Pachaug"},{"$f":"Pachuag!E30","v":17},{"$f":"Pachuag!M30","v":27},{"$f":"Pachuag!L30","v":39.14},{"$f":"IF(G16=0,0,H16/G16)","v":1.4496296296296296},null,{"$f":"YTD!S49","v":"Dean"},{"$f":"YTD!T49","v":23.08}]
[{"$f":"YTD!E27","v":"Mike"},{"$f":"YTD!F27","v":13},{"$f":"YTD!G27","v":63},null,{"$f":"YTD!L16","v":"Zoar"},{"$f":"Zoar!E30","v":19},{"$f":"Zoar!M30","v":44},{"$f":"Zoar!L30","v":61.99},1.4088636363636364,null,{"$f":"YTD!S61","v":"Rich T"},{"$f":"YTD!T61","v":22.71}]
[{"$f":"YTD!E28","v":"Steve S"},{"$f":"YTD!F28","v":14},{"$f":"YTD!G28","v":77},null,{"$f":"YTD!L17","v":"Quaddick"},{"$f":"Quaddic!E30","v":21},{"$f":"Quaddic!M30","v":73},{"$f":"Quaddic!L30","v":81.48},1.1161643835616439,null,{"$f":"YTD!S57","v":"Mike"},{"$f":"YTD!T57","v":20.95}]
[{"$f":"YTD!E29","v":"Dean"},{"$f":"YTD!F29","v":15},{"$f":"YTD!G29","v":80},null,{"$f":"YTD!L18","v":"Candlewood "},{"$f":"Candlewood!E30","v":21},{"$f":"Candlewood!M30","v":66},{"$f":"Candlewood!L30","v":112.24000000000002},1.7006060606060609,null,{"$f":"YTD!S54","v":"Jim H"},{"$f":"YTD!T54","v":16.54}]
[{"$f":"YTD!E30","v":"Jim H"},{"$f":"YTD!F30","v":16},{"$f":"YTD!G30","v":89},null,{"$f":"YTD!L19","v":"CT River"},{"$f":"'CT River'!E30","v":20},{"$f":"'CT River'!M30","v":33},{"$f":"'CT River'!L30","v":41.399999999999991},1.2545454545454542,null,{"$f":"YTD!S55","v":"Joe"},{"$f":"YTD!T55","v":16.509999999999998}]
[{"$f":"YTD!E31","v":"Bill"},{"$f":"YTD!F31","v":17},{"$f":"YTD!G31","v":95},null,{"$f":"YTD!L20","v":"Hamilton"},{"$f":"Hamilton!E30","v":19},{"$f":"Hamilton!M30","v":66},{"$f":"Hamilton!L30","v":84.509999999999991},1.2804545454545453,null,{"$f":"YTD!S53","v":"Jim B"},{"$f":"YTD!T53","v":15.8}]
[{"$f":"YTD!E32","v":"Morrie"},{"$f":"YTD!F32","v":18},{"$f":"YTD!G32","v":96},null,{"$f":"YTD!L21","v":"Lilly"},{"$f":"Lilly!E30","v":20},{"$f":"Lilly!M30","v":70},{"$f":"Lilly!L30","v":97.500000000000014},1.392857142857143,null,{"$f":"YTD!S58","v":"Morrie"},{"$f":"YTD!T58","v":15.510000000000002}]
[{"$f":"YTD!E33","v":"Joe"},{"$f":"YTD!F33","v":19},{"$f":"YTD!G33","v":106},null,{"$f":"YTD!L22","v":"Highland"},{"$f":"Highland!E30","v":16},{"$f":"Highland!M30","v":29},{"$f":"Highland!L30","v":44.23},1.5251724137931033,null,{"$f":"YTD!S65","v":"Steve S"},{"$f":"YTD!T65","v":15.029999999999998}]
[{"$f":"YTD!E34","v":"Jim B"},{"$f":"YTD!F34","v":20},{"$f":"YTD!G34","v":107},null,null,null,null,null,null,null,{"$f":"YTD!S48","v":"Bill"},{"$f":"YTD!T48","v":12.43}]
[{"$f":"YTD!E35","v":"Vinny"},{"$f":"YTD!F35","v":21},{"$f":"YTD!G35","v":141},null,"Winning Teams",null,null,null,null,null,{"$f":"YTD!S67","v":"Vinny"},{"$f":"YTD!T67","v":11.6}]
[{"$f":"YTD!E36","v":"X"},{"$f":"YTD!F36","v":22},{"$f":"YTD!G36","v":210},null,"Lake / River","Team Number",null,"Total Weight",null,null,{"$f":"YTD!S68","v":"X"},{"$f":"YTD!T68","v":0}]
[{"$f":"YTD!E37","v":"X"},{"$f":"YTD!F37","v":22},{"$f":"YTD!G37","v":210},null,{"$f":"YTD!L15","v":"Pachaug"},{"$f":"IF(Teams!N4=20,\"N/A\",Teams!N4)","v":4},null,{"$f":"Teams!O4","v":14.5},null,null,{"$f":"YTD!S69","v":"X"},{"$f":"YTD!T69","v":0}]
[{"$f":"YTD!E38","v":"X"},{"$f":"YTD!F38","v":22},{"$f":"YTD!G38","v":210},null,{"$f":"YTD!L16","v":"Zoar"},{"$f":"IF(Teams!N34=20,\"N/A\",Teams!N34)","v":4},null,{"$f":"Teams!O34","v":12.99},null,null,{"$f":"YTD!S70","v":"X"},{"$f":"YTD!T70","v":0}]
[{"$f":"YTD!E39","v":"X"},{"$f":"YTD!F39","v":22},{"$f":"YTD!G39","v":210},null,{"$f":"YTD!L17","v":"Quaddick"},{"$f":"IF(Teams!N64=20,\"N/A\",Teams!N64)","v":3},null,{"$f":"Teams!O64","v":11.47},null,null,{"$f":"YTD!S71","v":"X"},{"$f":"YTD!T71","v":0}]
[{"$f":"YTD!E40","v":"X"},{"$f":"YTD!F40","v":22},{"$f":"YTD!G40","v":210},null,{"$f":"YTD!L18","v":"Candlewood "},{"$f":"IF(Teams!N94=20,\"N/A\",Teams!N94)","v":1},null,{"$f":"Teams!O94","v":19.82},null,null,{"$f":"YTD!S72","v":"X"},{"$f":"YTD!T72","v":0}]
[null,null,null,null,{"$f":"YTD!L19","v":"CT River"},{"$f":"IF(Teams!AD4=20,\"N/A\",Teams!AD4)","v":7},null,{"$f":"Teams!AE4","v":8.08}]
[null,null,null,null,{"$f":"YTD!L20","v":"Hamilton"},{"$f":"IF(Teams!AD34=20,\"N/A\",Teams!AD34)","v":6},null,{"$f":"Teams!AE34","v":13.989999999999998}]
[null,null,null,null,{"$f":"YTD!L21","v":"Lilly"},{"$f":"IF(Teams!AD64=20,\"N/A\",Teams!AD64)","v":2},null,{"$f":"Teams!AE64","v":13.73}]
[null,null,null,null,{"$f":"YTD!L22","v":"Highland"},{"$f":"IF(Teams!AD94=20,\"N/A\",Teams!AD94)","v":9},null,{"$f":"Teams!AE94","v":9.02}]

{"sheet":"Sheet1","index":11,"n_rows":43,"n_cols":17,"rows_kept":43,"cut":false,"hidden":false,"merged":[]}
["Pachaug","Zoar","Quaddic","Candlewood","CT River","Hanilton","Lilly","Highland",null,"Black Plates","Brass Plates",null,"Mr Skunk"]
["Pete","Steve","Steve","Jack","Jason","Jeff","Morrie","Steve",null,"Pachaug Pond","Pachaug Pond",null,"Joe Scarfi"]
["Kevin","Jim B.","Tom","Steve","Jack","Vinney","Kevin","Armand",null,2015,2015]
["Scott","Kevin","Pete","Dean","Rich B","Pete","Jeff","Scott",null,"1rst Place","2nd Place",null,"Trophy"]
[null,null,null,null,null,null,null,null,null,"Pachaug Pond","Lake Zoar",null,"Smallmouth"]
[null,null,null,null,null,null,null,null,null,2015,2015,null,"Jason Rustic",null,null,"MVBCDEEP"]
[null,null,null,null,null,null,null,null,null,"3rd Place","1rst Place",null,4.2300000000000004,null,null,"GetTheNet1"]
[null,null,null,null,null,null,null,null,null,"Quaddic","Lake Zoar"]
[null,null,null,null,null,null,null,null,null,2015,2015,null,"Mr Bass",null,null,"April 16th","6:30 - 2:30"]
[null,null,null,null,null,null,null,null,null,"3rd Place","2nd Place",null,"Steve Deguzis",null,null,"May 14th ","5:30 - 1:30"]
[null,null,null,null,null,null,null,null,null,"CT River","Lake Zoar",null,2015,null,null,"June 5th","5:30 - 1:30"]
[null,null,null,null,null,null,null,null,null,2015,2015,null,null,null,null,"June 25th","5:30 - 1:30"]
[null,null,null,null,null,null,null,null,null,"1rst Place","3rd Place",null,null,null,null,"July 23rd","8:00 - 4:00"]
[null,null,null,null,null,null,null,null,null,"CT River","Quaddic",null,null,null,null,"August 6th","6:00 - 2:00"]
[null,null,null,null,null,null,null,null,null,2015,2015,null,null,null,null,"September 10th","6:00 - 2:00"]
[null,null,null,null,null,null,null,null,null,"3rd Place","1rst Place",null,null,null,null,"October 1rst","7:00 - 3:00"]
[null,null,null,null,null,null,null,null,null,"Hamilton","Quaddic"]
[null,null,null,null,null,null,null,null,null,2015,2015]
[null,null,null,null,null,null,null,null,null,"2nd Place","2nd Place"]
[null,null,null,null,null,null,null,null,null,"Hamilton","Candlewood"]
[null,null,null,null,null,null,null,null,null,2015,2015]
[null,null,null,null,null,null,null,null,null,"3rd Place","1rst Place"]
[null,null,null,null,null,null,null,null,null,"lake lillinonah","Candlewood"]
[null,null,null,null,null,null,null,null,null,2015,2015]
[null,null,null,null,null,null,null,null,null,"1rst Place","2nd Place"]
[null,null,null,null,null,null,null,null,null,"Highland Lake","Candlewood"]
[null,null,null,null,null,null,null,null,null,2015,2015]
[null,null,null,null,null,null,null,null,null,"2nd Place","3rd Place"]
[null,null,null,null,null,null,null,null,null,"Highland Lake","CT River"]
[null,null,null,null,null,null,null,null,null,2015,2015]
[null,null,null,null,null,null,null,null,null,"3rd Place","2nd Place"]
[null,null,null,null,null,null,null,null,null,null,"Hamilton"]
[null,null,null,null,null,null,null,null,null,null,2015]
[null,null,null,null,null,null,null,null,null,null,"1rst Place"]
[null,null,null,null,null,null,null,null,null,null,"lake lillinonah"]
[null,null,null,null,null,null,null,null,null,null,2015]
[null,null,null,null,null,null,null,null,null,null,"2nd Place"]
[null,null,null,null,null,null,null,null,null,null,"lake lillinonah"]
[null,null,null,null,null,null,null,null,null,null,2015]
[null,null,null,null,null,null,null,null,null,null,"3rd Place"]
[null,null,null,null,null,null,null,null,null,null,"Highland Lake"]
[null,null,null,null,null,null,null,null,null,null,2015]
[null,null,null,null,null,null,null,null,null,null,"1rst Place"]

{"sheet":"Sheet2","index":12,"n_rows":44,"n_cols":7,"rows_kept":44,"cut":false,"hidden":false,"merged":[]}
[null,"Black Plates","Brass Plates",null,"VP467-630 Black 10x12 Shield",null,"Angler of the Year"]
[null,null,null,null,null,null,"Same trophy as last year"]
[null,"Pachaug Pond","Pachaug Pond",null,"Mohawk Valley BassCasters",null,"GF 12-2P-PDR-5PC 31\" with fish"]
[null,2015,2015,null,"2015 Trophy Smallmouth"]
[null,"1rst Place","2nd Place",null,"Jason Rustic",null,"Mohawk Valley BassCasters"]
[null,"Pachaug Pond","Lake Zoar",null,"4,23LB",null,"2015 Angler of the Year"]
[null,2015,2015,null,null,null,"Steve Deguzis"]
[null,"3rd Place","1rst Place"]
[null,"Quaddic","Lake Zoar"]
[null,2015,2015]
[null,"3rd Place","2nd Place"]
[null,"CT River","Lake Zoar"]
[null,2015,2015]
[null,"1rst Place","3rd Place"]
[null,"CT River","Quaddic"]
[null,2015,2015]
[null,"3rd Place","1rst Place"]
[null,"Hamilton","Quaddic"]
[null,2015,2015]
[null,"2nd Place","2nd Place"]
[null,"Hamilton","Candlewood"]
[null,2015,2015]
[null,"3rd Place","1rst Place"]
[null,"lake lillinonah","Candlewood"]
[null,2015,2015]
[null,"1rst Place","2nd Place"]
[null,"Highland Lake","Candlewood"]
[null,2015,2015]
[null,"2nd Place","3rd Place"]
[null,"Highland Lake","CT River"]
[null,2015,2015]
[null,"3rd Place","2nd Place"]
[null,null,"Hamilton"]
[null,2015,2015]
[null,"Steve Deguzis","1rst Place"]
[null,null,"lake lillinonah"]
[null,2015,2015]
[null,"Joe Scarfi","2nd Place"]
[null,null,"lake lillinonah"]
[null,null,2015]
[null,null,"3rd Place"]
[null,null,"Highland Lake"]
[null,null,2015]
[null,null,"1rst Place"]