{"text_format":"1","workbook":"xlsx","n_sheets":12,"sheets":["Bantam","Mashapaug","Coventry","Beach","Candlewood","Winchester","Mansfield","Aspinook","Teams","YTD","Report","Sheet1"],"not_rendered":{"charts":0,"images":0,"macros":1,"external_links":0,"defined_names":16,"comments":0,"pivot_tables":0},"unopened":[],"bounds":{"document_bytes":16777216,"sheet_cells":100000,"rows_first":2000,"rows_last":500,"rows_between":2000,"halvings":0,"cell_chars":16384,"cell_head_chars":4096},"cells_cut":0,"cells_raw":0,"read":"whole","date_system":"1900"}

{"sheet":"Bantam","index":0,"n_rows":34,"n_cols":17,"rows_kept":34,"cut":false,"hidden":false,"merged":[[1,0,2,0],[0,0,0,16],[30,6,30,7],[30,3,30,5],[30,13,30,14],[30,10,30,12],[31,13,31,14],[32,13,32,14],[33,13,33,14],[33,6,33,7],[31,6,31,7],[32,6,32,7]]}
[{"$f":"YTD!L15","v":"Bantam"}]
[null,"Team","Fish","Member","Show","Non","Number","Number","Number","Lunker","Species","Gross","Total","Net","Points","Non Boater","# Non-"]
[null,"Number","Alone?","Name","Up?","Boater?","of LMB","of SMB","Dead","Weight","LMB/SMB","Weight","Caught","Weight","Awarded","Weight","Boaters"]
[1,2,"N",{"$f":"YTD!P15","v":"Armand"},"Y","N",1,1,0,null,null,4.4400000000000004,{"$f":"G4+H4","v":2},{"$f":"L4-(I4*0.2)","v":4.4400000000000004},{"$f":"IF($E4=\"N\",35,IF($M4=0,30,RANK($N4,$N$4:$N$29,0)))","v":6},{"$f":"IF(F4=\"Y\",N4,0)","v":0},{"$f":"IF(E4=\"N\",0,(IF(F4=\"N\",0,1)))","v":0}]
[2,1,"N",{"$f":"YTD!P16","v":"Bill"},"Y","Y",0,3,0,null,null,7.77,3,7.77,{"$f":"IF($E5=\"N\",35,IF($M5=0,30,RANK($N5,$N$4:$N$29,0)))","v":4},7.77,{"$f":"IF(E5=\"N\",0,(IF(F5=\"N\",0,1)))","v":1}]
[3,11,"N",{"$f":"YTD!P17","v":"Dean"},"Y","N",2,0,0,null,null,4.38,{"$f":"G6+H6","v":2},{"$f":"L6-(I6*0.2)","v":4.38},7,{"$f":"IF(F6=\"Y\",N6,0)","v":0},0]
[4,7,"N",{"$f":"YTD!P18","v":"Jack"},"Y","Y",1,0,0,null,null,1.74,1,1.74,15,1.74,1]
[5,10,"N",{"$f":"YTD!P19","v":"Jason"},"Y","N",3,0,0,4.2,"LMB",9.61,{"$f":"G8+H8","v":3},{"$f":"L8-(I8*0.2)","v":9.61},1,{"$f":"IF(F8=\"Y\",N8,0)","v":0},0]
[6,8,"Y",{"$f":"YTD!P20","v":"Jeff"},"Y","N",0,4,0,null,null,8.56,4,8.56,2,0,0]
[7,5,"N",{"$f":"YTD!P21","v":"Jim B"},"Y","Y",1,1,0,null,null,3.08,2,3.08,14,3.08,1]
[8,4,"N",{"$f":"YTD!P22","v":"Joe"},"Y","Y",0,0,0,null,null,0,{"$f":"G11+H11","v":0},{"$f":"L11-(I11*0.2)","v":0},30,{"$f":"IF(F11=\"Y\",N11,0)","v":0},1]
[9,2,"N",{"$f":"YTD!P23","v":"Kam"},"Y","Y",0,0,0,null,null,0,0,0,30,0,1]
[10,7,"N",{"$f":"YTD!P24","v":"Kevin"},"Y","N",0,0,0,null,null,0,0,0,30,0,0]
[11,10,"N",{"$f":"YTD!P25","v":"Mike M"},"Y","Y",0,0,0,null,null,0,0,0,30,0,1]
[12,3,"N",{"$f":"YTD!P26","v":"Mike G"},"Y","Y",0,1,0,null,null,1.28,1,1.28,16,1.28,1]
[13,5,"N",{"$f":"YTD!P27","v":"Morrie"},"Y","N",0,2,0,null,null,3.1,2,3.1,13,0,0]
[14,11,"N",{"$f":"YTD!P28","v":"Pete"},"Y","Y",1,1,0,null,null,4.2300000000000004,2,4.2300000000000004,10,4.2300000000000004,1]
[15,9,"N",{"$f":"YTD!P29","v":"Rich B"},"Y","N",2,0,0,null,null,3.55,{"$f":"G18+H18","v":2},{"$f":"L18-(I18*0.2)","v":3.55},12,0,0]
[16,9,"N",{"$f":"YTD!P30","v":"Rich T"},"Y","Y",3,0,0,null,null,5.66,3,5.66,5,5.66,1]
[17,1,"N",{"$f":"YTD!P31","v":"Ron"},"Y","N",0,0,0,null,null,0,{"$f":"G20+H20","v":0},{"$f":"L20-(I20*0.2)","v":0},30,{"$f":"IF(F20=\"Y\",N20,0)","v":0},0]
[18,4,"N",{"$f":"YTD!P32","v":"Scott"},"Y","N",2,0,0,null,null,4.24,2,4.24,9,0,0]
[19,3,"N",{"$f":"YTD!P33","v":"Steve D"},"Y","N",3,2,0,null,null,8.24,5,8.24,3,0,0]
[20,6,"N",{"$f":"YTD!P34","v":"Steve S"},"Y","Y",0,2,0,null,null,4.3099999999999996,{"$f":"G23+H23","v":2},{"$f":"L23-(I23*0.2)","v":4.3099999999999996},8,4.3099999999999996,1]
[21,6,"N",{"$f":"YTD!P35","v":"Tom"},"Y","N",2,0,0,null,null,4.18,2,4.18,11,0,0]
[22,null,"N",{"$f":"YTD!P36","v":"X"},"N","N",null,null,null,null,null,null,0,0,35,0,0]
[23,null,"N",{"$f":"YTD!P37","v":"X"},"N","N",null,null,null,null,null,null,0,0,35,0,0]
[24,null,"N",{"$f":"YTD!P38","v":"X"},"N","N",null,null,null,null,null,null,0,0,35,0,0]
[25,null,"N",{"$f":"YTD!P39","v":"X"},"N","N",null,null,null,null,null,null,{"$f":"G28+H28","v":0},{"$f":"L28-(I28*0.2)","v":0},35,{"$f":"IF(F28=\"Y\",N28,0)","v":0},{"$f":"IF(E28=\"N\",0,(IF(F28=\"N\",0,1)))","v":0}]
[26,null,"N",{"$f":"YTD!P40","v":"X"},"N","N",null,null,null,null,null,null,{"$f":"G29+H29","v":0},{"$f":"L29-(I29*0.2)","v":0},35,{"$f":"IF(F29=\"Y\",N29,0)","v":0},{"$f":"IF(E29=\"N\",0,(IF(F29=\"N\",0,1)))","v":0}]
[null,null,null,"Totals",{"$f":"COUNTIF(E4:E29,\"Y\")","v":21},null,{"$f":"SUM(G4:G29)","v":21},{"$f":"SUM(H4:H29)","v":17},{"$f":"SUM(I4:I29)","v":0},{"$f":"MAX(J4:J29)","v":4.2},null,{"$f":"SUM(L4:L29)","v":78.37},{"$f":"SUM(M4:M29)","v":38},{"$f":"SUM(N4:N29)","v":78.37},null,{"$f":"SUM(P4:P29)","v":28.07},{"$f":"SUM(Q4:Q29)","v":10}]
[null,"Place","Team #","Partners",null,null,"Total Weight",null,"Place","Team #","Partners",null,null,"Total Weight",null,"NB Avg",{"$f":"IF(Q30=0,\"No Data\",P30/Q30)","v":2.8069999999999999}]
[null,"1st",{"$f":"Teams!N4","v":8},{"$f":"VLOOKUP($C32,$B$4:$D$29,3,0)","v":"Jeff"},"&",{"$f":"IF($B$4:$B$29=20,\"#N/A\",IF(COUNTIF($B$4:$B$29,$C32)=1,\"Alone\",LOOKUP(2,1/($B$4:$B$29=$C32),$D$4:$D$29)))","v":"Alone"},{"$f":"Teams!O4","v":11.367000000000001},null,"4th",{"$f":"Teams!N7","v":9},{"$f":"VLOOKUP($J32,$B$4:$D$29,3,0)","v":"Rich B"},"&",{"$f":"IF($B$4:$B$29=20,\"#N/A\",IF(COUNTIF($B$4:$B$29,$J32)=1,\"Alone\",LOOKUP(2,1/($B$4:$B$29=$J32),$D$4:$D$29)))","v":"Rich T"},{"$f":"Teams!O7","v":9.2100000000000009}]
[null,"2nd",{"$f":"Teams!N5","v":10},{"$f":"VLOOKUP($C33,$B$4:$D$29,3,0)","v":"Jason"},"&",{"$f":"IF($B$4:$B$29=20,\"#N/A\",IF(COUNTIF($B$4:$B$29,$C33)=1,\"Alone\",LOOKUP(2,1/($B$4:$B$29=$C33),$D$4:$D$29)))","v":"Mike M"},{"$f":"Teams!O5","v":9.61},null,"5th",{"$f":"Teams!N8","v":11},{"$f":"VLOOKUP($J33,$B$4:$D$29,3,0)","v":"Dean"},"&",{"$f":"IF($B$4:$B$29=20,\"#N/A\",IF(COUNTIF($B$4:$B$29,$J33)=1,\"Alone\",LOOKUP(2,1/($B$4:$B$29=$J33),$D$4:$D$29)))","v":"Pete"},{"$f":"Teams!O8","v":8.61}]
[null,"3rd",{"$f":"Teams!N6","v":3},{"$f":"VLOOKUP($C34,$B$4:$D$29,3,0)","v":"Mike G"},"&",{"$f":"IF($B$4:$B$29=20,\"#N/A\",IF(COUNTIF($B$4:$B$29,$C34)=1,\"Alone\",LOOKUP(2,1/($B$4:$B$29=$C34),$D$4:$D$29)))","v":"Steve D"},{"$f":"Teams!O6","v":9.52},null,"6th",{"$f":"Teams!N9","v":6},{"$f":"VLOOKUP($J34,$B$4:$D$29,3,0)","v":"Steve S"},"&",{"$f":"IF($B$4:$B$29=20,\"#N/A\",IF(COUNTIF($B$4:$B$29,$J34)=1,\"Alone\",LOOKUP(2,1/($B$4:$B$29=$J34),$D$4:$D$29)))","v":"Tom"},{"$f":"Teams!O9","v":8.4899999999999984}]

{"sheet":"Mashapaug","index":1,"n_rows":34,"n_cols":17,"rows_kept":34,"cut":false,"hidden":false,"merged":[[33,6,33,7],[33,13,33,14],[1,0,2,0],[0,0,0,16],[32,6,32,7],[32,13,32,14],[30,6,30,7],[31,6,31,7],[30,13,30,14],[31,13,31,14],[30,3,30,5],[30,10,30,12]]}
[{"$f":"YTD!L16","v":"Mashapaug"}]
[null,"Team","Fish","Member","Show","Non","Number","Number","Number","Lunker","Species","Gross","Total","Net","Points","Non Boater","# Non-"]
[null,"Number","Alone?","Name","Up?","Boater?","of LMB","of SMB","Dead","Weight","LMB/SMB","Weight","Caught","Weight","Awarded","Weight","Boaters"]
[1,3,"Y",{"$f":"YTD!P15","v":"Armand"},"Y","N",2,3,0,null,null,11.39,{"$f":"G4+H4","v":5},{"$f":"L4-(I4*0.2)","v":11.39},{"$f":"IF($E4=\"N\",35,IF($M4=0,30,RANK($N4,$N$4:$N$29,0)))","v":1},{"$f":"IF(F4=\"Y\",N4,0)","v":0},{"$f":"IF(E4=\"N\",0,(IF(F4=\"N\",0,1)))","v":0}]
[2,8,"N",{"$f":"YTD!P16","v":"Bill"},"Y","Y",3,1,0,null,null,5.38,4,5.38,{"$f":"IF($E5=\"N\",35,IF($M5=0,30,RANK($N5,$N$4:$N$29,0)))","v":13},5.38,{"$f":"IF(E5=\"N\",0,(IF(F5=\"N\",0,1)))","v":1}]
[3,7,"N",{"$f":"YTD!P17","v":"Dean"},"Y","N",5,0,0,null,null,9.49,{"$f":"G6+H6","v":5},{"$f":"L6-(I6*0.2)","v":9.49},4,{"$f":"IF(F6=\"Y\",N6,0)","v":0},0]
[4,10,"N",{"$f":"YTD!P18","v":"Jack"},"Y","Y",1,2,0,null,null,5.29,3,5.29,14,5.29,1]
[5,8,"N",{"$f":"YTD!P19","v":"Jason"},"Y","N",5,0,0,4.3899999999999997,"LMB",11.17,{"$f":"G8+H8","v":5},{"$f":"L8-(I8*0.2)","v":11.17},2,{"$f":"IF(F8=\"Y\",N8,0)","v":0},0]
[6,5,"N",{"$f":"YTD!P20","v":"Jeff"},"Y","N",3,2,0,null,null,9.19,5,9.19,6,0,0]
[7,9,"N",{"$f":"YTD!P21","v":"Jim B"},"Y","Y",5,0,0,null,null,7.55,5,7.55,10,7.55,1]
[8,1,"N",{"$f":"YTD!P22","v":"Joe"},"Y","Y",1,1,0,null,null,3.7,{"$f":"G11+H11","v":2},{"$f":"L11-(I11*0.2)","v":3.7},17,{"$f":"IF(F11=\"Y\",N11,0)","v":3.7},1]
[9,null,"N",{"$f":"YTD!P23","v":"Kam"},"N","Y",null,null,null,null,null,null,0,0,35,0,0]
[10,2,"N",{"$f":"YTD!P24","v":"Kevin"},"Y","N",4,1,0,null,null,7.11,5,7.11,11,0,0]
[11,5,"N",{"$f":"YTD!P25","v":"Mike M"},"Y","Y",2,0,0,null,null,1.9,2,1.9,19,1.9,1]
[12,2,"N",{"$f":"YTD!P26","v":"Mike G"},"Y","Y",4,0,0,null,null,5.05,4,5.05,15,5.05,1]
[13,null,"N",{"$f":"YTD!P27","v":"Morrie"},"N","N",null,null,null,null,null,null,0,0,35,0,0]
[14,6,"N",{"$f":"YTD!P28","v":"Pete"},"Y","Y",4,1,0,null,null,8.32,5,8.32,7,8.32,1]
[15,6,"N",{"$f":"YTD!P29","v":"Rich B"},"Y","N",4,1,0,null,null,10.58,{"$f":"G18+H18","v":5},{"$f":"L18-(I18*0.2)","v":10.58},3,0,0]
[16,4,"N",{"$f":"YTD!P30","v":"Rich T"},"Y","Y",3,2,0,null,null,6.04,5,6.04,12,6.04,1]
[17,10,"N",{"$f":"YTD!P31","v":"Ron"},"Y","N",1,1,0,null,null,2.94,{"$f":"G20+H20","v":2},{"$f":"L20-(I20*0.2)","v":2.94},18,{"$f":"IF(F20=\"Y\",N20,0)","v":0},0]
[18,4,"N",{"$f":"YTD!P32","v":"Scott"},"Y","N",4,1,0,null,null,5.03,5,5.03,16,0,0]
[19,9,"N",{"$f":"YTD!P33","v":"Steve D"},"Y","N",5,0,0,null,null,9.48,5,9.48,5,0,0]
[20,7,"N",{"$f":"YTD!P34","v":"Steve S"},"Y","Y",5,0,0,null,null,8.2799999999999994,{"$f":"G23+H23","v":5},{"$f":"L23-(I23*0.2)","v":8.2799999999999994},8,8.2799999999999994,1]
[21,1,"N",{"$f":"YTD!P35","v":"Tom"},"Y","N",5,0,0,null,null,7.83,5,7.83,9,0,0]
[22,null,"N",{"$f":"YTD!P36","v":"X"},"N","N",null,null,null,null,null,null,0,0,35,0,0]
[23,null,"N",{"$f":"YTD!P37","v":"X"},"N","N",null,null,null,null,null,null,0,0,35,0,0]
[24,null,"N",{"$f":"YTD!P38","v":"X"},"N","N",null,null,null,null,null,null,0,0,35,0,0]
[25,null,"N",{"$f":"YTD!P39","v":"X"},"N","N",null,null,null,null,null,null,{"$f":"G28+H28","v":0},{"$f":"L28-(I28*0.2)","v":0},35,{"$f":"IF(F28=\"Y\",N28,0)","v":0},{"$f":"IF(E28=\"N\",0,(IF(F28=\"N\",0,1)))","v":0}]
[26,null,"N",{"$f":"YTD!P40","v":"X"},"N","N",null,null,null,null,null,null,{"$f":"G29+H29","v":0},{"$f":"L29-(I29*0.2)","v":0},35,{"$f":"IF(F29=\"Y\",N29,0)","v":0},{"$f":"IF(E29=\"N\",0,(IF(F29=\"N\",0,1)))","v":0}]
[null,null,null,"Totals",{"$f":"COUNTIF(E4:E29,\"Y\")","v":19},null,{"$f":"SUM(G4:G29)","v":66},{"$f":"SUM(H4:H29)","v":16},{"$f":"SUM(I4:I29)","v":0},{"$f":"MAX(J4:J29)","v":4.3899999999999997},"LMB",{"$f":"SUM(L4:L29)","v":135.72},{"$f":"SUM(M4:M29)","v":82},{"$f":"SUM(N4:N29)","v":135.72},null,{"$f":"SUM(P4:P29)","v":51.51},{"$f":"SUM(Q4:Q29)","v":9}]
[null,"Place","Team #","Partners",null,null,"Total Weight",null,"Place","Team #","Partners",null,null,"Total Weight",null,"NB Avg",{"$f":"IF(Q30=0,\"No Data\",P30/Q30)","v":5.7233333333333327}]
[null,"1st",{"$f":"Teams!N34","v":6},{"$f":"VLOOKUP($C32,$B$4:$D$29,3,0)","v":"Pete"},"&",{"$f":"IF($B$4:$B$29=20,\"#N/A\",IF(COUNTIF($B$4:$B$29,$C32)=1,\"Alone\",LOOKUP(2,1/($B$4:$B$29=$C32),$D$4:$D$29)))","v":"Rich B"},{"$f":"Teams!O34","v":18.899999999999999},null,"4th",{"$f":"Teams!N37","v":9},{"$f":"VLOOKUP($J32,$B$4:$D$29,3,0)","v":"Jim B"},"&",{"$f":"IF($B$4:$B$29=20,\"#N/A\",IF(COUNTIF($B$4:$B$29,$J32)=1,\"Alone\",LOOKUP(2,1/($B$4:$B$29=$J32),$D$4:$D$29)))","v":"Steve D"},{"$f":"Teams!O37","v":17.03}]
[null,"2nd",{"$f":"Teams!N35","v":7},{"$f":"VLOOKUP($C33,$B$4:$D$29,3,0)","v":"Dean"},"&",{"$f":"IF($B$4:$B$29=20,\"#N/A\",IF(COUNTIF($B$4:$B$29,$C33)=1,\"Alone\",LOOKUP(2,1/($B$4:$B$29=$C33),$D$4:$D$29)))","v":"Steve S"},{"$f":"Teams!O35","v":17.77},null,"5th",{"$f":"Teams!N38","v":8},{"$f":"VLOOKUP($J33,$B$4:$D$29,3,0)","v":"Bill"},"&",{"$f":"IF($B$4:$B$29=20,\"#N/A\",IF(COUNTIF($B$4:$B$29,$J33)=1,\"Alone\",LOOKUP(2,1/($B$4:$B$29=$J33),$D$4:$D$29)))","v":"Jason"},{"$f":"Teams!O38","v":16.55}]
[null,"3rd",{"$f":"Teams!N36","v":3},{"$f":"VLOOKUP($C34,$B$4:$D$29,3,0)","v":"Armand"},"&",{"$f":"IF($B$4:$B$29=20,\"#N/A\",IF(COUNTIF($B$4:$B$29,$C34)=1,\"Alone\",LOOKUP(2,1/($B$4:$B$29=$C34),$D$4:$D$29)))","v":"Alone"},{"$f":"Teams!O36","v":17.113333333333333},null,"6th",{"$f":"Teams!N39","v":2},{"$f":"VLOOKUP($J34,$B$4:$D$29,3,0)","v":"Kevin"},"&",{"$f":"IF($B$4:$B$29=20,\"#N/A\",IF(COUNTIF($B$4:$B$29,$J34)=1,\"Alone\",LOOKUP(2,1/($B$4:$B$29=$J34),$D$4:$D$29)))","v":"Mike G"},{"$f":"Teams!O39","v":12.16}]

{"sheet":"Coventry","index":2,"n_rows":34,"n_cols":17,"rows_kept":34,"cut":false,"hidden":false,"merged":[[32,6,32,7],[32,13,32,14],[0,0,0,16],[30,3,30,5],[30,6,30,7],[30,10,30,12],[1,0,2,0],[33,6,33,7],[33,13,33,14],[30,13,30,14],[31,6,31,7],[31,13,31,14]]}
[{"$f":"YTD!L17","v":"Coventry"}]
[null,"Team","Fish","Member","Show","Non","Number","Number","Number","Lunker","Species","Gross","Total","Net","Points","Non Boater","# Non-"]
[null,"Number","Alone?","Name","Up?","Boater?","of LMB","of SMB","Dead","Weight","LMB/SMB","Weight","Caught","Weight","Awarded","Weight","Boaters"]
[1,5,"Y",{"$f":"YTD!P15","v":"Armand"},"Y","N",2,0,0,null,null,2.29,{"$f":"G4+H4","v":2},{"$f":"L4-(I4*0.2)","v":2.29},{"$f":"IF($E4=\"N\",35,IF($M4=0,30,RANK($N4,$N$4:$N$29,0)))","v":9},{"$f":"IF(F4=\"Y\",N4,0)","v":0},{"$f":"IF(E4=\"N\",0,(IF(F4=\"N\",0,1)))","v":0}]
[2,3,"N",{"$f":"YTD!P16","v":"Bill"},"Y","Y",2,0,2,null,null,1.65,2,1.25,{"$f":"IF($E5=\"N\",35,IF($M5=0,30,RANK($N5,$N$4:$N$29,0)))","v":11},1.25,{"$f":"IF(E5=\"N\",0,(IF(F5=\"N\",0,1)))","v":1}]
[3,6,"Y",{"$f":"YTD!P17","v":"Dean"},"Y","N",1,0,0,null,null,0.89,{"$f":"G6+H6","v":1},{"$f":"L6-(I6*0.2)","v":0.89},12,{"$f":"IF(F6=\"Y\",N6,0)","v":0},0]
[4,9,"N",{"$f":"YTD!P18","v":"Jack"},"Y","Y",3,0,0,null,null,3.55,3,3.55,5,3.55,1]
[5,9,"N",{"$f":"YTD!P19","v":"Jason"},"Y","N",4,0,0,null,null,5.07,{"$f":"G8+H8","v":4},{"$f":"L8-(I8*0.2)","v":5.07},3,{"$f":"IF(F8=\"Y\",N8,0)","v":0},0]
[6,3,"N",{"$f":"YTD!P20","v":"Jeff"},"Y","N",3,0,0,null,null,3.07,3,3.07,7,0,0]
[7,null,"N",{"$f":"YTD!P21","v":"Jim B"},"N","Y",null,null,0,null,null,null,0,0,35,0,0]
[8,8,"N",{"$f":"YTD!P22","v":"Joe"},"Y","Y",0,1,0,null,null,0.8,{"$f":"G11+H11","v":1},{"$f":"L11-(I11*0.2)","v":0.8},13,{"$f":"IF(F11=\"Y\",N11,0)","v":0.8},1]
[9,null,"N",{"$f":"YTD!P23","v":"Kam"},"N","Y",null,null,0,null,null,null,0,0,35,0,0]
[10,1,"Y",{"$f":"YTD!P24","v":"Kevin"},"Y","N",2,0,0,null,null,4.72,2,4.72,4,0,0]
[11,null,"N",{"$f":"YTD!P25","v":"Mike M"},"N","Y",null,null,0,null,null,null,0,0,35,0,0]
[12,null,"N",{"$f":"YTD!P26","v":"Mike G"},"N","Y",null,null,0,null,null,null,0,0,35,0,0]
[13,8,"N",{"$f":"YTD!P27","v":"Morrie"},"Y","N",4,1,0,null,null,5.36,5,5.36,2,0,0]
[14,7,"N",{"$f":"YTD!P28","v":"Pete"},"Y","Y",0,0,0,null,null,0,0,0,30,0,1]
[15,2,"Y",{"$f":"YTD!P29","v":"Rich B"},"Y","N",4,0,0,null,null,3.48,{"$f":"G18+H18","v":4},{"$f":"L18-(I18*0.2)","v":3.48},6,0,0]
[16,4,"N",{"$f":"YTD!P30","v":"Rich T"},"Y","Y",1,0,0,null,null,1.78,1,1.78,10,1.78,1]
[17,null,"N",{"$f":"YTD!P31","v":"Ron"},"N","N",null,null,0,null,null,null,{"$f":"G20+H20","v":0},{"$f":"L20-(I20*0.2)","v":0},35,{"$f":"IF(F20=\"Y\",N20,0)","v":0},0]
[18,7,"N",{"$f":"YTD!P32","v":"Scott"},"Y","N",0,0,0,null,null,0,0,0,30,0,0]
[19,10,"N",{"$f":"YTD!P33","v":"Steve D"},"Y","N",2,3,0,6.39,"LMB",13.24,5,13.24,1,0,0]
[20,10,"N",{"$f":"YTD!P34","v":"Steve S"},"Y","Y",1,1,0,null,null,2.67,{"$f":"G23+H23","v":2},{"$f":"L23-(I23*0.2)","v":2.67},8,2.67,1]
[21,4,"N",{"$f":"YTD!P35","v":"Tom"},"Y","N",null,null,0,null,null,null,0,0,30,0,0]
[22,null,"N",{"$f":"YTD!P36","v":"X"},"N","N",null,null,null,null,null,null,0,0,35,0,0]
[23,null,"N",{"$f":"YTD!P37","v":"X"},"N","N",null,null,null,null,null,null,0,0,35,0,0]
[24,null,"N",{"$f":"YTD!P38","v":"X"},"N","N",null,null,null,null,null,null,0,0,35,0,0]
[25,null,"N",{"$f":"YTD!P39","v":"X"},"N","N",null,null,null,null,null,null,{"$f":"G28+H28","v":0},{"$f":"L28-(I28*0.2)","v":0},35,{"$f":"IF(F28=\"Y\",N28,0)","v":0},{"$f":"IF(E28=\"N\",0,(IF(F28=\"N\",0,1)))","v":0}]
[26,null,"N",{"$f":"YTD!P40","v":"X"},"N","N",null,null,null,null,null,null,{"$f":"G29+H29","v":0},{"$f":"L29-(I29*0.2)","v":0},35,{"$f":"IF(F29=\"Y\",N29,0)","v":0},{"$f":"IF(E29=\"N\",0,(IF(F29=\"N\",0,1)))","v":0}]
[null,null,null,"Totals",{"$f":"COUNTIF(E4:E29,\"Y\")","v":16},null,{"$f":"SUM(G4:G29)","v":29},{"$f":"SUM(H4:H29)","v":6},{"$f":"SUM(I4:I29)","v":2},{"$f":"MAX(J4:J29)","v":6.39},null,{"$f":"SUM(L4:L29)","v":48.57},{"$f":"SUM(M4:M29)","v":35},{"$f":"SUM(N4:N29)","v":48.17},null,{"$f":"SUM(P4:P29)","v":10.050000000000001},{"$f":"SUM(Q4:Q29)","v":6}]
[null,"Place","Team #","Partners",null,null,"Total Weight",null,"Place","Team #","Partners",null,null,"Total Weight",null,"NB Avg",{"$f":"IF(Q30=0,\"No Data\",P30/Q30)","v":1.675}]
[null,"1st",{"$f":"Teams!N64","v":10},{"$f":"VLOOKUP($C32,$B$4:$D$29,3,0)","v":"Steve D"},"&",{"$f":"IF($B$4:$B$29=20,\"#N/A\",IF(COUNTIF($B$4:$B$29,$C32)=1,\"Alone\",LOOKUP(2,1/($B$4:$B$29=$C32),$D$4:$D$29)))","v":"Steve S"},{"$f":"Teams!O64","v":15.91},null,"4th",{"$f":"Teams!N67","v":8},{"$f":"VLOOKUP($J32,$B$4:$D$29,3,0)","v":"Joe"},"&",{"$f":"IF($B$4:$B$29=20,\"#N/A\",IF(COUNTIF($B$4:$B$29,$J32)=1,\"Alone\",LOOKUP(2,1/($B$4:$B$29=$J32),$D$4:$D$29)))","v":"Morrie"},{"$f":"Teams!O67","v":6.16}]
[null,"2nd",{"$f":"Teams!N65","v":9},{"$f":"VLOOKUP($C33,$B$4:$D$29,3,0)","v":"Jack"},"&",{"$f":"IF($B$4:$B$29=20,\"#N/A\",IF(COUNTIF($B$4:$B$29,$C33)=1,\"Alone\",LOOKUP(2,1/($B$4:$B$29=$C33),$D$4:$D$29)))","v":"Jason"},{"$f":"Teams!O65","v":8.620000000000001},null,"5th",{"$f":"Teams!N68","v":2},{"$f":"VLOOKUP($J33,$B$4:$D$29,3,0)","v":"Rich B"},"&",{"$f":"IF($B$4:$B$29=20,\"#N/A\",IF(COUNTIF($B$4:$B$29,$J33)=1,\"Alone\",LOOKUP(2,1/($B$4:$B$29=$J33),$D$4:$D$29)))","v":"Alone"},{"$f":"Teams!O68","v":5.1550000000000002}]
[null,"3rd",{"$f":"Teams!N66","v":1},{"$f":"VLOOKUP($C34,$B$4:$D$29,3,0)","v":"Kevin"},"&",{"$f":"IF($B$4:$B$29=20,\"#N/A\",IF(COUNTIF($B$4:$B$29,$C34)=1,\"Alone\",LOOKUP(2,1/($B$4:$B$29=$C34),$D$4:$D$29)))","v":"Alone"},{"$f":"Teams!O66","v":6.3949999999999996},null,"6th",{"$f":"Teams!N69","v":3},{"$f":"VLOOKUP($J34,$B$4:$D$29,3,0)","v":"Bill"},"&",{"$f":"IF($B$4:$B$29=20,\"#N/A\",IF(COUNTIF($B$4:$B$29,$J34)=1,\"Alone\",LOOKUP(2,1/($B$4:$B$29=$J34),$D$4:$D$29)))","v":"Jeff"},{"$f":"Teams!O69","v":4.32}]

{"sheet":"Beach","index":3,"n_rows":34,"n_cols":17,"rows_kept":34,"cut":false,"hidden":false,"merged":[[32,6,32,7],[32,13,32,14],[0,0,0,16],[30,3,30,5],[30,6,30,7],[30,10,30,12],[1,0,2,0],[33,6,33,7],[33,13,33,14],[30,13,30,14],[31,6,31,7],[31,13,31,14]]}
[{"$f":"YTD!L18","v":"Beach"}]
[null,"Team","Fish","Member","Show","Non","Number","Number","Number","Lunker","Species","Gross","Total","Net","Points","Non Boater","# Non-"]
[null,"Number","Alone?","Name","Up?","Boater?","of LMB","of SMB","Dead","Weight","LMB/SMB","Weight","Caught","Weight","Awarded","Weight","Boaters"]
[1,2,"N",{"$f":"YTD!P15","v":"Armand"},"Y","N",1,null,null,null,null,0.67,{"$f":"G4+H4","v":1},{"$f":"L4-(I4*0.2)","v":0.67},{"$f":"IF($E4=\"N\",35,IF($M4=0,30,RANK($N4,$N$4:$N$29,0)))","v":18},{"$f":"IF(F4=\"Y\",N4,0)","v":0},{"$f":"IF(E4=\"N\",0,(IF(F4=\"N\",0,1)))","v":0}]
[2,2,"N",{"$f":"YTD!P16","v":"Bill"},"Y","Y",3,null,2,null,null,5.38,3,4.9799999999999995,{"$f":"IF($E5=\"N\",35,IF($M5=0,30,RANK($N5,$N$4:$N$29,0)))","v":5},4.9799999999999995,{"$f":"IF(E5=\"N\",0,(IF(F5=\"N\",0,1)))","v":1}]
[3,3,"N",{"$f":"YTD!P17","v":"Dean"},"Y","N",2,null,null,null,null,1.33,{"$f":"G6+H6","v":2},{"$f":"L6-(I6*0.2)","v":1.33},14,{"$f":"IF(F6=\"Y\",N6,0)","v":0},0]
[4,7,"N",{"$f":"YTD!P18","v":"Jack"},"Y","Y",1,null,null,null,null,1.03,1,1.03,16,1.03,1]
[5,9,"N",{"$f":"YTD!P19","v":"Jason"},"Y","N",1,null,null,null,null,1.21,{"$f":"G8+H8","v":1},{"$f":"L8-(I8*0.2)","v":1.21},15,{"$f":"IF(F8=\"Y\",N8,0)","v":0},0]
[6,7,"N",{"$f":"YTD!P20","v":"Jeff"},"Y","N",5,null,null,5.96,"LMB",9.31,5,9.31,1,0,0]
[7,null,"N",{"$f":"YTD!P21","v":"Jim B"},"N","Y",null,null,null,null,null,null,0,0,35,0,0]
[8,6,"N",{"$f":"YTD!P22","v":"Joe"},"Y","Y",1,null,null,null,null,0.73,{"$f":"G11+H11","v":1},{"$f":"L11-(I11*0.2)","v":0.73},17,{"$f":"IF(F11=\"Y\",N11,0)","v":0.73},1]
[9,5,"N",{"$f":"YTD!P23","v":"Kam"},"Y","Y",2,null,null,null,null,1.93,2,1.93,13,1.93,1]
[10,4,"N",{"$f":"YTD!P24","v":"Kevin"},"Y","N",3,null,null,null,null,2.5,3,2.5,9,0,0]
[11,3,"N",{"$f":"YTD!P25","v":"Mike M"},"Y","Y",4,null,null,null,null,5.87,4,5.87,3,5.87,1]
[12,9,"N",{"$f":"YTD!P26","v":"Mike G"},"Y","Y",4,null,null,null,null,4.78,4,4.78,6,4.78,1]
[13,10,"N",{"$f":"YTD!P27","v":"Morrie"},"Y","N",3,null,null,null,null,3.5,3,3.5,8,0,0]
[14,8,"N",{"$f":"YTD!P28","v":"Pete"},"Y","Y",2,null,null,null,null,2.0499999999999998,2,2.0499999999999998,10,2.0499999999999998,1]
[15,1,"Y",{"$f":"YTD!P29","v":"Rich B"},"Y","N",2,null,null,null,null,1.96,{"$f":"G18+H18","v":2},{"$f":"L18-(I18*0.2)","v":1.96},12,0,0]
[16,10,"N",{"$f":"YTD!P30","v":"Rich T"},"Y","Y",2,null,null,null,null,2.04,2,2.04,11,2.04,1]
[17,null,"N",{"$f":"YTD!P31","v":"Ron"},"N","N",null,null,null,null,null,null,{"$f":"G20+H20","v":0},{"$f":"L20-(I20*0.2)","v":0},35,{"$f":"IF(F20=\"Y\",N20,0)","v":0},0]
[18,5,"N",{"$f":"YTD!P32","v":"Scott"},"Y","N",5,null,1,null,null,6.18,5,5.9799999999999995,2,0,0]
[19,6,"N",{"$f":"YTD!P33","v":"Steve D"},"Y","N",5,null,null,null,null,5.03,5,5.03,4,0,0]
[20,4,"N",{"$f":"YTD!P34","v":"Steve S"},"Y","Y",0,null,null,null,null,0,{"$f":"G23+H23","v":0},{"$f":"L23-(I23*0.2)","v":0},30,0,1]
[21,8,"N",{"$f":"YTD!P35","v":"Tom"},"Y","N",4,null,null,null,null,4.43,4,4.43,7,0,0]
[22,null,"N",{"$f":"YTD!P36","v":"X"},"N","N",null,null,null,null,null,null,0,0,35,0,0]
[23,null,"N",{"$f":"YTD!P37","v":"X"},"N","N",null,null,null,null,null,null,0,0,35,0,0]
[24,null,"N",{"$f":"YTD!P38","v":"X"},"N","N",null,null,null,null,null,null,0,0,35,0,0]
[25,null,"N",{"$f":"YTD!P39","v":"X"},"N","N",null,null,null,null,null,null,{"$f":"G28+H28","v":0},{"$f":"L28-(I28*0.2)","v":0},35,{"$f":"IF(F28=\"Y\",N28,0)","v":0},{"$f":"IF(E28=\"N\",0,(IF(F28=\"N\",0,1)))","v":0}]
[26,null,"N",{"$f":"YTD!P40","v":"X"},"N","N",null,null,null,null,null,null,{"$f":"G29+H29","v":0},{"$f":"L29-(I29*0.2)","v":0},35,{"$f":"IF(F29=\"Y\",N29,0)","v":0},{"$f":"IF(E29=\"N\",0,(IF(F29=\"N\",0,1)))","v":0}]
[null,null,null,"Totals",{"$f":"COUNTIF(E4:E29,\"Y\")","v":19},null,{"$f":"SUM(G4:G29)","v":50},{"$f":"SUM(H4:H29)","v":0},{"$f":"SUM(I4:I29)","v":3},{"$f":"MAX(J4:J29)","v":5.96},null,{"$f":"SUM(L4:L29)","v":59.93},{"$f":"SUM(M4:M29)","v":50},{"$f":"SUM(N4:N29)","v":59.33},null,{"$f":"SUM(P4:P29)","v":23.41},{"$f":"SUM(Q4:Q29)","v":9}]
[null,"Place","Team #","Partners",null,null,"Total Weight",null,"Place","Team #","Partners",null,null,"Total Weight",null,"NB Avg",{"$f":"IF(Q30=0,\"No Data\",P30/Q30)","v":2.6011111111111109}]
[null,"1st",{"$f":"Teams!$N94","v":7},{"$f":"VLOOKUP($C32,$B$4:$D$29,3,0)","v":"Jack"},"&",{"$f":"IF($B$4:$B$29=20,\"#N/A\",IF(COUNTIF($B$4:$B$29,$C32)=1,\"Alone\",LOOKUP(2,1/($B$4:$B$29=$C32),$D$4:$D$29)))","v":"Jeff"},{"$f":"Teams!O94","v":10.34},null,"4th",{"$f":"Teams!$N97","v":8},{"$f":"VLOOKUP($J32,$B$4:$D$29,3,0)","v":"Pete"},"&",{"$f":"IF($B$4:$B$29=20,\"#N/A\",IF(COUNTIF($B$4:$B$29,$J32)=1,\"Alone\",LOOKUP(2,1/($B$4:$B$29=$J32),$D$4:$D$29)))","v":"Tom"},{"$f":"Teams!O97","v":6.4799999999999995}]
[null,"2nd",{"$f":"Teams!$N95","v":5},{"$f":"VLOOKUP($C33,$B$4:$D$29,3,0)","v":"Kam"},"&",{"$f":"IF($B$4:$B$29=20,\"#N/A\",IF(COUNTIF($B$4:$B$29,$C33)=1,\"Alone\",LOOKUP(2,1/($B$4:$B$29=$C33),$D$4:$D$29)))","v":"Scott"},{"$f":"Teams!O95","v":7.9099999999999993},null,"5th",{"$f":"Teams!$N98","v":9},{"$f":"VLOOKUP($J33,$B$4:$D$29,3,0)","v":"Jason"},"&",{"$f":"IF($B$4:$B$29=20,\"#N/A\",IF(COUNTIF($B$4:$B$29,$J33)=1,\"Alone\",LOOKUP(2,1/($B$4:$B$29=$J33),$D$4:$D$29)))","v":"Mike G"},{"$f":"Teams!O98","v":5.99}]
[null,"3rd",{"$f":"Teams!$N96","v":3},{"$f":"VLOOKUP($C34,$B$4:$D$29,3,0)","v":"Dean"},"&",{"$f":"IF($B$4:$B$29=20,\"#N/A\",IF(COUNTIF($B$4:$B$29,$C34)=1,\"Alone\",LOOKUP(2,1/($B$4:$B$29=$C34),$D$4:$D$29)))","v":"Mike M"},{"$f":"Teams!O96","v":7.2},null,"6th",{"$f":"Teams!$N99","v":6},{"$f":"VLOOKUP($J34,$B$4:$D$29,3,0)","v":"Joe"},"&",{"$f":"IF($B$4:$B$29=20,\"#N/A\",IF(COUNTIF($B$4:$B$29,$J34)=1,\"Alone\",LOOKUP(2,1/($B$4:$B$29=$J34),$D$4:$D$29)))","v":"Steve D"},{"$f":"Teams!O99","v":5.76}]

{"sheet":"Candlewood","index":4,"n_rows":34,"n_cols":17,"rows_kept":34,"cut":false,"hidden":false,"merged":[[32,6,32,7],[32,13,32,14],[0,0,0,16],[30,3,30,5],[30,6,30,7],[30,10,30,12],[1,0,2,0],[33,6,33,7],[33,13,33,14],[30,13,30,14],[31,6,31,7],[31,13,31,14]]}
[{"$f":"YTD!L19","v":"Candlewood"}]
[null,"Team","Fish","Member","Show","Non","Number","Number","Number","Lunker","Species","Gross","Total","Net","Points","Non Boater","# Non-"]
[null,"Number","Alone?","Name","Up?","Boater?","of LMB","of SMB","Dead","Weight","LMB/SMB","Weight","Caught","Weight","Awarded","Weight","Boaters"]
[1,null,"N",{"$f":"YTD!P15","v":"Armand"},"N","N",null,null,null,null,null,null,{"$f":"G4+H4","v":0},{"$f":"L4-(I4*0.2)","v":0},{"$f":"IF($E4=\"N\",35,IF($M4=0,30,RANK($N4,$N$4:$N$29,0)))","v":35},{"$f":"IF(F4=\"Y\",N4,0)","v":0},{"$f":"IF(E4=\"N\",0,(IF(F4=\"N\",0,1)))","v":0}]
[2,6,"N",{"$f":"YTD!P16","v":"Bill"},"Y","Y",0,0,null,null,null,null,0,0,{"$f":"IF($E5=\"N\",35,IF($M5=0,30,RANK($N5,$N$4:$N$29,0)))","v":30},0,{"$f":"IF(E5=\"N\",0,(IF(F5=\"N\",0,1)))","v":1}]
[3,6,"N",{"$f":"YTD!P17","v":"Dean"},"Y","N",null,1,null,null,null,2.67,{"$f":"G6+H6","v":1},{"$f":"L6-(I6*0.2)","v":2.67},7,{"$f":"IF(F6=\"Y\",N6,0)","v":0},0]
[4,9,"N",{"$f":"YTD!P18","v":"Jack"},"Y","Y",0,0,null,null,null,null,0,0,30,0,1]
[5,3,"N",{"$f":"YTD!P19","v":"Jason"},"Y","N",0,0,null,null,null,null,{"$f":"G8+H8","v":0},{"$f":"L8-(I8*0.2)","v":0},30,{"$f":"IF(F8=\"Y\",N8,0)","v":0},0]
[6,9,"N",{"$f":"YTD!P20","v":"Jeff"},"Y","N",1,1,null,null,null,4.13,2,4.13,4,0,0]
[7,null,"N",{"$f":"YTD!P21","v":"Jim B"},"N","Y",null,null,null,null,null,null,0,0,35,0,0]
[8,7,"N",{"$f":"YTD!P22","v":"Joe"},"Y","Y",null,1,null,null,null,2.13,{"$f":"G11+H11","v":1},{"$f":"L11-(I11*0.2)","v":2.13},12,{"$f":"IF(F11=\"Y\",N11,0)","v":2.13},1]
[9,3,"N",{"$f":"YTD!P23","v":"Kam"},"Y","Y",null,1,null,null,null,2.42,1,2.42,9,2.42,1]
[10,7,"N",{"$f":"YTD!P24","v":"Kevin"},"Y","N",null,1,null,null,null,1.9,1,1.9,13,0,0]
[11,5,"N",{"$f":"YTD!P25","v":"Mike M"},"Y","Y",null,1,null,null,null,1.72,1,1.72,14,1.72,1]
[12,null,"N",{"$f":"YTD!P26","v":"Mike G"},"N","Y",null,null,null,null,null,null,0,0,35,0,0]
[13,8,"N",{"$f":"YTD!P27","v":"Morrie"},"Y","N",1,2,null,3.47,"SMB",6.02,3,6.02,2,0,0]
[14,8,"N",{"$f":"YTD!P28","v":"Pete"},"Y","Y",1,4,2,null,null,8.35,5,7.9499999999999993,1,7.9499999999999993,1]
[15,5,"N",{"$f":"YTD!P29","v":"Rich B"},"Y","N",1,1,null,null,null,2.88,{"$f":"G18+H18","v":2},{"$f":"L18-(I18*0.2)","v":2.88},6,0,0]
[16,2,"N",{"$f":"YTD!P30","v":"Rich T"},"Y","Y",1,null,null,null,null,2.35,1,2.35,11,2.35,1]
[17,1,"N",{"$f":"YTD!P31","v":"Ron"},"Y","N",null,1,0,null,null,2.41,{"$f":"G20+H20","v":1},{"$f":"L20-(I20*0.2)","v":2.41},10,{"$f":"IF(F20=\"Y\",N20,0)","v":0},0]
[18,4,"Y",{"$f":"YTD!P32","v":"Scott"},"Y","N",null,1,null,null,null,3.42,1,3.42,5,0,0]
[19,2,"N",{"$f":"YTD!P33","v":"Steve D"},"Y","N",null,1,null,null,null,2.56,1,2.56,8,0,0]
[20,1,"N",{"$f":"YTD!P34","v":"Steve S"},"Y","Y",1,1,1,null,null,4.84,{"$f":"G23+H23","v":2},{"$f":"L23-(I23*0.2)","v":4.6399999999999997},3,4.6399999999999997,1]
[21,null,"N",{"$f":"YTD!P35","v":"Tom"},"N","N",null,null,null,null,null,null,0,0,35,0,0]
[22,null,"N",{"$f":"YTD!P36","v":"X"},"N","N",null,null,null,null,null,null,0,0,35,0,0]
[23,null,"N",{"$f":"YTD!P37","v":"X"},"N","N",null,null,null,null,null,null,0,0,35,0,0]
[24,null,"N",{"$f":"YTD!P38","v":"X"},"N","N",null,null,null,null,null,null,0,0,35,0,0]
[25,null,"N",{"$f":"YTD!P39","v":"X"},"N","N",null,null,null,null,null,null,{"$f":"G28+H28","v":0},{"$f":"L28-(I28*0.2)","v":0},35,{"$f":"IF(F28=\"Y\",N28,0)","v":0},{"$f":"IF(E28=\"N\",0,(IF(F28=\"N\",0,1)))","v":0}]
[26,null,"N",{"$f":"YTD!P40","v":"X"},"N","N",null,null,null,null,null,null,{"$f":"G29+H29","v":0},{"$f":"L29-(I29*0.2)","v":0},35,{"$f":"IF(F29=\"Y\",N29,0)","v":0},{"$f":"IF(E29=\"N\",0,(IF(F29=\"N\",0,1)))","v":0}]
[null,null,null,"Totals",{"$f":"COUNTIF(E4:E29,\"Y\")","v":17},null,{"$f":"SUM(G4:G29)","v":6},{"$f":"SUM(H4:H29)","v":17},{"$f":"SUM(I4:I29)","v":3},{"$f":"MAX(J4:J29)","v":3.47},null,{"$f":"SUM(L4:L29)","v":47.800000000000011},{"$f":"SUM(M4:M29)","v":23},{"$f":"SUM(N4:N29)","v":47.2},null,{"$f":"SUM(P4:P29)","v":21.21},{"$f":"SUM(Q4:Q29)","v":8}]
[null,"Place","Team #","Partners",null,null,"Total Weight",null,"Place","Team #","Partners",null,null,"Total Weight",null,"NB Avg",{"$f":"IF(Q30=0,\"No Data\",P30/Q30)","v":2.6512500000000001}]
[null,"1st",{"$f":"Teams!$AD4","v":8},{"$f":"VLOOKUP($C32,$B$4:$D$29,3,0)","v":"Morrie"},"&",{"$f":"IF($B$4:$B$29=20,\"#N/A\",IF(COUNTIF($B$4:$B$29,$C32)=1,\"Alone\",LOOKUP(2,1/($B$4:$B$29=$C32),$D$4:$D$29)))","v":"Pete"},{"$f":"Teams!AE4","v":13.969999999999999},null,"4th",{"$f":"Teams!$AD7","v":2},{"$f":"VLOOKUP($J32,$B$4:$D$29,3,0)","v":"Rich T"},"&",{"$f":"IF($B$4:$B$29=20,\"#N/A\",IF(COUNTIF($B$4:$B$29,$J32)=1,\"Alone\",LOOKUP(2,1/($B$4:$B$29=$J32),$D$4:$D$29)))","v":"Steve D"},{"$f":"Teams!AE7","v":4.91}]
[null,"2nd",{"$f":"Teams!$AD5","v":1},{"$f":"VLOOKUP($C33,$B$4:$D$29,3,0)","v":"Ron"},"&",{"$f":"IF($B$4:$B$29=20,\"#N/A\",IF(COUNTIF($B$4:$B$29,$C33)=1,\"Alone\",LOOKUP(2,1/($B$4:$B$29=$C33),$D$4:$D$29)))","v":"Steve S"},{"$f":"Teams!AE5","v":7.05},null,"5th",{"$f":"Teams!$AD8","v":5},{"$f":"VLOOKUP($J33,$B$4:$D$29,3,0)","v":"Mike M"},"&",{"$f":"IF($B$4:$B$29=20,\"#N/A\",IF(COUNTIF($B$4:$B$29,$J33)=1,\"Alone\",LOOKUP(2,1/($B$4:$B$29=$J33),$D$4:$D$29)))","v":"Rich B"},{"$f":"Teams!AE8","v":4.5999999999999996}]
[null,"3rd",{"$f":"Teams!$AD6","v":4},{"$f":"VLOOKUP($C34,$B$4:$D$29,3,0)","v":"Scott"},"&",{"$f":"IF($B$4:$B$29=20,\"#N/A\",IF(COUNTIF($B$4:$B$29,$C34)=1,\"Alone\",LOOKUP(2,1/($B$4:$B$29=$C34),$D$4:$D$29)))","v":"Alone"},{"$f":"Teams!AE6","v":6.07125},null,"6th",{"$f":"Teams!$AD9","v":9},{"$f":"VLOOKUP($J34,$B$4:$D$29,3,0)","v":"Jack"},"&",{"$f":"IF($B$4:$B$29=20,\"#N/A\",IF(COUNTIF($B$4:$B$29,$J34)=1,\"Alone\",LOOKUP(2,1/($B$4:$B$29=$J34),$D$4:$D$29)))","v":"Jeff"},{"$f":"Teams!AE9","v":4.13}]

{"sheet":"Winchester","index":5,"n_rows":34,"n_cols":17,"rows_kept":34,"cut":false,"hidden":false,"merged":[[32,6,32,7],[32,13,32,14],[0,0,0,16],[30,3,30,5],[30,6,30,7],[30,10,30,12],[1,0,2,0],[33,6,33,7],[33,13,33,14],[30,13,30,14],[31,6,31,7],[31,13,31,14]]}
[{"$f":"YTD!L20","v":"Winchester"}]
[null,"Team","Fish","Member","Show","Non","Number","Number","Number","Lunker","Species","Gross","Total","Net","Points","Non Boater","# Non-"]
[null,"Number","Alone?","Name","Up?","Boater?","of LMB","of SMB","Dead","Weight","LMB/SMB","Weight","Caught","Weight","Awarded","Weight","Boaters"]
[1,8,"N",{"$f":"YTD!P15","v":"Armand"},"Y","N",1,null,null,null,null,1.59,{"$f":"G4+H4","v":1},{"$f":"L4-(I4*0.2)","v":1.59},{"$f":"IF($E4=\"N\",35,IF($M4=0,30,RANK($N4,$N$4:$N$29,0)))","v":11},{"$f":"IF(F4=\"Y\",N4,0)","v":0},{"$f":"IF(E4=\"N\",0,(IF(F4=\"N\",0,1)))","v":0}]
[2,3,"N",{"$f":"YTD!P16","v":"Bill"},"Y","Y",2,null,null,null,null,1.58,2,1.58,{"$f":"IF($E5=\"N\",35,IF($M5=0,30,RANK($N5,$N$4:$N$29,0)))","v":12},1.58,{"$f":"IF(E5=\"N\",0,(IF(F5=\"N\",0,1)))","v":1}]
[3,10,"N",{"$f":"YTD!P17","v":"Dean"},"Y","N",5,null,null,null,null,4.8499999999999996,{"$f":"G6+H6","v":5},{"$f":"L6-(I6*0.2)","v":4.8499999999999996},6,{"$f":"IF(F6=\"Y\",N6,0)","v":0},0]
[4,10,"N",{"$f":"YTD!P18","v":"Jack"},"Y","Y",1,null,null,null,null,1.05,1,1.05,14,1.05,1]
[5,6,"N",{"$f":"YTD!P19","v":"Jason"},"Y","N",3,null,null,null,null,3.58,{"$f":"G8+H8","v":3},{"$f":"L8-(I8*0.2)","v":3.58},9,{"$f":"IF(F8=\"Y\",N8,0)","v":0},0]
[6,2,"N",{"$f":"YTD!P20","v":"Jeff"},"Y","N",3,null,null,null,null,4.6399999999999997,3,4.6399999999999997,7,0,0]
[7,null,"N",{"$f":"YTD!P21","v":"Jim B"},"N","Y",null,null,null,null,null,null,0,0,35,0,0]
[8,5,"N",{"$f":"YTD!P22","v":"Joe"},"Y","Y",0,null,null,null,null,null,{"$f":"G11+H11","v":0},{"$f":"L11-(I11*0.2)","v":0},30,{"$f":"IF(F11=\"Y\",N11,0)","v":0},1]
[9,9,"N",{"$f":"YTD!P23","v":"Kam"},"Y","Y",0,null,null,null,null,null,0,0,30,0,1]
[10,null,"N",{"$f":"YTD!P24","v":"Kevin"},"N","N",null,null,null,null,null,null,0,0,35,0,0]
[11,2,"N",{"$f":"YTD!P25","v":"Mike M"},"Y","Y",0,null,null,null,null,null,0,0,30,0,1]
[12,8,"N",{"$f":"YTD!P26","v":"Mike G"},"Y","Y",3,null,null,3.83,"LMB",5.76,3,5.76,3,5.76,1]
[13,9,"N",{"$f":"YTD!P27","v":"Morrie"},"Y","N",2,null,null,null,null,1.64,2,1.64,10,0,0]
[14,1,"N",{"$f":"YTD!P28","v":"Pete"},"Y","Y",4,null,null,null,null,5.03,4,5.03,5,5.03,1]
[15,3,"N",{"$f":"YTD!P29","v":"Rich B"},"Y","N",1,null,null,null,null,1.19,{"$f":"G18+H18","v":1},{"$f":"L18-(I18*0.2)","v":1.19},13,0,0]
[16,7,"N",{"$f":"YTD!P30","v":"Rich T"},"Y","N",4,null,1,null,null,4.0999999999999996,4,3.8999999999999995,8,0,0]
[17,5,"N",{"$f":"YTD!P31","v":"Ron"},"Y","N",0,null,null,null,null,null,{"$f":"G20+H20","v":0},{"$f":"L20-(I20*0.2)","v":0},30,{"$f":"IF(F20=\"Y\",N20,0)","v":0},0]
[18,7,"N",{"$f":"YTD!P32","v":"Scott"},"Y","Y",5,null,1,null,null,6.69,5,6.49,1,6.49,1]
[19,1,"N",{"$f":"YTD!P33","v":"Steve D"},"Y","N",5,null,null,null,null,5.87,5,5.87,2,0,0]
[20,6,"N",{"$f":"YTD!P34","v":"Steve S"},"Y","Y",2,null,null,null,null,5.05,{"$f":"G23+H23","v":2},{"$f":"L23-(I23*0.2)","v":5.05},4,5.05,1]
[21,4,"Y",{"$f":"YTD!P35","v":"Tom"},"Y","N",1,null,null,null,null,0.74,1,0.74,15,0,0]
[22,null,"N",{"$f":"YTD!P36","v":"X"},"N","N",null,null,null,null,null,null,0,0,35,0,0]
[23,null,"N",{"$f":"YTD!P37","v":"X"},"N","N",null,null,null,null,null,null,0,0,35,0,0]
[24,null,"N",{"$f":"YTD!P38","v":"X"},"N","N",null,null,null,null,null,null,0,0,35,0,0]
[25,null,"N",{"$f":"YTD!P39","v":"X"},"N","N",null,null,null,null,null,null,{"$f":"G28+H28","v":0},{"$f":"L28-(I28*0.2)","v":0},35,{"$f":"IF(F28=\"Y\",N28,0)","v":0},{"$f":"IF(E28=\"N\",0,(IF(F28=\"N\",0,1)))","v":0}]
[26,null,"N",{"$f":"YTD!P40","v":"X"},"N","N",null,null,null,null,null,null,{"$f":"G29+H29","v":0},{"$f":"L29-(I29*0.2)","v":0},35,{"$f":"IF(F29=\"Y\",N29,0)","v":0},{"$f":"IF(E29=\"N\",0,(IF(F29=\"N\",0,1)))","v":0}]
[null,null,null,"Totals",{"$f":"COUNTIF(E4:E29,\"Y\")","v":19},null,{"$f":"SUM(G4:G29)","v":42},{"$f":"SUM(H4:H29)","v":0},{"$f":"SUM(I4:I29)","v":2},{"$f":"MAX(J4:J29)","v":3.83},null,{"$f":"SUM(L4:L29)","v":53.359999999999992},{"$f":"SUM(M4:M29)","v":42},{"$f":"SUM(N4:N29)","v":52.96},null,{"$f":"SUM(P4:P29)","v":24.960000000000004},{"$f":"SUM(Q4:Q29)","v":9}]
[null,"Place","Team #","Partners",null,null,"Total Weight",null,"Place","Team #","Partners",null,null,"Total Weight",null,"NB Avg",{"$f":"IF(Q30=0,\"No Data\",P30/Q30)","v":2.7733333333333339}]
[null,"1st",{"$f":"Teams!$AD34","v":1},{"$f":"VLOOKUP($C32,$B$4:$D$29,3,0)","v":"Pete"},"&",{"$f":"IF($B$4:$B$29=20,\"#N/A\",IF(COUNTIF($B$4:$B$29,$C32)=1,\"Alone\",LOOKUP(2,1/($B$4:$B$29=$C32),$D$4:$D$29)))","v":"Steve D"},{"$f":"Teams!AE34","v":10.9},null,"4th",{"$f":"Teams!$AD37","v":8},{"$f":"VLOOKUP($J32,$B$4:$D$29,3,0)","v":"Armand"},"&",{"$f":"IF($B$4:$B$29=20,\"#N/A\",IF(COUNTIF($B$4:$B$29,$J32)=1,\"Alone\",LOOKUP(2,1/($B$4:$B$29=$J32),$D$4:$D$29)))","v":"Mike G"},{"$f":"Teams!AE37","v":7.35}]
[null,"2nd",{"$f":"Teams!$AD35","v":7},{"$f":"VLOOKUP($C33,$B$4:$D$29,3,0)","v":"Rich T"},"&",{"$f":"IF($B$4:$B$29=20,\"#N/A\",IF(COUNTIF($B$4:$B$29,$C33)=1,\"Alone\",LOOKUP(2,1/($B$4:$B$29=$C33),$D$4:$D$29)))","v":"Scott"},{"$f":"Teams!AE35","v":10.39},null,"5th",{"$f":"Teams!$AD38","v":10},{"$f":"VLOOKUP($J33,$B$4:$D$29,3,0)","v":"Dean"},"&",{"$f":"IF($B$4:$B$29=20,\"#N/A\",IF(COUNTIF($B$4:$B$29,$J33)=1,\"Alone\",LOOKUP(2,1/($B$4:$B$29=$J33),$D$4:$D$29)))","v":"Jack"},{"$f":"Teams!AE38","v":5.8999999999999995}]
[null,"3rd",{"$f":"Teams!$AD36","v":6},{"$f":"VLOOKUP($C34,$B$4:$D$29,3,0)","v":"Jason"},"&",{"$f":"IF($B$4:$B$29=20,\"#N/A\",IF(COUNTIF($B$4:$B$29,$C34)=1,\"Alone\",LOOKUP(2,1/($B$4:$B$29=$C34),$D$4:$D$29)))","v":"Steve S"},{"$f":"Teams!AE36","v":8.629999999999999},null,"6th",{"$f":"Teams!$AD39","v":2},{"$f":"VLOOKUP($J34,$B$4:$D$29,3,0)","v":"Jeff"},"&",{"$f":"IF($B$4:$B$29=20,\"#N/A\",IF(COUNTIF($B$4:$B$29,$J34)=1,\"Alone\",LOOKUP(2,1/($B$4:$B$29=$J34),$D$4:$D$29)))","v":"Mike M"},{"$f":"Teams!AE39","v":4.6399999999999997}]

{"sheet":"Mansfield","index":6,"n_rows":34,"n_cols":17,"rows_kept":34,"cut":false,"hidden":false,"merged":[[32,6,32,7],[32,13,32,14],[0,0,0,16],[30,3,30,5],[30,6,30,7],[30,10,30,12],[1,0,2,0],[33,6,33,7],[33,13,33,14],[30,13,30,14],[31,6,31,7],[31,13,31,14]]}
[{"$f":"YTD!L21","v":"Mansfield"}]
[null,"Team","Fish","Member","Show","Non","Number","Number","Number","Lunker","Species","Gross","Total","Net","Points","Non Boater","# Non-"]
[null,"Number","Alone?","Name","Up?","Boater?","of LMB","of SMB","Dead","Weight","LMB/SMB","Weight","Caught","Weight","Awarded","Weight","Boaters"]
[1,9,"N",{"$f":"YTD!P15","v":"Armand"},"Y","N",2,null,null,null,null,1.93,{"$f":"G4+H4","v":2},{"$f":"L4-(I4*0.2)","v":1.93},{"$f":"IF($E4=\"N\",35,IF($M4=0,30,RANK($N4,$N$4:$N$29,0)))","v":15},{"$f":"IF(F4=\"Y\",N4,0)","v":0},{"$f":"IF(E4=\"N\",0,(IF(F4=\"N\",0,1)))","v":0}]
[2,3,"N",{"$f":"YTD!P16","v":"Bill"},"Y","Y",2,null,null,null,null,3.81,2,3.81,{"$f":"IF($E5=\"N\",35,IF($M5=0,30,RANK($N5,$N$4:$N$29,0)))","v":10},3.81,{"$f":"IF(E5=\"N\",0,(IF(F5=\"N\",0,1)))","v":1}]
[3,2,"N",{"$f":"YTD!P17","v":"Dean"},"Y","N",3,null,null,null,null,5.49,{"$f":"G6+H6","v":3},{"$f":"L6-(I6*0.2)","v":5.49},8,{"$f":"IF(F6=\"Y\",N6,0)","v":0},0]
[4,11,"N",{"$f":"YTD!P18","v":"Jack"},"Y","Y",0,null,null,null,null,0,0,0,30,0,1]
[5,4,"N",{"$f":"YTD!P19","v":"Jason"},"Y","N",4,null,null,null,null,5.57,{"$f":"G8+H8","v":4},{"$f":"L8-(I8*0.2)","v":5.57},6,{"$f":"IF(F8=\"Y\",N8,0)","v":0},0]
[6,8,"N",{"$f":"YTD!P20","v":"Jeff"},"Y","N",3,null,null,null,null,5.53,3,5.53,7,0,0]
[7,9,"N",{"$f":"YTD!P21","v":"Jim B"},"Y","Y",1,null,null,null,null,2.21,1,2.21,13,2.21,1]
[8,4,"N",{"$f":"YTD!P22","v":"Joe"},"Y","Y",0,null,null,null,null,0,{"$f":"G11+H11","v":0},{"$f":"L11-(I11*0.2)","v":0},30,{"$f":"IF(F11=\"Y\",N11,0)","v":0},1]
[9,7,"N",{"$f":"YTD!P23","v":"Kam"},"Y","Y",0,null,null,null,null,0,0,0,30,0,1]
[10,1,"N",{"$f":"YTD!P24","v":"Kevin"},"Y","N",1,1,null,null,null,2.0099999999999998,2,2.0099999999999998,14,0,0]
[11,5,"N",{"$f":"YTD!P25","v":"Mike M"},"Y","Y",5,null,1,null,null,9.18,5,8.98,1,8.98,1]
[12,2,"N",{"$f":"YTD!P26","v":"Mike G"},"Y","Y",0,null,null,null,null,0,0,0,30,0,1]
[13,10,"Y",{"$f":"YTD!P27","v":"Morrie"},"Y","N",0,null,null,null,null,0,0,0,30,0,0]
[14,1,"N",{"$f":"YTD!P28","v":"Pete"},"Y","Y",4,null,null,null,null,4.58,4,4.58,9,4.58,1]
[15,11,"N",{"$f":"YTD!P29","v":"Rich B"},"Y","N",4,null,null,null,null,7.36,{"$f":"G18+H18","v":4},{"$f":"L18-(I18*0.2)","v":7.36},2,0,0]
[16,3,"N",{"$f":"YTD!P30","v":"Rich T"},"Y","N",5,null,null,null,null,6.17,5,6.17,4,0,0]
[17,6,"N",{"$f":"YTD!P31","v":"Ron"},"Y","N",3,null,null,2.91,"LMB",6.6,{"$f":"G20+H20","v":3},{"$f":"L20-(I20*0.2)","v":6.6},3,{"$f":"IF(F20=\"Y\",N20,0)","v":0},0]
[18,6,"N",{"$f":"YTD!P32","v":"Scott"},"Y","Y",1,1,null,null,null,2.5499999999999998,2,2.5499999999999998,11,2.5499999999999998,1]
[19,7,"N",{"$f":"YTD!P33","v":"Steve D"},"Y","N",2,null,null,null,null,2.48,2,2.48,12,0,0]
[20,8,"N",{"$f":"YTD!P34","v":"Steve S"},"Y","Y",0,null,null,null,null,0,{"$f":"G23+H23","v":0},{"$f":"L23-(I23*0.2)","v":0},30,0,1]
[21,5,"N",{"$f":"YTD!P35","v":"Tom"},"Y","N",5,null,null,null,null,6.1,5,6.1,5,0,0]
[22,null,"N",{"$f":"YTD!P36","v":"X"},"N","N",null,null,null,null,null,null,0,0,35,0,0]
[23,null,"N",{"$f":"YTD!P37","v":"X"},"N","N",null,null,null,null,null,null,0,0,35,0,0]
[24,null,"N",{"$f":"YTD!P38","v":"X"},"N","N",null,null,null,null,null,null,0,0,35,0,0]
[25,null,"N",{"$f":"YTD!P39","v":"X"},"N","N",null,null,null,null,null,null,{"$f":"G28+H28","v":0},{"$f":"L28-(I28*0.2)","v":0},35,{"$f":"IF(F28=\"Y\",N28,0)","v":0},{"$f":"IF(E28=\"N\",0,(IF(F28=\"N\",0,1)))","v":0}]
[26,null,"N",{"$f":"YTD!P40","v":"X"},"N","N",null,null,null,null,null,null,{"$f":"G29+H29","v":0},{"$f":"L29-(I29*0.2)","v":0},35,{"$f":"IF(F29=\"Y\",N29,0)","v":0},{"$f":"IF(E29=\"N\",0,(IF(F29=\"N\",0,1)))","v":0}]
[null,null,null,"Totals",{"$f":"COUNTIF(E4:E29,\"Y\")","v":21},null,{"$f":"SUM(G4:G29)","v":45},{"$f":"SUM(H4:H29)","v":2},{"$f":"SUM(I4:I29)","v":1},{"$f":"MAX(J4:J29)","v":2.91},null,{"$f":"SUM(L4:L29)","v":71.569999999999993},{"$f":"SUM(M4:M29)","v":47},{"$f":"SUM(N4:N29)","v":71.36999999999999},null,{"$f":"SUM(P4:P29)","v":22.13},{"$f":"SUM(Q4:Q29)","v":10}]
[null,"Place","Team #","Partners",null,null,"Total Weight",null,"Place","Team #","Partners",null,null,"Total Weight",null,"NB Avg",{"$f":"IF(Q30=0,\"No Data\",P30/Q30)","v":2.2130000000000001}]
[null,"1st",{"$f":"Teams!$AD64","v":5},{"$f":"VLOOKUP($C32,$B$4:$D$29,3,0)","v":"Mike M"},"&",{"$f":"IF($B$4:$B$29=20,\"#N/A\",IF(COUNTIF($B$4:$B$29,$C32)=1,\"Alone\",LOOKUP(2,1/($B$4:$B$29=$C32),$D$4:$D$29)))","v":"Tom"},{"$f":"Teams!AE64","v":15.08},null,"4th",{"$f":"Teams!$AD67","v":11},{"$f":"VLOOKUP($J32,$B$4:$D$29,3,0)","v":"Jack"},"&",{"$f":"IF($B$4:$B$29=20,\"#N/A\",IF(COUNTIF($B$4:$B$29,$J32)=1,\"Alone\",LOOKUP(2,1/($B$4:$B$29=$J32),$D$4:$D$29)))","v":"Rich B"},{"$f":"Teams!AE67","v":7.36}]
[null,"2nd",{"$f":"Teams!$AD65","v":3},{"$f":"VLOOKUP($C33,$B$4:$D$29,3,0)","v":"Bill"},"&",{"$f":"IF($B$4:$B$29=20,\"#N/A\",IF(COUNTIF($B$4:$B$29,$C33)=1,\"Alone\",LOOKUP(2,1/($B$4:$B$29=$C33),$D$4:$D$29)))","v":"Rich T"},{"$f":"Teams!AE65","v":9.98},null,"5th",{"$f":"Teams!$AD68","v":1},{"$f":"VLOOKUP($J33,$B$4:$D$29,3,0)","v":"Kevin"},"&",{"$f":"IF($B$4:$B$29=20,\"#N/A\",IF(COUNTIF($B$4:$B$29,$J33)=1,\"Alone\",LOOKUP(2,1/($B$4:$B$29=$J33),$D$4:$D$29)))","v":"Pete"},{"$f":"Teams!AE68","v":6.59}]
[null,"3rd",{"$f":"Teams!$AD66","v":6},{"$f":"VLOOKUP($C34,$B$4:$D$29,3,0)","v":"Ron"},"&",{"$f":"IF($B$4:$B$29=20,\"#N/A\",IF(COUNTIF($B$4:$B$29,$C34)=1,\"Alone\",LOOKUP(2,1/($B$4:$B$29=$C34),$D$4:$D$29)))","v":"Scott"},{"$f":"Teams!AE66","v":9.1499999999999986},null,"6th",{"$f":"Teams!$AD69","v":4},{"$f":"VLOOKUP($J34,$B$4:$D$29,3,0)","v":"Jason"},"&",{"$f":"IF($B$4:$B$29=20,\"#N/A\",IF(COUNTIF($B$4:$B$29,$J34)=1,\"Alone\",LOOKUP(2,1/($B$4:$B$29=$J34),$D$4:$D$29)))","v":"Joe"},{"$f":"Teams!AE69","v":5.57}]

{"sheet":"Aspinook","index":7,"n_rows":34,"n_cols":17,"rows_kept":34,"cut":false,"hidden":false,"merged":[[32,6,32,7],[32,13,32,14],[0,0,0,16],[30,3,30,5],[30,6,30,7],[30,10,30,12],[1,0,2,0],[33,6,33,7],[33,13,33,14],[30,13,30,14],[31,6,31,7],[31,13,31,14]]}
[{"$f":"YTD!L22","v":"Aspinook"}]
[null,"Team","Fish","Member","Show","Non","Number","Number","Number","Lunker","Species","Gross","Total","Net","Points","Non Boater","# Non-"]
[null,"Number","Alone?","Name","Up?","Boater?","of LMB","of SMB","Dead","Weight","LMB/SMB","Weight","Caught","Weight","Awarded","Weight","Boaters"]
[1,2,"N",{"$f":"YTD!P15","v":"Armand"},"Y","N",1,1,null,null,null,1.95,{"$f":"G4+H4","v":2},{"$f":"L4-(I4*0.2)","v":1.95},{"$f":"IF($E4=\"N\",35,IF($M4=0,30,RANK($N4,$N$4:$N$29,0)))","v":7},{"$f":"IF(F4=\"Y\",N4,0)","v":0},{"$f":"IF(E4=\"N\",0,(IF(F4=\"N\",0,1)))","v":0}]
[2,null,"N",{"$f":"YTD!P16","v":"Bill"},"N","Y",null,null,null,null,null,null,0,0,{"$f":"IF($E5=\"N\",35,IF($M5=0,30,RANK($N5,$N$4:$N$29,0)))","v":35},0,{"$f":"IF(E5=\"N\",0,(IF(F5=\"N\",0,1)))","v":0}]
[3,5,"N",{"$f":"YTD!P17","v":"Dean"},"Y","N",0,null,null,null,null,null,{"$f":"G6+H6","v":0},{"$f":"L6-(I6*0.2)","v":0},30,{"$f":"IF(F6=\"Y\",N6,0)","v":0},0]
[4,null,"N",{"$f":"YTD!P18","v":"Jack"},"N","Y",null,null,null,null,null,null,0,0,35,0,0]
[5,9,"N",{"$f":"YTD!P19","v":"Jason"},"Y","N",1,1,null,null,null,1.94,{"$f":"G8+H8","v":2},{"$f":"L8-(I8*0.2)","v":1.94},8,{"$f":"IF(F8=\"Y\",N8,0)","v":0},0]
[6,3,"N",{"$f":"YTD!P20","v":"Jeff"},"Y","N",1,null,null,null,null,2.65,1,2.65,5,0,0]
[7,5,"N",{"$f":"YTD!P21","v":"Jim B"},"Y","Y",0,null,null,null,null,null,0,0,30,0,1]
[8,3,"N",{"$f":"YTD!P22","v":"Joe"},"Y","Y",0,null,null,null,null,null,{"$f":"G11+H11","v":0},{"$f":"L11-(I11*0.2)","v":0},30,{"$f":"IF(F11=\"Y\",N11,0)","v":0},1]
[9,1,"N",{"$f":"YTD!P23","v":"Kam"},"Y","Y",3,1,null,null,null,6.95,4,6.95,2,6.95,1]
[10,1,"N",{"$f":"YTD!P24","v":"Kevin"},"Y","N",4,1,null,5.4,"LMB",14.95,5,14.95,1,0,0]
[11,7,"N",{"$f":"YTD!P25","v":"Mike M"},"Y","Y",null,1,null,null,null,0.91400000000000003,1,0.91400000000000003,9,0.91400000000000003,1]
[12,null,"N",{"$f":"YTD!P26","v":"Mike G"},"N","Y",null,null,null,null,null,null,0,0,35,0,0]
[13,7,"N",{"$f":"YTD!P27","v":"Morrie"},"Y","N",0,null,null,null,null,null,0,0,30,0,0]
[14,8,"N",{"$f":"YTD!P28","v":"Pete"},"Y","Y",0,null,null,null,null,null,0,0,30,0,1]
[15,6,"N",{"$f":"YTD!P29","v":"Rich B"},"Y","N",0,null,null,null,null,null,{"$f":"G18+H18","v":0},{"$f":"L18-(I18*0.2)","v":0},30,0,0]
[16,9,"N",{"$f":"YTD!P30","v":"Rich T"},"Y","Y",0,null,null,null,null,null,0,0,30,0,1]
[17,8,"N",{"$f":"YTD!P31","v":"Ron"},"Y","N",3,null,null,null,null,4.55,{"$f":"G20+H20","v":3},{"$f":"L20-(I20*0.2)","v":4.55},3,{"$f":"IF(F20=\"Y\",N20,0)","v":0},0]
[18,6,"N",{"$f":"YTD!P32","v":"Scott"},"Y","Y",1,null,null,null,null,2.27,1,2.27,6,2.27,1]
[19,10,"Y",{"$f":"YTD!P33","v":"Steve D"},"Y","N",0,null,null,null,null,null,0,0,30,0,0]
[20,2,"N",{"$f":"YTD!P34","v":"Steve S"},"Y","Y",0,null,null,null,null,null,{"$f":"G23+H23","v":0},{"$f":"L23-(I23*0.2)","v":0},30,0,1]
[21,4,"Y",{"$f":"YTD!P35","v":"Tom"},"Y","N",1,1,null,null,null,2.73,2,2.73,4,0,0]
[22,null,"N",{"$f":"YTD!P36","v":"X"},"N","N",null,null,null,null,null,null,0,0,35,0,0]
[23,null,"N",{"$f":"YTD!P37","v":"X"},"N","N",null,null,null,null,null,null,0,0,35,0,0]
[24,null,"N",{"$f":"YTD!P38","v":"X"},"N","N",null,null,null,null,null,null,0,0,35,0,0]
[25,null,"N",{"$f":"YTD!P39","v":"X"},"N","N",null,null,null,null,null,null,{"$f":"G28+H28","v":0},{"$f":"L28-(I28*0.2)","v":0},35,{"$f":"IF(F28=\"Y\",N28,0)","v":0},{"$f":"IF(E28=\"N\",0,(IF(F28=\"N\",0,1)))","v":0}]
[26,null,"N",{"$f":"YTD!P40","v":"X"},"N","N",null,null,null,null,null,null,{"$f":"G29+H29","v":0},{"$f":"L29-(I29*0.2)","v":0},35,{"$f":"IF(F29=\"Y\",N29,0)","v":0},{"$f":"IF(E29=\"N\",0,(IF(F29=\"N\",0,1)))","v":0}]
[null,null,null,"Totals",{"$f":"COUNTIF(E4:E29,\"Y\")","v":18},null,{"$f":"SUM(G4:G29)","v":15},{"$f":"SUM(H4:H29)","v":6},{"$f":"SUM(I4:I29)","v":0},{"$f":"MAX(J4:J29)","v":5.4},null,{"$f":"SUM(L4:L29)","v":38.903999999999996},{"$f":"SUM(M4:M29)","v":21},{"$f":"SUM(N4:N29)","v":38.903999999999996},null,{"$f":"SUM(P4:P29)","v":10.134},{"$f":"SUM(Q4:Q29)","v":8}]
[null,"Place","Team #","Partners",null,null,"Total Weight",null,"Place","Team #","Partners",null,null,"Total Weight",null,"NB Avg",{"$f":"IF(Q30=0,\"No Data\",P30/Q30)","v":1.26675}]
[null,"1st",{"$f":"Teams!$AD94","v":1},{"$f":"VLOOKUP($C32,$B$4:$D$29,3,0)","v":"Kam"},"&",{"$f":"IF($B$4:$B$29=20,\"#N/A\",IF(COUNTIF($B$4:$B$29,$C32)=1,\"Alone\",LOOKUP(2,1/($B$4:$B$29=$C32),$D$4:$D$29)))","v":"Kevin"},{"$f":"Teams!AE94","v":21.9},null,"4th",{"$f":"Teams!$AD97","v":3},{"$f":"VLOOKUP($J32,$B$4:$D$29,3,0)","v":"Jeff"},"&",{"$f":"IF($B$4:$B$29=20,\"#N/A\",IF(COUNTIF($B$4:$B$29,$J32)=1,\"Alone\",LOOKUP(2,1/($B$4:$B$29=$J32),$D$4:$D$29)))","v":"Joe"},{"$f":"Teams!AE97","v":2.65}]
[null,"2nd",{"$f":"Teams!$AD95","v":8},{"$f":"VLOOKUP($C33,$B$4:$D$29,3,0)","v":"Pete"},"&",{"$f":"IF($B$4:$B$29=20,\"#N/A\",IF(COUNTIF($B$4:$B$29,$C33)=1,\"Alone\",LOOKUP(2,1/($B$4:$B$29=$C33),$D$4:$D$29)))","v":"Ron"},{"$f":"Teams!AE95","v":4.55},null,"5th",{"$f":"Teams!$AD98","v":6},{"$f":"VLOOKUP($J33,$B$4:$D$29,3,0)","v":"Rich B"},"&",{"$f":"IF($B$4:$B$29=20,\"#N/A\",IF(COUNTIF($B$4:$B$29,$J33)=1,\"Alone\",LOOKUP(2,1/($B$4:$B$29=$J33),$D$4:$D$29)))","v":"Scott"},{"$f":"Teams!AE98","v":2.27}]
[null,"3rd",{"$f":"Teams!$AD96","v":4},{"$f":"VLOOKUP($C34,$B$4:$D$29,3,0)","v":"Tom"},"&",{"$f":"IF($B$4:$B$29=20,\"#N/A\",IF(COUNTIF($B$4:$B$29,$C34)=1,\"Alone\",LOOKUP(2,1/($B$4:$B$29=$C34),$D$4:$D$29)))","v":"Alone"},{"$f":"Teams!AE96","v":3.99675},null,"6th",{"$f":"Teams!$AD99","v":2},{"$f":"VLOOKUP($J34,$B$4:$D$29,3,0)","v":"Armand"},"&",{"$f":"IF($B$4:$B$29=20,\"#N/A\",IF(COUNTIF($B$4:$B$29,$J34)=1,\"Alone\",LOOKUP(2,1/($B$4:$B$29=$J34),$D$4:$D$29)))","v":"Steve S"},{"$f":"Teams!AE99","v":1.95}]

{"sheet":"Teams","index":8,"n_rows":120,"n_cols":31,"rows_kept":120,"cut":false,"hidden":false,"merged":[[31,16,31,27],[1,16,1,27],[61,16,61,27],[91,16,91,27],[1,0,1,11],[31,0,31,11],[61,0,61,11],[91,0,91,11]]}
[]
[{"$f":"YTD!L15","v":"Bantam"},null,null,null,null,null,null,null,null,null,null,null,"Sort","Copy","Sort",null,{"$f":"YTD!L19","v":"Candlewood"},null,null,null,null,null,null,null,null,null,null,null,"Sort","Copy","Sort"]
["Team #","Alone?","Name","Net Wt",null,"Team #","Alone?","Name","Net Wt",null,"Totals","Rank","Rank","Team #","Tot Wt",null,"Team #","Alone?","Name","Net Wt",null,"Team #","Alone?","Name","Net Wt",null,"Totals","Rank","Rank","Team #","Tot Wt"]
[{"$f":"Bantam!B4","v":2},{"$f":"Bantam!C4","v":"N"},{"$f":"Bantam!D4","v":"Armand"},{"$f":"Bantam!N4","v":4.4400000000000004},null,0,"N","X",0,null,{"$f":"IF(F4=20,0,IF(F4=F5,I4+I5,IF(G4=\"Y\",I4+I$30,0)))","v":0},{"$f":"IF(K4>0,RANK(K4,K$4:K$29,0),\"\")","v":""},1,8,11.367000000000001,null,{"$f":"Candlewood!B4","v":0},{"$f":"Candlewood!C4","v":"N"},{"$f":"Candlewood!D4","v":"Armand"},{"$f":"Candlewood!N4","v":0},null,0,"N","Armand",0,null,{"$f":"IF(V4=20,0,IF(V4=V5,Y4+Y5,IF(W4=\"Y\",Y4+Y$30,0)))","v":0},{"$f":"IF(AA4>0,RANK(AA4,AA$4:AA$29,0),\"\")","v":""},1,8,13.969999999999999]
[{"$f":"Bantam!B5","v":1},{"$f":"Bantam!C5","v":"N"},{"$f":"Bantam!D5","v":"Bill"},{"$f":"Bantam!N5","v":7.77},null,0,"N","X",0,null,{"$f":"IF(F5=20,0,IF(F5=F6,I5+I6,IF(G5=\"Y\",I5+I$30,0)))","v":0},{"$f":"IF(K5>0,RANK(K5,K$4:K$29,0),\"\")","v":""},2,10,9.61,null,{"$f":"Candlewood!B5","v":6},{"$f":"Candlewood!C5","v":"N"},{"$f":"Candlewood!D5","v":"Bill"},{"$f":"Candlewood!N5","v":0},null,0,"N","Jim B",0,null,{"$f":"IF(V5=20,0,IF(V5=V6,Y5+Y6,IF(W5=\"Y\",Y5+Y$30,0)))","v":0},{"$f":"IF(AA5>0,RANK(AA5,AA$4:AA$29,0),\"\")","v":""},2,1,7.05]
[{"$f":"Bantam!B6","v":11},{"$f":"Bantam!C6","v":"N"},{"$f":"Bantam!D6","v":"Dean"},{"$f":"Bantam!N6","v":4.38},null,0,"N","X",0,null,0,"",3,3,9.52,null,{"$f":"Candlewood!B6","v":6},{"$f":"Candlewood!C6","v":"N"},{"$f":"Candlewood!D6","v":"Dean"},{"$f":"Candlewood!N6","v":2.67},null,0,"N","Mike G",0,null,0,"",3,4,6.07125]
[{"$f":"Bantam!B7","v":7},{"$f":"Bantam!C7","v":"N"},{"$f":"Bantam!D7","v":"Jack"},{"$f":"Bantam!N7","v":1.74},null,0,"N","X",0,null,0,"",4,9,9.2100000000000009,null,{"$f":"Candlewood!B7","v":9},{"$f":"Candlewood!C7","v":"N"},{"$f":"Candlewood!D7","v":"Jack"},{"$f":"Candlewood!N7","v":0},null,0,"N","Tom",0,null,0,"",4,2,4.91]
[{"$f":"Bantam!B8","v":10},{"$f":"Bantam!C8","v":"N"},{"$f":"Bantam!D8","v":"Jason"},{"$f":"Bantam!N8","v":9.61},null,0,"N","X",0,null,0,"",5,11,8.61,null,{"$f":"Candlewood!B8","v":3},{"$f":"Candlewood!C8","v":"N"},{"$f":"Candlewood!D8","v":"Jason"},{"$f":"Candlewood!N8","v":0},null,0,"N","X",0,null,0,"",5,5,4.5999999999999996]
[{"$f":"Bantam!B9","v":8},{"$f":"Bantam!C9","v":"Y"},{"$f":"Bantam!D9","v":"Jeff"},{"$f":"Bantam!N9","v":8.56},null,1,"N","Bill",7.77,null,7.77,7,6,6,8.4899999999999984,null,{"$f":"Candlewood!B9","v":9},{"$f":"Candlewood!C9","v":"N"},{"$f":"Candlewood!D9","v":"Jeff"},{"$f":"Candlewood!N9","v":4.13},null,0,"N","X",0,null,0,"",6,9,4.13]
[{"$f":"Bantam!B10","v":5},{"$f":"Bantam!C10","v":"N"},{"$f":"Bantam!D10","v":"Jim B"},{"$f":"Bantam!N10","v":3.08},null,1,"N","Ron",0,null,0,"",7,1,7.77,null,{"$f":"Candlewood!B10","v":0},{"$f":"Candlewood!C10","v":"N"},{"$f":"Candlewood!D10","v":"Jim B"},{"$f":"Candlewood!N10","v":0},null,0,"N","X",0,null,0,"",7,7,4.0299999999999994]
[{"$f":"Bantam!B11","v":4},{"$f":"Bantam!C11","v":"N"},{"$f":"Bantam!D11","v":"Joe"},{"$f":"Bantam!N11","v":0},null,2,"N","Armand",4.4400000000000004,null,4.4400000000000004,9,8,5,6.18,null,{"$f":"Candlewood!B11","v":7},{"$f":"Candlewood!C11","v":"N"},{"$f":"Candlewood!D11","v":"Joe"},{"$f":"Candlewood!N11","v":2.13},null,0,"N","X",0,null,0,"",8,6,2.67]
[{"$f":"Bantam!B12","v":2},{"$f":"Bantam!C12","v":"N"},{"$f":"Bantam!D12","v":"Kam"},{"$f":"Bantam!N12","v":0},null,2,"N","Kam",0,null,0,"",9,2,4.4400000000000004,null,{"$f":"Candlewood!B12","v":3},{"$f":"Candlewood!C12","v":"N"},{"$f":"Candlewood!D12","v":"Kam"},{"$f":"Candlewood!N12","v":2.42},null,0,"N","X",0,null,0,"",9,3,2.42]
[{"$f":"Bantam!B13","v":7},{"$f":"Bantam!C13","v":"N"},{"$f":"Bantam!D13","v":"Kevin"},{"$f":"Bantam!N13","v":0},null,3,"N","Mike G",1.28,null,9.52,3,10,4,4.24,null,{"$f":"Candlewood!B13","v":7},{"$f":"Candlewood!C13","v":"N"},{"$f":"Candlewood!D13","v":"Kevin"},{"$f":"Candlewood!N13","v":1.9},null,1,"N","Ron",2.41,null,7.05,2,"",0,0]
[{"$f":"Bantam!B14","v":10},{"$f":"Bantam!C14","v":"N"},{"$f":"Bantam!D14","v":"Mike M"},{"$f":"Bantam!N14","v":0},null,3,"N","Steve D",8.24,null,0,"",11,7,1.74,null,{"$f":"Candlewood!B14","v":5},{"$f":"Candlewood!C14","v":"N"},{"$f":"Candlewood!D14","v":"Mike M"},{"$f":"Candlewood!N14","v":1.72},null,1,"N","Steve S",4.6399999999999997,null,0,"","",0,0]
[{"$f":"Bantam!B15","v":3},{"$f":"Bantam!C15","v":"N"},{"$f":"Bantam!D15","v":"Mike G"},{"$f":"Bantam!N15","v":1.28},null,4,"N","Joe",0,null,4.24,10,"",0,0,null,{"$f":"Candlewood!B15","v":0},{"$f":"Candlewood!C15","v":"N"},{"$f":"Candlewood!D15","v":"Mike G"},{"$f":"Candlewood!N15","v":0},null,2,"N","Rich T",2.35,null,4.91,4,"",0,0]
[{"$f":"Bantam!B16","v":5},{"$f":"Bantam!C16","v":"N"},{"$f":"Bantam!D16","v":"Morrie"},{"$f":"Bantam!N16","v":3.1},null,4,"N","Scott",4.24,null,0,"","",0,0,null,{"$f":"Candlewood!B16","v":8},{"$f":"Candlewood!C16","v":"N"},{"$f":"Candlewood!D16","v":"Morrie"},{"$f":"Candlewood!N16","v":6.02},null,2,"N","Steve D",2.56,null,0,"","",0,0]
[{"$f":"Bantam!B17","v":11},{"$f":"Bantam!C17","v":"N"},{"$f":"Bantam!D17","v":"Pete"},{"$f":"Bantam!N17","v":4.2300000000000004},null,5,"N","Jim B",3.08,null,6.18,8,"",0,0,null,{"$f":"Candlewood!B17","v":8},{"$f":"Candlewood!C17","v":"N"},{"$f":"Candlewood!D17","v":"Pete"},{"$f":"Candlewood!N17","v":7.9499999999999993},null,3,"N","Jason",0,null,2.42,9,"",0,0]
[{"$f":"Bantam!B18","v":9},{"$f":"Bantam!C18","v":"N"},{"$f":"Bantam!D18","v":"Rich B"},{"$f":"Bantam!N18","v":3.55},null,5,"N","Morrie",3.1,null,0,"","",0,0,null,{"$f":"Candlewood!B18","v":5},{"$f":"Candlewood!C18","v":"N"},{"$f":"Candlewood!D18","v":"Rich B"},{"$f":"Candlewood!N18","v":2.88},null,3,"N","Kam",2.42,null,0,"","",0,0]
[{"$f":"Bantam!B19","v":9},{"$f":"Bantam!C19","v":"N"},{"$f":"Bantam!D19","v":"Rich T"},{"$f":"Bantam!N19","v":5.66},null,6,"N","Steve S",4.3099999999999996,null,8.4899999999999984,6,"",0,0,null,{"$f":"Candlewood!B19","v":2},{"$f":"Candlewood!C19","v":"N"},{"$f":"Candlewood!D19","v":"Rich T"},{"$f":"Candlewood!N19","v":2.35},null,4,"Y","Scott",3.42,null,6.07125,3,"",0,0]
[{"$f":"Bantam!B20","v":1},{"$f":"Bantam!C20","v":"N"},{"$f":"Bantam!D20","v":"Ron"},{"$f":"Bantam!N20","v":0},null,6,"N","Tom",4.18,null,0,"","",1,0,null,{"$f":"Candlewood!B20","v":1},{"$f":"Candlewood!C20","v":"N"},{"$f":"Candlewood!D20","v":"Ron"},{"$f":"Candlewood!N20","v":2.41},null,5,"N","Mike M",1.72,null,4.5999999999999996,5,"",0,0]
[{"$f":"Bantam!B21","v":4},{"$f":"Bantam!C21","v":"N"},{"$f":"Bantam!D21","v":"Scott"},{"$f":"Bantam!N21","v":4.24},null,7,"N","Jack",1.74,null,1.74,11,"",2,0,null,{"$f":"Candlewood!B21","v":4},{"$f":"Candlewood!C21","v":"Y"},{"$f":"Candlewood!D21","v":"Scott"},{"$f":"Candlewood!N21","v":3.42},null,5,"N","Rich B",2.88,null,0,"","",0,0]
[{"$f":"Bantam!B22","v":3},{"$f":"Bantam!C22","v":"N"},{"$f":"Bantam!D22","v":"Steve D"},{"$f":"Bantam!N22","v":8.24},null,7,"N","Kevin",0,null,0,"","",3,0,null,{"$f":"Candlewood!B22","v":2},{"$f":"Candlewood!C22","v":"N"},{"$f":"Candlewood!D22","v":"Steve D"},{"$f":"Candlewood!N22","v":2.56},null,6,"N","Bill",0,null,2.67,8,"",1,0]
[{"$f":"Bantam!B23","v":6},{"$f":"Bantam!C23","v":"N"},{"$f":"Bantam!D23","v":"Steve S"},{"$f":"Bantam!N23","v":4.3099999999999996},null,8,"Y","Jeff",8.56,null,11.367000000000001,1,"",4,0,null,{"$f":"Candlewood!B23","v":1},{"$f":"Candlewood!C23","v":"N"},{"$f":"Candlewood!D23","v":"Steve S"},{"$f":"Candlewood!N23","v":4.6399999999999997},null,6,"N","Dean",2.67,null,0,"","",2,0]
[{"$f":"Bantam!B24","v":6},{"$f":"Bantam!C24","v":"N"},{"$f":"Bantam!D24","v":"Tom"},{"$f":"Bantam!N24","v":4.18},null,9,"N","Rich B",3.55,null,9.2100000000000009,4,"",5,0,null,{"$f":"Candlewood!B24","v":0},{"$f":"Candlewood!C24","v":"N"},{"$f":"Candlewood!D24","v":"Tom"},{"$f":"Candlewood!N24","v":0},null,7,"N","Joe",2.13,null,4.0299999999999994,7,"",3,0]
[{"$f":"Bantam!B25","v":0},{"$f":"Bantam!C25","v":"N"},{"$f":"Bantam!D25","v":"X"},{"$f":"Bantam!N25","v":0},null,9,"N","Rich T",5.66,null,0,"","",6,0,null,{"$f":"Candlewood!B25","v":0},{"$f":"Candlewood!C25","v":"N"},{"$f":"Candlewood!D25","v":"X"},{"$f":"Candlewood!N25","v":0},null,7,"N","Kevin",1.9,null,0,"","",5,0]
[{"$f":"Bantam!B26","v":0},{"$f":"Bantam!C26","v":"N"},{"$f":"Bantam!D26","v":"X"},{"$f":"Bantam!N26","v":0},null,10,"N","Jason",9.61,null,9.61,2,"",7,0,null,{"$f":"Candlewood!B26","v":0},{"$f":"Candlewood!C26","v":"N"},{"$f":"Candlewood!D26","v":"X"},{"$f":"Candlewood!N26","v":0},null,8,"N","Morrie",6.02,null,13.969999999999999,1,"",6,0]
[{"$f":"Bantam!B27","v":0},{"$f":"Bantam!C27","v":"N"},{"$f":"Bantam!D27","v":"X"},{"$f":"Bantam!N27","v":0},null,10,"N","Mike",0,null,0,"","",9,0,null,{"$f":"Candlewood!B27","v":0},{"$f":"Candlewood!C27","v":"N"},{"$f":"Candlewood!D27","v":"X"},{"$f":"Candlewood!N27","v":0},null,8,"N","Pete",7.9499999999999993,null,0,"","",7,0]
[{"$f":"Bantam!B28","v":0},{"$f":"Bantam!C28","v":"N"},{"$f":"Bantam!D28","v":"X"},{"$f":"Bantam!N28","v":0},null,11,"N","Dean",4.38,null,8.61,5,"",10,0,null,{"$f":"Candlewood!B28","v":0},{"$f":"Candlewood!C28","v":"N"},{"$f":"Candlewood!D28","v":"X"},{"$f":"Candlewood!N28","v":0},null,9,"N","Jack",0,null,4.13,6,"",8,0]
[{"$f":"Bantam!B29","v":0},{"$f":"Bantam!C29","v":"N"},{"$f":"Bantam!D29","v":"X"},{"$f":"Bantam!N29","v":0},null,11,"N","Pete",4.2300000000000004,null,0,"","",11,0,null,{"$f":"Candlewood!B29","v":0},{"$f":"Candlewood!C29","v":"N"},{"$f":"Candlewood!D29","v":"X"},{"$f":"Candlewood!N29","v":0},null,9,"N","Jeff",4.13,null,0,"","",9,0]
[null,"Macro","CTL+M","Teams",1,null,null,"NB Avg",{"$f":"Bantam!Q31","v":2.8069999999999999},null,null,null,null,null,null,null,null,"Macro","CTL+Y","Teams",5,null,null,"NB Avg",{"$f":"Candlewood!Q31","v":2.6512500000000001}]
[]
[{"$f":"YTD!L16","v":"Mashapaug"},null,null,null,null,null,null,null,null,null,null,null,"Sort","Copy","Sort",null,{"$f":"YTD!L20","v":"Winchester"},null,null,null,null,null,null,null,null,null,null,null,"Sort","Copy","Sort"]
["Team #","Alone?","Name","Net Wt",null,"Team #","Alone?","Name","Net Wt",null,"Totals","Rank","Rank","Team #","Tot Wt",null,"Team #","Alone?","Name","Net Wt",null,"Team #","Alone?","Name","Net Wt",null,"Totals","Rank","Rank","Team #","Tot Wt"]
[{"$f":"Mashapaug!B4","v":3},{"$f":"Mashapaug!C4","v":"Y"},{"$f":"Mashapaug!D4","v":"Armand"},{"$f":"Mashapaug!N4","v":11.39},null,0,"N","Kam",0,null,{"$f":"IF(F34=20,0,IF(F34=F35,I34+I35,IF(G34=\"Y\",I34+I$60,0)))","v":0},{"$f":"IF(K34>0,RANK(K34,K$34:K$59,0),\"\")","v":""},1,6,18.899999999999999,null,{"$f":"Winchester!B4","v":8},{"$f":"Winchester!C4","v":"N"},{"$f":"Winchester!D4","v":"Armand"},{"$f":"Winchester!N4","v":1.59},null,0,"N","Jim B",0,null,{"$f":"IF(V34=20,0,IF(V34=V35,Y34+Y35,IF(W34=\"Y\",Y34+Y$60,0)))","v":0},{"$f":"IF(AA34>0,RANK(AA34,AA$34:AA$59,0),\"\")","v":""},1,1,10.9]
[{"$f":"Mashapaug!B5","v":8},{"$f":"Mashapaug!C5","v":"N"},{"$f":"Mashapaug!D5","v":"Bill"},{"$f":"Mashapaug!N5","v":5.38},null,0,"N","Morrie",0,null,{"$f":"IF(F35=20,0,IF(F35=F36,I35+I36,IF(G35=\"Y\",I35+I$60,0)))","v":0},{"$f":"IF(K35>0,RANK(K35,K$34:K$59,0),\"\")","v":""},2,7,17.77,null,{"$f":"Winchester!B5","v":3},{"$f":"Winchester!C5","v":"N"},{"$f":"Winchester!D5","v":"Bill"},{"$f":"Winchester!N5","v":1.58},null,0,"N","Kevin",0,null,{"$f":"IF(V35=20,0,IF(V35=V36,Y35+Y36,IF(W35=\"Y\",Y35+$Y$60,0)))","v":0},{"$f":"IF(AA35>0,RANK(AA35,AA$34:AA$59,0),\"\")","v":""},2,7,10.39]
[{"$f":"Mashapaug!B6","v":7},{"$f":"Mashapaug!C6","v":"N"},{"$f":"Mashapaug!D6","v":"Dean"},{"$f":"Mashapaug!N6","v":9.49},null,0,"N","X",0,null,0,"",3,3,17.113333333333333,null,{"$f":"Winchester!B6","v":10},{"$f":"Winchester!C6","v":"N"},{"$f":"Winchester!D6","v":"Dean"},{"$f":"Winchester!N6","v":4.8499999999999996},null,0,"N","X",0,null,0,"",3,6,8.629999999999999]
[{"$f":"Mashapaug!B7","v":10},{"$f":"Mashapaug!C7","v":"N"},{"$f":"Mashapaug!D7","v":"Jack"},{"$f":"Mashapaug!N7","v":5.29},null,0,"N","X",0,null,0,"",4,9,17.03,null,{"$f":"Winchester!B7","v":10},{"$f":"Winchester!C7","v":"N"},{"$f":"Winchester!D7","v":"Jack"},{"$f":"Winchester!N7","v":1.05},null,0,"N","X",0,null,0,"",4,8,7.35]
[{"$f":"Mashapaug!B8","v":8},{"$f":"Mashapaug!C8","v":"N"},{"$f":"Mashapaug!D8","v":"Jason"},{"$f":"Mashapaug!N8","v":11.17},null,0,"N","X",0,null,0,"",5,8,16.55,null,{"$f":"Winchester!B8","v":6},{"$f":"Winchester!C8","v":"N"},{"$f":"Winchester!D8","v":"Jason"},{"$f":"Winchester!N8","v":3.58},null,0,"N","X",0,null,0,"",5,10,5.8999999999999995]
[{"$f":"Mashapaug!B9","v":5},{"$f":"Mashapaug!C9","v":"N"},{"$f":"Mashapaug!D9","v":"Jeff"},{"$f":"Mashapaug!N9","v":9.19},null,0,"N","X",0,null,0,"",6,2,12.16,null,{"$f":"Winchester!B9","v":2},{"$f":"Winchester!C9","v":"N"},{"$f":"Winchester!D9","v":"Jeff"},{"$f":"Winchester!N9","v":4.6399999999999997},null,0,"N","X",0,null,0,"",6,2,4.6399999999999997]
[{"$f":"Mashapaug!B10","v":9},{"$f":"Mashapaug!C10","v":"N"},{"$f":"Mashapaug!D10","v":"Jim B"},{"$f":"Mashapaug!N10","v":7.55},null,0,"N","X",0,null,0,"",7,1,11.530000000000001,null,{"$f":"Winchester!B10","v":0},{"$f":"Winchester!C10","v":"N"},{"$f":"Winchester!D10","v":"Jim B"},{"$f":"Winchester!N10","v":0},null,0,"N","X",0,null,0,"",7,4,3.5133333333333336]
[{"$f":"Mashapaug!B11","v":1},{"$f":"Mashapaug!C11","v":"N"},{"$f":"Mashapaug!D11","v":"Joe"},{"$f":"Mashapaug!N11","v":3.7},null,1,"N","Joe",3.7,null,11.530000000000001,7,8,5,11.09,null,{"$f":"Winchester!B11","v":5},{"$f":"Winchester!C11","v":"N"},{"$f":"Winchester!D11","v":"Joe"},{"$f":"Winchester!N11","v":0},null,1,"N","Pete",5.03,null,10.9,1,8,3,2.77]
[{"$f":"Mashapaug!B12","v":0},{"$f":"Mashapaug!C12","v":"N"},{"$f":"Mashapaug!D12","v":"Kam"},{"$f":"Mashapaug!N12","v":0},null,1,"N","Tom",7.83,null,0,"",9,4,11.07,null,{"$f":"Winchester!B12","v":9},{"$f":"Winchester!C12","v":"N"},{"$f":"Winchester!D12","v":"Kam"},{"$f":"Winchester!N12","v":0},null,1,"N","Steve D",5.87,null,0,"",9,9,1.64]
[{"$f":"Mashapaug!B13","v":2},{"$f":"Mashapaug!C13","v":"N"},{"$f":"Mashapaug!D13","v":"Kevin"},{"$f":"Mashapaug!N13","v":7.11},null,2,"N","Kevin",7.11,null,12.16,6,10,10,8.23,null,{"$f":"Winchester!B13","v":0},{"$f":"Winchester!C13","v":"N"},{"$f":"Winchester!D13","v":"Kevin"},{"$f":"Winchester!N13","v":0},null,2,"N","Jeff",4.6399999999999997,null,4.6399999999999997,6,"",0,0]
[{"$f":"Mashapaug!B14","v":5},{"$f":"Mashapaug!C14","v":"N"},{"$f":"Mashapaug!D14","v":"Mike M"},{"$f":"Mashapaug!N14","v":1.9},null,2,"N","Mike G",5.05,null,0,"","",0,0,null,{"$f":"Winchester!B14","v":2},{"$f":"Winchester!C14","v":"N"},{"$f":"Winchester!D14","v":"Mike M"},{"$f":"Winchester!N14","v":0},null,2,"N","Mike M",0,null,0,"","",0,0]
[{"$f":"Mashapaug!B15","v":2},{"$f":"Mashapaug!C15","v":"N"},{"$f":"Mashapaug!D15","v":"Mike G"},{"$f":"Mashapaug!N15","v":5.05},null,3,"Y","Armand",11.39,null,17.113333333333333,3,"",0,0,null,{"$f":"Winchester!B15","v":8},{"$f":"Winchester!C15","v":"N"},{"$f":"Winchester!D15","v":"Mike G"},{"$f":"Winchester!N15","v":5.76},null,3,"N","Bill",1.58,null,2.77,8,"",0,0]
[{"$f":"Mashapaug!B16","v":0},{"$f":"Mashapaug!C16","v":"N"},{"$f":"Mashapaug!D16","v":"Morrie"},{"$f":"Mashapaug!N16","v":0},null,4,"N","Rich T",6.04,null,11.07,9,"",0,0,null,{"$f":"Winchester!B16","v":9},{"$f":"Winchester!C16","v":"N"},{"$f":"Winchester!D16","v":"Morrie"},{"$f":"Winchester!N16","v":1.64},null,3,"N","Rich B",1.19,null,0,"","",0,0]
[{"$f":"Mashapaug!B17","v":6},{"$f":"Mashapaug!C17","v":"N"},{"$f":"Mashapaug!D17","v":"Pete"},{"$f":"Mashapaug!N17","v":8.32},null,4,"N","Scott",5.03,null,0,"","",0,0,null,{"$f":"Winchester!B17","v":1},{"$f":"Winchester!C17","v":"N"},{"$f":"Winchester!D17","v":"Pete"},{"$f":"Winchester!N17","v":5.03},null,4,"Y","Tom",0.74,null,3.5133333333333336,7,"",0,0]
[{"$f":"Mashapaug!B18","v":6},{"$f":"Mashapaug!C18","v":"N"},{"$f":"Mashapaug!D18","v":"Rich B"},{"$f":"Mashapaug!N18","v":10.58},null,5,"N","Jeff",9.19,null,11.09,8,"",0,0,null,{"$f":"Winchester!B18","v":3},{"$f":"Winchester!C18","v":"N"},{"$f":"Winchester!D18","v":"Rich B"},{"$f":"Winchester!N18","v":1.19},null,5,"N","Joe",0,null,0,"","",0,0]
[{"$f":"Mashapaug!B19","v":4},{"$f":"Mashapaug!C19","v":"N"},{"$f":"Mashapaug!D19","v":"Rich T"},{"$f":"Mashapaug!N19","v":6.04},null,5,"N","Mike M",1.9,null,0,"","",0,0,null,{"$f":"Winchester!B19","v":7},{"$f":"Winchester!C19","v":"N"},{"$f":"Winchester!D19","v":"Rich T"},{"$f":"Winchester!N19","v":3.8999999999999995},null,5,"N","Ron",0,null,0,"","",0,0]
[{"$f":"Mashapaug!B20","v":10},{"$f":"Mashapaug!C20","v":"N"},{"$f":"Mashapaug!D20","v":"Ron"},{"$f":"Mashapaug!N20","v":2.94},null,6,"N","Pete",8.32,null,18.899999999999999,1,"",0,0,null,{"$f":"Winchester!B20","v":5},{"$f":"Winchester!C20","v":"N"},{"$f":"Winchester!D20","v":"Ron"},{"$f":"Winchester!N20","v":0},null,6,"N","Jason",3.58,null,8.629999999999999,3,"",1,0]
[{"$f":"Mashapaug!B21","v":4},{"$f":"Mashapaug!C21","v":"N"},{"$f":"Mashapaug!D21","v":"Scott"},{"$f":"Mashapaug!N21","v":5.03},null,6,"N","Rich B",10.58,null,0,"","",1,0,null,{"$f":"Winchester!B21","v":7},{"$f":"Winchester!C21","v":"N"},{"$f":"Winchester!D21","v":"Scott"},{"$f":"Winchester!N21","v":6.49},null,6,"N","Steve S",5.05,null,0,"","",2,0]
[{"$f":"Mashapaug!B22","v":9},{"$f":"Mashapaug!C22","v":"N"},{"$f":"Mashapaug!D22","v":"Steve D"},{"$f":"Mashapaug!N22","v":9.48},null,7,"N","Dean",9.49,null,17.77,2,"",2,0,null,{"$f":"Winchester!B22","v":1},{"$f":"Winchester!C22","v":"N"},{"$f":"Winchester!D22","v":"Steve D"},{"$f":"Winchester!N22","v":5.87},null,7,"N","Rich T",3.8999999999999995,null,10.39,2,"",3,0]
[{"$f":"Mashapaug!B23","v":7},{"$f":"Mashapaug!C23","v":"N"},{"$f":"Mashapaug!D23","v":"Steve S"},{"$f":"Mashapaug!N23","v":8.2799999999999994},null,7,"N","Steve S",8.2799999999999994,null,0,"","",4,0,null,{"$f":"Winchester!B23","v":6},{"$f":"Winchester!C23","v":"N"},{"$f":"Winchester!D23","v":"Steve S"},{"$f":"Winchester!N23","v":5.05},null,7,"N","Scott",6.49,null,0,"","",5,0]
[{"$f":"Mashapaug!B24","v":1},{"$f":"Mashapaug!C24","v":"N"},{"$f":"Mashapaug!D24","v":"Tom"},{"$f":"Mashapaug!N24","v":7.83},null,8,"N","Bill",5.38,null,16.55,5,"",5,0,null,{"$f":"Winchester!B24","v":4},{"$f":"Winchester!C24","v":"Y"},{"$f":"Winchester!D24","v":"Tom"},{"$f":"Winchester!N24","v":0.74},null,8,"N","Armand",1.59,null,7.35,4,"",5,0]
[{"$f":"Mashapaug!B25","v":0},{"$f":"Mashapaug!C25","v":"N"},{"$f":"Mashapaug!D25","v":"X"},{"$f":"Mashapaug!N25","v":0},null,8,"N","Jason",11.17,null,0,"","",6,0,null,{"$f":"Winchester!B25","v":0},{"$f":"Winchester!C25","v":"N"},{"$f":"Winchester!D25","v":"X"},{"$f":"Winchester!N25","v":0},null,8,"N","Mike G",5.76,null,0,"","",6,0]
[{"$f":"Mashapaug!B26","v":0},{"$f":"Mashapaug!C26","v":"N"},{"$f":"Mashapaug!D26","v":"X"},{"$f":"Mashapaug!N26","v":0},null,9,"N","Jim B",7.55,null,17.03,4,"",7,0,null,{"$f":"Winchester!B26","v":0},{"$f":"Winchester!C26","v":"N"},{"$f":"Winchester!D26","v":"X"},{"$f":"Winchester!N26","v":0},null,9,"N","Kam",0,null,1.64,9,"",7,0]
[{"$f":"Mashapaug!B27","v":0},{"$f":"Mashapaug!C27","v":"N"},{"$f":"Mashapaug!D27","v":"X"},{"$f":"Mashapaug!N27","v":0},null,9,"N","Steve D",9.48,null,0,"","",8,0,null,{"$f":"Winchester!B27","v":0},{"$f":"Winchester!C27","v":"N"},{"$f":"Winchester!D27","v":"X"},{"$f":"Winchester!N27","v":0},null,9,"N","Morrie",1.64,null,0,"","",8,0]
[{"$f":"Mashapaug!B28","v":0},{"$f":"Mashapaug!C28","v":"N"},{"$f":"Mashapaug!D28","v":"X"},{"$f":"Mashapaug!N28","v":0},null,10,"N","Jack",5.29,null,8.23,10,"",9,0,null,{"$f":"Winchester!B28","v":0},{"$f":"Winchester!C28","v":"N"},{"$f":"Winchester!D28","v":"X"},{"$f":"Winchester!N28","v":0},null,10,"N","Dean",4.8499999999999996,null,5.8999999999999995,5,"",9,0]
[{"$f":"Mashapaug!B29","v":0},{"$f":"Mashapaug!C29","v":"N"},{"$f":"Mashapaug!D29","v":"X"},{"$f":"Mashapaug!N29","v":0},null,10,"N","Ron",2.94,null,0,"","",10,0,null,{"$f":"Winchester!B29","v":0},{"$f":"Winchester!C29","v":"N"},{"$f":"Winchester!D29","v":"X"},{"$f":"Winchester!N29","v":0},null,10,"N","Jack",1.05,null,0,"","",10,0]
[null,"Macro","CTL+D","Teams",2,null,null,"NB Avg",{"$f":"Mashapaug!Q31","v":5.7233333333333327},null,null,null,null,null,null,null,null,"Macro","CTL+T","Teams",6,null,null,"NB Avg",{"$f":"Winchester!Q31","v":2.7733333333333339}]
[]
[{"$f":"YTD!L17","v":"Coventry"},null,null,null,null,null,null,null,null,null,null,null,"Sort","Copy","Sort",null,{"$f":"YTD!L21","v":"Mansfield"},null,null,null,null,null,null,null,null,null,null,null,"Sort","Copy","Sort"]
["Team #","Alone?","Name","Net Wt",null,"Team #","Alone?","Name","Net Wt",null,"Totals","Rank","Rank","Team #","Tot Wt",null,"Team #","Alone?","Name","Net Wt",null,"Team #","Alone?","Name","Net Wt",null,"Totals","Rank","Rank","Team #","Tot Wt"]
[{"$f":"Coventry!B4","v":5},{"$f":"Coventry!C4","v":"Y"},{"$f":"Coventry!D4","v":"Armand"},{"$f":"Coventry!N4","v":2.29},null,0,"N","Jim B",0,null,{"$f":"IF(F64=20,0,IF(F64=F65,I64+I65,IF(G64=\"Y\",I64+I$90,0)))","v":0},{"$f":"IF(K64>0,RANK(K64,K$64:K$89,0),\"\")","v":""},1,10,15.91,null,{"$f":"Mansfield!B4","v":9},{"$f":"Mansfield!C4","v":"N"},{"$f":"Mansfield!D4","v":"Armand"},{"$f":"Mansfield!N4","v":1.93},null,0,"N","X",0,null,{"$f":"IF(V64=20,0,IF(V64=V65,Y64+Y65,IF(W64=\"Y\",Y64+Y$90,0)))","v":0},{"$f":"IF(AA64>0,RANK(AA64,AA$64:AA$89,0),\"\")","v":""},1,5,15.08]
[{"$f":"Coventry!B5","v":3},{"$f":"Coventry!C5","v":"N"},{"$f":"Coventry!D5","v":"Bill"},{"$f":"Coventry!N5","v":1.25},null,0,"N","Kam",0,null,{"$f":"IF(F65=20,0,IF(F65=F66,I65+I66,IF(G65=\"Y\",I65+I$90,0)))","v":0},{"$f":"IF(K65>0,RANK(K65,K$64:K$89,0),\"\")","v":""},2,9,8.620000000000001,null,{"$f":"Mansfield!B5","v":3},{"$f":"Mansfield!C5","v":"N"},{"$f":"Mansfield!D5","v":"Bill"},{"$f":"Mansfield!N5","v":3.81},null,0,"N","X",0,null,{"$f":"IF(V65=20,0,IF(V65=V66,Y65+Y66,IF(W65=\"Y\",Y65+Y$90,0)))","v":0},{"$f":"IF(AA65>0,RANK(AA65,AA$64:AA$89,0),\"\")","v":""},2,3,9.98]
[{"$f":"Coventry!B6","v":6},{"$f":"Coventry!C6","v":"Y"},{"$f":"Coventry!D6","v":"Dean"},{"$f":"Coventry!N6","v":0.89},null,0,"N","Mike M",0,null,0,"",3,1,6.3949999999999996,null,{"$f":"Mansfield!B6","v":2},{"$f":"Mansfield!C6","v":"N"},{"$f":"Mansfield!D6","v":"Dean"},{"$f":"Mansfield!N6","v":5.49},null,0,"N","X",0,null,0,"",3,6,9.1499999999999986]
[{"$f":"Coventry!B7","v":9},{"$f":"Coventry!C7","v":"N"},{"$f":"Coventry!D7","v":"Jack"},{"$f":"Coventry!N7","v":3.55},null,0,"N","Mike G",0,null,0,"",4,8,6.16,null,{"$f":"Mansfield!B7","v":11},{"$f":"Mansfield!C7","v":"N"},{"$f":"Mansfield!D7","v":"Jack"},{"$f":"Mansfield!N7","v":0},null,0,"N","X",0,null,0,"",4,11,7.36]
[{"$f":"Coventry!B8","v":9},{"$f":"Coventry!C8","v":"N"},{"$f":"Coventry!D8","v":"Jason"},{"$f":"Coventry!N8","v":5.07},null,0,"N","Ron",0,null,0,"",5,2,5.1550000000000002,null,{"$f":"Mansfield!B8","v":4},{"$f":"Mansfield!C8","v":"N"},{"$f":"Mansfield!D8","v":"Jason"},{"$f":"Mansfield!N8","v":5.57},null,0,"N","X",0,null,0,"",5,1,6.59]
[{"$f":"Coventry!B9","v":3},{"$f":"Coventry!C9","v":"N"},{"$f":"Coventry!D9","v":"Jeff"},{"$f":"Coventry!N9","v":3.07},null,0,"N","X",0,null,0,"",6,3,4.32,null,{"$f":"Mansfield!B9","v":8},{"$f":"Mansfield!C9","v":"N"},{"$f":"Mansfield!D9","v":"Jeff"},{"$f":"Mansfield!N9","v":5.53},null,1,"N","Kevin",2.0099999999999998,null,6.59,5,6,4,5.57]
[{"$f":"Coventry!B10","v":0},{"$f":"Coventry!C10","v":"N"},{"$f":"Coventry!D10","v":"Jim B"},{"$f":"Coventry!N10","v":0},null,0,"N","X",0,null,0,"",7,5,3.9649999999999999,null,{"$f":"Mansfield!B10","v":9},{"$f":"Mansfield!C10","v":"N"},{"$f":"Mansfield!D10","v":"Jim B"},{"$f":"Mansfield!N10","v":2.21},null,1,"N","Pete",4.58,null,0,"",7,8,5.53]
[{"$f":"Coventry!B11","v":8},{"$f":"Coventry!C11","v":"N"},{"$f":"Coventry!D11","v":"Joe"},{"$f":"Coventry!N11","v":0.8},null,0,"N","X",0,null,0,"",8,6,2.5649999999999999,null,{"$f":"Mansfield!B11","v":4},{"$f":"Mansfield!C11","v":"N"},{"$f":"Mansfield!D11","v":"Joe"},{"$f":"Mansfield!N11","v":0},null,2,"N","Dean",5.49,null,5.49,8,8,2,5.49]
[{"$f":"Coventry!B12","v":0},{"$f":"Coventry!C12","v":"N"},{"$f":"Coventry!D12","v":"Kam"},{"$f":"Coventry!N12","v":0},null,0,"N","X",0,null,0,"",9,4,1.78,null,{"$f":"Mansfield!B12","v":7},{"$f":"Mansfield!C12","v":"N"},{"$f":"Mansfield!D12","v":"Kam"},{"$f":"Mansfield!N12","v":0},null,2,"N","Mike G",0,null,0,"",9,9,4.1399999999999997]
[{"$f":"Coventry!B13","v":1},{"$f":"Coventry!C13","v":"Y"},{"$f":"Coventry!D13","v":"Kevin"},{"$f":"Coventry!N13","v":4.72},null,0,"N","X",0,null,0,"","",0,0,null,{"$f":"Mansfield!B13","v":1},{"$f":"Mansfield!C13","v":"N"},{"$f":"Mansfield!D13","v":"Kevin"},{"$f":"Mansfield!N13","v":2.0099999999999998},null,3,"N","Bill",3.81,null,9.98,2,10,7,2.48]
[{"$f":"Coventry!B14","v":0},{"$f":"Coventry!C14","v":"N"},{"$f":"Coventry!D14","v":"Mike M"},{"$f":"Coventry!N14","v":0},null,1,"Y","Kevin",4.72,null,6.3949999999999996,3,"",0,0,null,{"$f":"Mansfield!B14","v":5},{"$f":"Mansfield!C14","v":"N"},{"$f":"Mansfield!D14","v":"Mike M"},{"$f":"Mansfield!N14","v":8.98},null,3,"N","Rich T",6.17,null,0,"",11,10,2.2130000000000001]
[{"$f":"Coventry!B15","v":0},{"$f":"Coventry!C15","v":"N"},{"$f":"Coventry!D15","v":"Mike G"},{"$f":"Coventry!N15","v":0},null,2,"Y","Rich B",3.48,null,5.1550000000000002,5,"",0,0,null,{"$f":"Mansfield!B15","v":2},{"$f":"Mansfield!C15","v":"N"},{"$f":"Mansfield!D15","v":"Mike G"},{"$f":"Mansfield!N15","v":0},null,4,"N","Jason",5.57,null,5.57,6,"",0,0]
[{"$f":"Coventry!B16","v":8},{"$f":"Coventry!C16","v":"N"},{"$f":"Coventry!D16","v":"Morrie"},{"$f":"Coventry!N16","v":5.36},null,3,"N","Bill",1.25,null,4.32,6,"",0,0,null,{"$f":"Mansfield!B16","v":10},{"$f":"Mansfield!C16","v":"Y"},{"$f":"Mansfield!D16","v":"Morrie"},{"$f":"Mansfield!N16","v":0},null,4,"N","Joe",0,null,0,"","",0,0]
[{"$f":"Coventry!B17","v":7},{"$f":"Coventry!C17","v":"N"},{"$f":"Coventry!D17","v":"Pete"},{"$f":"Coventry!N17","v":0},null,3,"N","Jeff",3.07,null,0,"","",0,0,null,{"$f":"Mansfield!B17","v":1},{"$f":"Mansfield!C17","v":"N"},{"$f":"Mansfield!D17","v":"Pete"},{"$f":"Mansfield!N17","v":4.58},null,5,"N","Mike M",8.98,null,15.08,1,"",0,0]
[{"$f":"Coventry!B18","v":2},{"$f":"Coventry!C18","v":"Y"},{"$f":"Coventry!D18","v":"Rich B"},{"$f":"Coventry!N18","v":3.48},null,4,"N","Rich T",1.78,null,1.78,9,"",0,0,null,{"$f":"Mansfield!B18","v":11},{"$f":"Mansfield!C18","v":"N"},{"$f":"Mansfield!D18","v":"Rich B"},{"$f":"Mansfield!N18","v":7.36},null,5,"N","Tom",6.1,null,0,"","",0,0]
[{"$f":"Coventry!B19","v":4},{"$f":"Coventry!C19","v":"N"},{"$f":"Coventry!D19","v":"Rich T"},{"$f":"Coventry!N19","v":1.78},null,4,"N","Tom",0,null,0,"","",0,0,null,{"$f":"Mansfield!B19","v":3},{"$f":"Mansfield!C19","v":"N"},{"$f":"Mansfield!D19","v":"Rich T"},{"$f":"Mansfield!N19","v":6.17},null,6,"N","Ron",6.6,null,9.1499999999999986,3,"",0,0]
[{"$f":"Coventry!B20","v":0},{"$f":"Coventry!C20","v":"N"},{"$f":"Coventry!D20","v":"Ron"},{"$f":"Coventry!N20","v":0},null,5,"Y","Armand",2.29,null,3.9649999999999999,7,"",0,0,null,{"$f":"Mansfield!B20","v":6},{"$f":"Mansfield!C20","v":"N"},{"$f":"Mansfield!D20","v":"Ron"},{"$f":"Mansfield!N20","v":6.6},null,6,"N","Scott",2.5499999999999998,null,0,"","",1,0]
[{"$f":"Coventry!B21","v":7},{"$f":"Coventry!C21","v":"N"},{"$f":"Coventry!D21","v":"Scott"},{"$f":"Coventry!N21","v":0},null,6,"Y","Dean",0.89,null,2.5649999999999999,8,"",0,0,null,{"$f":"Mansfield!B21","v":6},{"$f":"Mansfield!C21","v":"N"},{"$f":"Mansfield!D21","v":"Scott"},{"$f":"Mansfield!N21","v":2.5499999999999998},null,7,"N","Kam",0,null,2.48,10,"",2,0]
[{"$f":"Coventry!B22","v":10},{"$f":"Coventry!C22","v":"N"},{"$f":"Coventry!D22","v":"Steve D"},{"$f":"Coventry!N22","v":13.24},null,7,"N","Pete",0,null,0,"","",0,0,null,{"$f":"Mansfield!B22","v":7},{"$f":"Mansfield!C22","v":"N"},{"$f":"Mansfield!D22","v":"Steve D"},{"$f":"Mansfield!N22","v":2.48},null,7,"N","Steve D",2.48,null,0,"","",3,0]
[{"$f":"Coventry!B23","v":10},{"$f":"Coventry!C23","v":"N"},{"$f":"Coventry!D23","v":"Steve S"},{"$f":"Coventry!N23","v":2.67},null,7,"N","Scott",0,null,0,"","",3,0,null,{"$f":"Mansfield!B23","v":8},{"$f":"Mansfield!C23","v":"N"},{"$f":"Mansfield!D23","v":"Steve S"},{"$f":"Mansfield!N23","v":0},null,8,"N","Jeff",5.53,null,5.53,7,"",4,0]
[{"$f":"Coventry!B24","v":4},{"$f":"Coventry!C24","v":"N"},{"$f":"Coventry!D24","v":"Tom"},{"$f":"Coventry!N24","v":0},null,8,"N","Joe",0.8,null,6.16,4,"",4,0,null,{"$f":"Mansfield!B24","v":5},{"$f":"Mansfield!C24","v":"N"},{"$f":"Mansfield!D24","v":"Tom"},{"$f":"Mansfield!N24","v":6.1},null,8,"N","Steve S",0,null,0,"","",5,0]
[{"$f":"Coventry!B25","v":0},{"$f":"Coventry!C25","v":"N"},{"$f":"Coventry!D25","v":"X"},{"$f":"Coventry!N25","v":0},null,8,"N","Morrie",5.36,null,0,"","",7,0,null,{"$f":"Mansfield!B25","v":0},{"$f":"Mansfield!C25","v":"N"},{"$f":"Mansfield!D25","v":"X"},{"$f":"Mansfield!N25","v":0},null,9,"N","Armand",1.93,null,4.1399999999999997,9,"",6,0]
[{"$f":"Coventry!B26","v":0},{"$f":"Coventry!C26","v":"N"},{"$f":"Coventry!D26","v":"X"},{"$f":"Coventry!N26","v":0},null,9,"N","Jack",3.55,null,8.620000000000001,2,"",7,0,null,{"$f":"Mansfield!B26","v":0},{"$f":"Mansfield!C26","v":"N"},{"$f":"Mansfield!D26","v":"X"},{"$f":"Mansfield!N26","v":0},null,9,"N","Jim B",2.21,null,0,"","",7,0]
[{"$f":"Coventry!B27","v":0},{"$f":"Coventry!C27","v":"N"},{"$f":"Coventry!D27","v":"X"},{"$f":"Coventry!N27","v":0},null,9,"N","Jason",5.07,null,0,"","",8,0,null,{"$f":"Mansfield!B27","v":0},{"$f":"Mansfield!C27","v":"N"},{"$f":"Mansfield!D27","v":"X"},{"$f":"Mansfield!N27","v":0},null,10,"Y","Morrie",0,null,2.2130000000000001,11,"",8,0]
[{"$f":"Coventry!B28","v":0},{"$f":"Coventry!C28","v":"N"},{"$f":"Coventry!D28","v":"X"},{"$f":"Coventry!N28","v":0},null,10,"N","Steve D",13.24,null,15.91,1,"",9,0,null,{"$f":"Mansfield!B28","v":0},{"$f":"Mansfield!C28","v":"N"},{"$f":"Mansfield!D28","v":"X"},{"$f":"Mansfield!N28","v":0},null,11,"N","Jack",0,null,7.36,4,"",9,0]
[{"$f":"Coventry!B29","v":0},{"$f":"Coventry!C29","v":"N"},{"$f":"Coventry!D29","v":"X"},{"$f":"Coventry!N29","v":0},null,10,"N","Steve S",2.67,null,0,"","",10,0,null,{"$f":"Mansfield!B29","v":0},{"$f":"Mansfield!C29","v":"N"},{"$f":"Mansfield!D29","v":"X"},{"$f":"Mansfield!N29","v":0},null,11,"N","Rich B",7.36,null,0,"","",11,0]
[null,"Macro","CTL+H","Teams",3,null,null,"NB Avg",{"$f":"Coventry!Q31","v":1.675},null,null,null,null,null,null,null,null,"Macro","CTL+E","Teams",7,null,null,"NB Avg",{"$f":"Mansfield!Q31","v":2.2130000000000001}]
[]
[{"$f":"YTD!L18","v":"Beach"},null,null,null,null,null,null,null,null,null,null,null,"Sort","Copy","Sort",null,{"$f":"YTD!L22","v":"Aspinook"},null,null,null,null,null,null,null,null,null,null,null,"Sort","Copy","Sort"]
["Team #","Alone?","Name","Net Wt",null,"Team #","Alone?","Name","Net Wt",null,"Totals","Rank","Rank","Team #","Tot Wt",null,"Team #","Alone?","Name","Net Wt",null,"Team #","Alone?","Name","Net Wt",null,"Totals","Rank","Rank","Team #","Tot Wt"]
[{"$f":"Beach!B4","v":2},{"$f":"Beach!C4","v":"N"},{"$f":"Beach!D4","v":"Armand"},{"$f":"Beach!N4","v":0.67},null,0,"N","Jim B",0,null,{"$f":"IF(F94=20,0,IF(F94=F95,I94+I95,IF(G94=\"Y\",I94+I$120,0)))","v":0},{"$f":"IF(K94>0,RANK(K94,K$94:K$119,0),\"\")","v":""},1,7,10.34,null,{"$f":"Aspinook!B4","v":2},{"$f":"Aspinook!C4","v":"N"},{"$f":"Aspinook!D4","v":"Armand"},{"$f":"Aspinook!N4","v":1.95},null,0,"N","Bill",0,null,{"$f":"IF(V94=20,0,IF(V94=V95,Y94+Y95,IF(W94=\"Y\",Y94+Y$120,0)))","v":0},{"$f":"IF(AA94>0,RANK(AA94,AA$94:AA$119,0),\"\")","v":""},1,1,21.9]
[{"$f":"Beach!B5","v":2},{"$f":"Beach!C5","v":"N"},{"$f":"Beach!D5","v":"Bill"},{"$f":"Beach!N5","v":4.9799999999999995},null,0,"N","Ron",0,null,{"$f":"IF(F95=20,0,IF(F95=F96,I95+I96,IF(G95=\"Y\",I95+I$120,0)))","v":0},{"$f":"IF(K95>0,RANK(K95,K$94:K$119,0),\"\")","v":""},2,5,7.9099999999999993,null,{"$f":"Aspinook!B5","v":0},{"$f":"Aspinook!C5","v":"N"},{"$f":"Aspinook!D5","v":"Bill"},{"$f":"Aspinook!N5","v":0},null,0,"N","Jack",0,null,{"$f":"IF(V95=20,0,IF(V95=V96,Y95+Y96,IF(W95=\"Y\",Y95+Y$120,0)))","v":0},{"$f":"IF(AA95>0,RANK(AA95,AA$94:AA$119,0),\"\")","v":""},2,8,4.55]
[{"$f":"Beach!B6","v":3},{"$f":"Beach!C6","v":"N"},{"$f":"Beach!D6","v":"Dean"},{"$f":"Beach!N6","v":1.33},null,0,"N","X",0,null,0,"",3,3,7.2,null,{"$f":"Aspinook!B6","v":5},{"$f":"Aspinook!C6","v":"N"},{"$f":"Aspinook!D6","v":"Dean"},{"$f":"Aspinook!N6","v":0},null,0,"N","Mike G",0,null,0,"",3,4,3.99675]
[{"$f":"Beach!B7","v":7},{"$f":"Beach!C7","v":"N"},{"$f":"Beach!D7","v":"Jack"},{"$f":"Beach!N7","v":1.03},null,0,"N","X",0,null,0,"",4,8,6.4799999999999995,null,{"$f":"Aspinook!B7","v":0},{"$f":"Aspinook!C7","v":"N"},{"$f":"Aspinook!D7","v":"Jack"},{"$f":"Aspinook!N7","v":0},null,0,"N","X",0,null,0,"",4,3,2.65]
[{"$f":"Beach!B8","v":9},{"$f":"Beach!C8","v":"N"},{"$f":"Beach!D8","v":"Jason"},{"$f":"Beach!N8","v":1.21},null,0,"N","X",0,null,0,"",5,9,5.99,null,{"$f":"Aspinook!B8","v":9},{"$f":"Aspinook!C8","v":"N"},{"$f":"Aspinook!D8","v":"Jason"},{"$f":"Aspinook!N8","v":1.94},null,0,"N","X",0,null,0,"",5,6,2.27]
[{"$f":"Beach!B9","v":7},{"$f":"Beach!C9","v":"N"},{"$f":"Beach!D9","v":"Jeff"},{"$f":"Beach!N9","v":9.31},null,0,"N","X",0,null,0,"",6,6,5.76,null,{"$f":"Aspinook!B9","v":3},{"$f":"Aspinook!C9","v":"N"},{"$f":"Aspinook!D9","v":"Jeff"},{"$f":"Aspinook!N9","v":2.65},null,0,"N","X",0,null,0,"",6,2,1.95]
[{"$f":"Beach!B10","v":0},{"$f":"Beach!C10","v":"N"},{"$f":"Beach!D10","v":"Jim B"},{"$f":"Beach!N10","v":0},null,0,"N","X",0,null,0,"",7,2,5.6499999999999995,null,{"$f":"Aspinook!B10","v":5},{"$f":"Aspinook!C10","v":"N"},{"$f":"Aspinook!D10","v":"Jim B"},{"$f":"Aspinook!N10","v":0},null,0,"N","X",0,null,0,"",7,9,1.94]
[{"$f":"Beach!B11","v":6},{"$f":"Beach!C11","v":"N"},{"$f":"Beach!D11","v":"Joe"},{"$f":"Beach!N11","v":0.73},null,1,"Y","Rich B",1.96,null,4.5611111111111109,9,8,10,5.54,null,{"$f":"Aspinook!B11","v":3},{"$f":"Aspinook!C11","v":"N"},{"$f":"Aspinook!D11","v":"Joe"},{"$f":"Aspinook!N11","v":0},null,0,"N","X",0,null,0,"",8,10,1.26675]
[{"$f":"Beach!B12","v":5},{"$f":"Beach!C12","v":"N"},{"$f":"Beach!D12","v":"Kam"},{"$f":"Beach!N12","v":1.93},null,2,"N","Armand",0.67,null,5.6499999999999995,7,9,1,4.5611111111111109,null,{"$f":"Aspinook!B12","v":1},{"$f":"Aspinook!C12","v":"N"},{"$f":"Aspinook!D12","v":"Kam"},{"$f":"Aspinook!N12","v":6.95},null,1,"N","Kam",6.95,null,21.9,1,9,7,0.91400000000000003]
[{"$f":"Beach!B13","v":4},{"$f":"Beach!C13","v":"N"},{"$f":"Beach!D13","v":"Kevin"},{"$f":"Beach!N13","v":2.5},null,2,"N","Bill",4.9799999999999995,null,0,"",10,4,2.5,null,{"$f":"Aspinook!B13","v":1},{"$f":"Aspinook!C13","v":"N"},{"$f":"Aspinook!D13","v":"Kevin"},{"$f":"Aspinook!N13","v":14.95},null,1,"N","Kevin",14.95,null,0,"","",0,0]
[{"$f":"Beach!B14","v":3},{"$f":"Beach!C14","v":"N"},{"$f":"Beach!D14","v":"Mike M"},{"$f":"Beach!N14","v":5.87},null,3,"N","Dean",1.33,null,7.2,3,"",0,0,null,{"$f":"Aspinook!B14","v":7},{"$f":"Aspinook!C14","v":"N"},{"$f":"Aspinook!D14","v":"Mike M"},{"$f":"Aspinook!N14","v":0.91400000000000003},null,2,"N","Armand",1.95,null,1.95,6,"",0,0]
[{"$f":"Beach!B15","v":9},{"$f":"Beach!C15","v":"N"},{"$f":"Beach!D15","v":"Mike G"},{"$f":"Beach!N15","v":4.78},null,3,"N","Mike M",5.87,null,0,"","",0,0,null,{"$f":"Aspinook!B15","v":0},{"$f":"Aspinook!C15","v":"N"},{"$f":"Aspinook!D15","v":"Mike G"},{"$f":"Aspinook!N15","v":0},null,2,"N","Steve S",0,null,0,"","",0,0]
[{"$f":"Beach!B16","v":10},{"$f":"Beach!C16","v":"N"},{"$f":"Beach!D16","v":"Morrie"},{"$f":"Beach!N16","v":3.5},null,4,"N","Kevin",2.5,null,2.5,10,"",0,0,null,{"$f":"Aspinook!B16","v":7},{"$f":"Aspinook!C16","v":"N"},{"$f":"Aspinook!D16","v":"Morrie"},{"$f":"Aspinook!N16","v":0},null,3,"N","Jeff",2.65,null,2.65,4,"",0,0]
[{"$f":"Beach!B17","v":8},{"$f":"Beach!C17","v":"N"},{"$f":"Beach!D17","v":"Pete"},{"$f":"Beach!N17","v":2.0499999999999998},null,4,"N","Steve S",0,null,0,"","",0,0,null,{"$f":"Aspinook!B17","v":8},{"$f":"Aspinook!C17","v":"N"},{"$f":"Aspinook!D17","v":"Pete"},{"$f":"Aspinook!N17","v":0},null,3,"N","Joe",0,null,0,"","",0,0]
[{"$f":"Beach!B18","v":1},{"$f":"Beach!C18","v":"Y"},{"$f":"Beach!D18","v":"Rich B"},{"$f":"Beach!N18","v":1.96},null,5,"N","Kam",1.93,null,7.9099999999999993,2,"",0,0,null,{"$f":"Aspinook!B18","v":6},{"$f":"Aspinook!C18","v":"N"},{"$f":"Aspinook!D18","v":"Rich B"},{"$f":"Aspinook!N18","v":0},null,4,"Y","Tom",2.73,null,3.99675,3,"",0,0]
[{"$f":"Beach!B19","v":10},{"$f":"Beach!C19","v":"N"},{"$f":"Beach!D19","v":"Rich T"},{"$f":"Beach!N19","v":2.04},null,5,"N","Scott",5.9799999999999995,null,0,"","",0,0,null,{"$f":"Aspinook!B19","v":9},{"$f":"Aspinook!C19","v":"N"},{"$f":"Aspinook!D19","v":"Rich T"},{"$f":"Aspinook!N19","v":0},null,5,"N","Dean",0,null,0,"","",0,0]
[{"$f":"Beach!B20","v":0},{"$f":"Beach!C20","v":"N"},{"$f":"Beach!D20","v":"Ron"},{"$f":"Beach!N20","v":0},null,6,"N","Joe",0.73,null,5.76,6,"",0,0,null,{"$f":"Aspinook!B20","v":8},{"$f":"Aspinook!C20","v":"N"},{"$f":"Aspinook!D20","v":"Ron"},{"$f":"Aspinook!N20","v":4.55},null,5,"N","Jim B",0,null,0,"","",0,0]
[{"$f":"Beach!B21","v":5},{"$f":"Beach!C21","v":"N"},{"$f":"Beach!D21","v":"Scott"},{"$f":"Beach!N21","v":5.9799999999999995},null,6,"N","Steve D",5.03,null,0,"","",2,0,null,{"$f":"Aspinook!B21","v":6},{"$f":"Aspinook!C21","v":"N"},{"$f":"Aspinook!D21","v":"Scott"},{"$f":"Aspinook!N21","v":2.27},null,6,"N","Rich B",0,null,2.27,5,"",1,0]
[{"$f":"Beach!B22","v":6},{"$f":"Beach!C22","v":"N"},{"$f":"Beach!D22","v":"Steve D"},{"$f":"Beach!N22","v":5.03},null,7,"N","Jack",1.03,null,10.34,1,"",3,0,null,{"$f":"Aspinook!B22","v":10},{"$f":"Aspinook!C22","v":"Y"},{"$f":"Aspinook!D22","v":"Steve D"},{"$f":"Aspinook!N22","v":0},null,6,"N","Scott",2.27,null,0,"","",2,0]
[{"$f":"Beach!B23","v":4},{"$f":"Beach!C23","v":"N"},{"$f":"Beach!D23","v":"Steve S"},{"$f":"Beach!N23","v":0},null,7,"N","Jeff",9.31,null,0,"","",4,0,null,{"$f":"Aspinook!B23","v":2},{"$f":"Aspinook!C23","v":"N"},{"$f":"Aspinook!D23","v":"Steve S"},{"$f":"Aspinook!N23","v":0},null,7,"N","Mike M",0.91400000000000003,null,0.91400000000000003,9,"",3,0]
[{"$f":"Beach!B24","v":8},{"$f":"Beach!C24","v":"N"},{"$f":"Beach!D24","v":"Tom"},{"$f":"Beach!N24","v":4.43},null,8,"N","Pete",2.0499999999999998,null,6.4799999999999995,4,"",5,0,null,{"$f":"Aspinook!B24","v":4},{"$f":"Aspinook!C24","v":"Y"},{"$f":"Aspinook!D24","v":"Tom"},{"$f":"Aspinook!N24","v":2.73},null,7,"N","Morrie",0,null,0,"","",5,0]
[{"$f":"Beach!B25","v":0},{"$f":"Beach!C25","v":"N"},{"$f":"Beach!D25","v":"X"},{"$f":"Beach!N25","v":0},null,8,"N","Tom",4.43,null,0,"","",6,0,null,{"$f":"Aspinook!B25","v":0},{"$f":"Aspinook!C25","v":"N"},{"$f":"Aspinook!D25","v":"X"},{"$f":"Aspinook!N25","v":0},null,8,"N","Pete",0,null,4.55,2,"",5,0]
[{"$f":"Beach!B26","v":0},{"$f":"Beach!C26","v":"N"},{"$f":"Beach!D26","v":"X"},{"$f":"Beach!N26","v":0},null,9,"N","Jason",1.21,null,5.99,5,"",7,0,null,{"$f":"Aspinook!B26","v":0},{"$f":"Aspinook!C26","v":"N"},{"$f":"Aspinook!D26","v":"X"},{"$f":"Aspinook!N26","v":0},null,8,"N","Ron",4.55,null,0,"","",6,0]
[{"$f":"Beach!B27","v":0},{"$f":"Beach!C27","v":"N"},{"$f":"Beach!D27","v":"X"},{"$f":"Beach!N27","v":0},null,9,"N","Mike G",4.78,null,0,"","",8,0,null,{"$f":"Aspinook!B27","v":0},{"$f":"Aspinook!C27","v":"N"},{"$f":"Aspinook!D27","v":"X"},{"$f":"Aspinook!N27","v":0},null,9,"N","Jason",1.94,null,1.94,7,"",7,0]
[{"$f":"Beach!B28","v":0},{"$f":"Beach!C28","v":"N"},{"$f":"Beach!D28","v":"X"},{"$f":"Beach!N28","v":0},null,10,"N","Morrie",3.5,null,5.54,8,"",9,0,null,{"$f":"Aspinook!B28","v":0},{"$f":"Aspinook!C28","v":"N"},{"$f":"Aspinook!D28","v":"X"},{"$f":"Aspinook!N28","v":0},null,9,"N","Rich T",0,null,0,"","",8,0]
[{"$f":"Beach!B29","v":0},{"$f":"Beach!C29","v":"N"},{"$f":"Beach!D29","v":"X"},{"$f":"Beach!N29","v":0},null,10,"N","Rich T",2.04,null,0,"","",10,0,null,{"$f":"Aspinook!B29","v":0},{"$f":"Aspinook!C29","v":"N"},{"$f":"Aspinook!D29","v":"X"},{"$f":"Aspinook!N29","v":0},null,10,"Y","Steve D",0,null,1.26675,8,"",9,0]
[null,"Macro","CTL+N","Teams",4,null,null,"NB Avg",{"$f":"Beach!Q31","v":2.6011111111111109},null,null,null,null,null,null,null,null,"Macro","CTL+Q","Teams",8,null,null,"NB Avg",{"$f":"Aspinook!Q31","v":1.26675}]

{"sheet":"YTD","index":9,"n_rows":103,"n_cols":34,"rows_kept":103,"cut":false,"hidden":false,"merged":[[74,15,74,17],[74,18,74,20],[74,21,74,23],[15,11,15,12],[16,11,16,12],[17,11,17,12],[73,0,73,23],[74,0,74,2],[74,3,74,5],[74,6,74,8],[12,22,12,28],[43,0,43,16],[44,18,44,19],[44,0,44,1],[44,6,44,7],[14,11,14,12],[44,2,44,3],[44,4,44,5],[20,11,20,12],[44,10,44,11],[74,9,74,11],[74,12,74,14],[13,8,13,9],[14,32,14,33],[14,20,14,21],[14,22,14,23],[14,26,14,27],[14,28,14,29],[14,18,14,19],[19,11,19,12],[13,18,13,33],[14,30,14,31],[14,24,14,25],[44,12,44,13],[44,14,44,15],[44,8,44,9],[18,11,18,12],[21,11,21,12],[13,11,13,12]]}
[null,{"$f":"P15","v":"Armand"},{"$f":"P16","v":"Bill"},{"$f":"P17","v":"Dean"},{"$f":"P18","v":"Jack"},{"$f":"P19","v":"Jason"},{"$f":"P20","v":"Jeff"},{"$f":"P21","v":"Jim B"},{"$f":"P22","v":"Joe"},{"$f":"P23","v":"Kam"},{"$f":"P24","v":"Kevin"},{"$f":"P25","v":"Mike M"},{"$f":"P26","v":"Mike G"},{"$f":"P27","v":"Morrie"},{"$f":"P28","v":"Pete"},{"$f":"P29","v":"Rich B"},{"$f":"P30","v":"Rich T"},{"$f":"P31","v":"Ron"},{"$f":"P32","v":"Scott"},{"$f":"P33","v":"Steve D"},{"$f":"P34","v":"Steve S"},{"$f":"P35","v":"Tom"},{"$f":"P36","v":"X"},{"$f":"P37","v":"X"},{"$f":"P38","v":"X"},{"$f":"P39","v":"X"},{"$f":"P40","v":"X"}]
[null,{"$f":"Mashapaug!O4","v":1},{"$f":"Bantam!O5","v":4},{"$f":"Mashapaug!O6","v":4},{"$f":"Coventry!O7","v":5},{"$f":"Bantam!O8","v":1},{"$f":"Beach!O9","v":1},{"$f":"Mashapaug!O10","v":10},{"$f":"Candlewood!O11","v":12},{"$f":"Aspinook!O12","v":2},{"$f":"Aspinook!O13","v":1},{"$f":"Mansfield!O14","v":1},{"$f":"Winchester!O15","v":3},{"$f":"Coventry!O16","v":2},{"$f":"Candlewood!O17","v":1},{"$f":"Mansfield!O18","v":2},{"$f":"Mansfield!O19","v":4},{"$f":"Mansfield!O20","v":3},{"$f":"Winchester!O21","v":1},{"$f":"Coventry!O22","v":1},{"$f":"Candlewood!O23","v":3},{"$f":"Aspinook!O24","v":4},{"$f":"Mashapaug!O25","v":35},{"$f":"Winchester!O26","v":35},{"$f":"Beach!O27","v":35},{"$f":"Candlewood!O28","v":35},{"$f":"Aspinook!O29","v":35}]
[null,{"$f":"Bantam!O4","v":6},{"$f":"Beach!O5","v":5},{"$f":"Winchester!O6","v":6},{"$f":"Mashapaug!O7","v":14},{"$f":"Mashapaug!O8","v":2},{"$f":"Bantam!O9","v":2},{"$f":"Mansfield!O10","v":13},{"$f":"Coventry!O11","v":13},{"$f":"Candlewood!O12","v":9},{"$f":"Coventry!O13","v":4},{"$f":"Beach!O14","v":3},{"$f":"Beach!O15","v":6},{"$f":"Candlewood!O16","v":2},{"$f":"Winchester!O17","v":5},{"$f":"Mashapaug!O18","v":3},{"$f":"Bantam!O19","v":5},{"$f":"Aspinook!O20","v":3},{"$f":"Beach!O21","v":2},{"$f":"Winchester!O22","v":2},{"$f":"Winchester!O23","v":4},{"$f":"Mansfield!O24","v":5},{"$f":"Coventry!O25","v":35},{"$f":"Mansfield!O26","v":35},{"$f":"Winchester!O27","v":35},{"$f":"Coventry!O28","v":35},{"$f":"Bantam!O29","v":35}]
[null,{"$f":"Aspinook!O4","v":7},{"$f":"Mansfield!O5","v":10},{"$f":"Bantam!O6","v":7},{"$f":"Winchester!O7","v":14},{"$f":"Coventry!O8","v":3},{"$f":"Candlewood!O9","v":4},{"$f":"Bantam!O10","v":14},{"$f":"Mashapaug!O11","v":17},{"$f":"Beach!O12","v":13},{"$f":"Beach!O13","v":9},{"$f":"Aspinook!O14","v":9},{"$f":"Mashapaug!O15","v":15},{"$f":"Beach!O16","v":8},{"$f":"Mashapaug!O17","v":7},{"$f":"Coventry!O18","v":6},{"$f":"Winchester!O19","v":8},{"$f":"Candlewood!O20","v":10},{"$f":"Candlewood!O21","v":5},{"$f":"Bantam!O22","v":3},{"$f":"Bantam!O23","v":8},{"$f":"Beach!O24","v":7},{"$f":"Beach!O25","v":35},{"$f":"Coventry!O26","v":35},{"$f":"Mashapaug!O27","v":35},{"$f":"Aspinook!O28","v":35},{"$f":"Candlewood!O29","v":35}]
[null,{"$f":"Coventry!O4","v":9},{"$f":"Coventry!O5","v":11},{"$f":"Candlewood!O6","v":7},{"$f":"Bantam!O7","v":15},{"$f":"Mansfield!O8","v":6},{"$f":"Aspinook!O9","v":5},{"$f":"Aspinook!O10","v":30},{"$f":"Beach!O11","v":17},{"$f":"Bantam!O12","v":30},{"$f":"Mashapaug!O13","v":11},{"$f":"Candlewood!O14","v":14},{"$f":"Bantam!O15","v":16},{"$f":"Winchester!O16","v":10},{"$f":"Mansfield!O17","v":9},{"$f":"Candlewood!O18","v":6},{"$f":"Coventry!O19","v":10},{"$f":"Mashapaug!O20","v":18},{"$f":"Aspinook!O21","v":6},{"$f":"Beach!O22","v":4},{"$f":"Mashapaug!O23","v":8},{"$f":"Mashapaug!O24","v":9},{"$f":"Bantam!O25","v":35},{"$f":"Mashapaug!O26","v":35},{"$f":"Aspinook!O27","v":35},{"$f":"Bantam!O28","v":35},{"$f":"Beach!O29","v":35}]
[null,{"$f":"Winchester!O4","v":11},{"$f":"Winchester!O5","v":12},{"$f":"Mansfield!O6","v":8},{"$f":"Beach!O7","v":16},{"$f":"Aspinook!O8","v":8},{"$f":"Mashapaug!O9","v":6},{"$f":"Candlewood!O10","v":35},{"$f":"Bantam!O11","v":30},{"$f":"Winchester!O12","v":30},{"$f":"Candlewood!O13","v":13},{"$f":"Mashapaug!O14","v":19},{"$f":"Mansfield!O15","v":30},{"$f":"Bantam!O16","v":13},{"$f":"Bantam!O17","v":10},{"$f":"Bantam!O18","v":12},{"$f":"Beach!O19","v":11},{"$f":"Bantam!O20","v":30},{"$f":"Bantam!O21","v":9},{"$f":"Mashapaug!O22","v":5},{"$f":"Coventry!O23","v":8},{"$f":"Bantam!O24","v":11},{"$f":"Winchester!O25","v":35},{"$f":"Bantam!O26","v":35},{"$f":"Candlewood!O27","v":35},{"$f":"Beach!O28","v":35},{"$f":"Mashapaug!O29","v":35}]
[null,{"$f":"Mansfield!O4","v":15},{"$f":"Mashapaug!O5","v":13},{"$f":"Coventry!O6","v":12},{"$f":"Candlewood!O7","v":30},{"$f":"Winchester!O8","v":9},{"$f":"Coventry!O9","v":7},{"$f":"Beach!O10","v":35},{"$f":"Winchester!O11","v":30},{"$f":"Mansfield!O12","v":30},{"$f":"Mansfield!O13","v":14},{"$f":"Bantam!O14","v":30},{"$f":"Candlewood!O15","v":35},{"$f":"Mansfield!O16","v":30},{"$f":"Beach!O17","v":10},{"$f":"Beach!O18","v":12},{"$f":"Candlewood!O19","v":11},{"$f":"Winchester!O20","v":30},{"$f":"Mansfield!O21","v":11},{"$f":"Candlewood!O22","v":8},{"$f":"Beach!O23","v":30},{"$f":"Winchester!O24","v":15},{"$f":"Mansfield!O25","v":35},{"$f":"Aspinook!O26","v":35},{"$f":"Bantam!O27","v":35},{"$f":"Mashapaug!O28","v":35},{"$f":"Coventry!O29","v":35}]
[null,{"$f":"Beach!O4","v":18},{"$f":"Candlewood!O5","v":30},{"$f":"Beach!O6","v":14},{"$f":"Mansfield!O7","v":30},{"$f":"Beach!O8","v":15},{"$f":"Winchester!O9","v":7},{"$f":"Winchester!O10","v":35},{"$f":"Mansfield!O11","v":30},{"$f":"Mashapaug!O12","v":35},{"$f":"Bantam!O13","v":30},{"$f":"Winchester!O14","v":30},{"$f":"Coventry!O15","v":35},{"$f":"Aspinook!O16","v":30},{"$f":"Coventry!O17","v":30},{"$f":"Winchester!O18","v":13},{"$f":"Mashapaug!O19","v":12},{"$f":"Beach!O20","v":35},{"$f":"Mashapaug!O21","v":16},{"$f":"Mansfield!O22","v":12},{"$f":"Mansfield!O23","v":30},{"$f":"Coventry!O24","v":30},{"$f":"Candlewood!O25","v":35},{"$f":"Candlewood!O26","v":35},{"$f":"Mansfield!O27","v":35},{"$f":"Winchester!O28","v":35},{"$f":"Winchester!O29","v":35}]
[null,{"$f":"Candlewood!O4","v":35},{"$f":"Aspinook!O5","v":35},{"$f":"Aspinook!O6","v":30},{"$f":"Aspinook!O7","v":35},{"$f":"Candlewood!O8","v":30},{"$f":"Mansfield!O9","v":7},{"$f":"Coventry!O10","v":35},{"$f":"Aspinook!O11","v":30},{"$f":"Coventry!O12","v":35},{"$f":"Winchester!O13","v":35},{"$f":"Coventry!O14","v":35},{"$f":"Aspinook!O15","v":35},{"$f":"Mashapaug!O16","v":35},{"$f":"Aspinook!O17","v":30},{"$f":"Aspinook!O18","v":30},{"$f":"Aspinook!O19","v":30},{"$f":"Coventry!O20","v":35},{"$f":"Coventry!O21","v":30},{"$f":"Aspinook!O22","v":30},{"$f":"Aspinook!O23","v":30},{"$f":"Candlewood!O24","v":35},{"$f":"Aspinook!O25","v":35},{"$f":"Beach!O26","v":35},{"$f":"Coventry!O27","v":35},{"$f":"Mansfield!O28","v":35},{"$f":"Mansfield!O29","v":35}]
["Pts. YTD",{"$f":"SUM(B2:B7)","v":49},55,44,94,29,25,137,{"$f":"SUM(I2:I7)","v":119},114,52,76,105,65,42,41,49,{"$f":"SUM(R2:R7)","v":94},34,23,61,51,210,210,210,210,210]
["Position",{"$f":"RANK(B10,Pts._YTD,1)","v":8},12,7,16,3,2,21,20,{"$f":"RANK(J10,Pts._YTD,1)","v":19},11,{"$f":"RANK(L10,Pts._YTD,1)","v":15},18,14,6,5,8,16,{"$f":"RANK(S10,Pts._YTD,1)","v":4},1,13,10,22,22,22,22,22]
[]
[null,null,null,null,null,null,null,null,null,null,null,null,null,null,null,null,null,null,null,null,null,null,"Use macro ctl-f"]
["Name","Position","Pts. YTD",null,"Name","Position","Pts. YTD",null,"Total Weight",null,null,"Lake / River 2016",null,null,null,"Members",null,null,"Top 3 Finishers for Each Tournament"]
[{"$f":"B1","v":"Armand"},{"$f":"B11","v":8},{"$f":"B10","v":49},null,"Steve D",1,23,null,{"$f":"P15","v":"Armand"},{"$f":"Aspinook!N4+Bantam!N4+Winchester!N4+Coventry!N4+Mansfield!N4+Mashapaug!N4+Beach!N4+Candlewood!N4","v":24.26},null,"Bantam",null,null,null,"Armand",null,null,{"$f":"L15","v":"Bantam"},null,{"$f":"L16","v":"Mashapaug"},null,{"$f":"L17","v":"Coventry"},null,{"$f":"L18","v":"Beach"},null,{"$f":"L19","v":"Candlewood"},null,{"$f":"L20","v":"Winchester"},null,{"$f":"L21","v":"Mansfield"},null,{"$f":"L22","v":"Aspinook"}]
[{"$f":"C1","v":"Bill"},{"$f":"C11","v":12},{"$f":"C10","v":55},null,"Jeff",2,25,null,"Bill",{"$f":"Aspinook!N5+Bantam!N5+Winchester!N5+Coventry!N5+Mansfield!N5+Mashapaug!N5+Beach!N5+Candlewood!N5","v":24.77},null,"Mashapaug",null,null,null,"Bill",null,null,{"$f":"Bantam!D8","v":"Jason"},{"$f":"Bantam!O8","v":1},{"$f":"Mashapaug!D4","v":"Armand"},{"$f":"Mashapaug!O4","v":1},{"$f":"Coventry!D22","v":"Steve D"},{"$f":"Coventry!O22","v":1},{"$f":"Beach!D9","v":"Jeff"},{"$f":"Beach!O9","v":1},{"$f":"Candlewood!D17","v":"Pete"},{"$f":"Candlewood!O17","v":1},{"$f":"Winchester!D21","v":"Scott"},{"$f":"Winchester!O21","v":1},{"$f":"Mansfield!D14","v":"Mike M"},{"$f":"Mansfield!O14","v":1},{"$f":"Aspinook!D13","v":"Kevin"},{"$f":"Aspinook!O13","v":1}]
[{"$f":"D1","v":"Dean"},{"$f":"D11","v":7},{"$f":"D10","v":44},null,"Jason",3,29,null,"Dean",{"$f":"Aspinook!N6+Bantam!N6+Winchester!N6+Coventry!N6+Mansfield!N6+Mashapaug!N6+Beach!N6+Candlewood!N6","v":29.1},null,"Coventry",null,null,null,"Dean",null,null,{"$f":"Bantam!D9","v":"Jeff"},{"$f":"Bantam!O9","v":2},{"$f":"Mashapaug!D8","v":"Jason"},{"$f":"Mashapaug!O8","v":2},{"$f":"Coventry!D16","v":"Morrie"},{"$f":"Coventry!O16","v":2},{"$f":"Beach!D21","v":"Scott"},{"$f":"Beach!O21","v":2},{"$f":"Candlewood!D16","v":"Morrie"},{"$f":"Candlewood!O16","v":2},{"$f":"Winchester!D22","v":"Steve D"},{"$f":"Winchester!O22","v":2},{"$f":"Mansfield!D18","v":"Rich B"},{"$f":"Mansfield!O18","v":2},{"$f":"Aspinook!D12","v":"Kam"},{"$f":"Aspinook!O12","v":2}]
[{"$f":"E1","v":"Jack"},{"$f":"E11","v":16},{"$f":"E10","v":94},null,"Scott",4,34,null,"Jack",{"$f":"Aspinook!N7+Bantam!N7+Winchester!N7+Coventry!N7+Mansfield!N7+Mashapaug!N7+Beach!N7+Candlewood!N7","v":12.659999999999998},null,"Beach",null,null,null,"Jack",null,null,{"$f":"Bantam!D22","v":"Steve D"},{"$f":"Bantam!O22","v":3},{"$f":"Mashapaug!D18","v":"Rich B"},{"$f":"Mashapaug!O18","v":3},{"$f":"Coventry!D8","v":"Jason"},{"$f":"Coventry!O8","v":3},{"$f":"Beach!D14","v":"Mike M"},{"$f":"Beach!O14","v":3},{"$f":"Candlewood!D23","v":"Steve S"},{"$f":"Candlewood!O23","v":3},{"$f":"Winchester!D15","v":"Mike G"},{"$f":"Winchester!O15","v":3},{"$f":"Mansfield!D20","v":"Ron"},{"$f":"Mansfield!O20","v":3},{"$f":"Aspinook!D20","v":"Ron"},{"$f":"Aspinook!O20","v":3}]
[{"$f":"F1","v":"Jason"},{"$f":"F11","v":3},{"$f":"F10","v":29},null,"Rich B",5,41,null,"Jason",{"$f":"Aspinook!N8+Bantam!N8+Winchester!N8+Coventry!N8+Mansfield!N8+Mashapaug!N8+Beach!N8+Candlewood!N8","v":38.15},null,"Candlewood",null,null,null,"Jason",null,null,{"$f":"Bantam!D5","v":"Bill"},{"$f":"Bantam!O5","v":4},{"$f":"Mashapaug!D6","v":"Dean"},{"$f":"Mashapaug!O6","v":4},{"$f":"Coventry!D13","v":"Kevin"},{"$f":"Coventry!O13","v":4},{"$f":"Beach!D22","v":"Steve D"},{"$f":"Beach!O22","v":4},{"$f":"Candlewood!D9","v":"Jeff"},{"$f":"Candlewood!O9","v":4},{"$f":"Winchester!D23","v":"Steve S"},{"$f":"Winchester!O23","v":4},{"$f":"Mansfield!D19","v":"Rich T"},{"$f":"Mansfield!O19","v":4},{"$f":"Aspinook!D24","v":"Tom"},{"$f":"Aspinook!O24","v":4}]
[{"$f":"G1","v":"Jeff"},{"$f":"G11","v":2},{"$f":"G10","v":25},null,"Pete",6,42,null,"Jeff",{"$f":"Aspinook!N9+Bantam!N9+Winchester!N9+Coventry!N9+Mansfield!N9+Mashapaug!N9+Beach!N9+Candlewood!N9","v":47.080000000000005},null,"Winchester",null,null,null,"Jeff",null,null,{"$f":"Bantam!D19","v":"Rich T"},{"$f":"Bantam!O19","v":5},{"$f":"Mashapaug!D22","v":"Steve D"},{"$f":"Mashapaug!O22","v":5},{"$f":"Coventry!D7","v":"Jack"},{"$f":"Coventry!O7","v":5},{"$f":"Beach!D5","v":"Bill"},{"$f":"Beach!O5","v":5},{"$f":"Candlewood!D21","v":"Scott"},{"$f":"Candlewood!O21","v":5},{"$f":"Winchester!D17","v":"Pete"},{"$f":"Winchester!O17","v":5},{"$f":"Mansfield!D24","v":"Tom"},{"$f":"Mansfield!O24","v":5},{"$f":"Aspinook!D9","v":"Jeff"},{"$f":"Aspinook!O9","v":5}]
[{"$f":"H1","v":"Jim B"},{"$f":"H11","v":21},{"$f":"H10","v":137},null,"Dean",7,44,null,"Jim B",{"$f":"Aspinook!N10+Bantam!N10+Winchester!N10+Coventry!N10+Mansfield!N10+Mashapaug!N10+Beach!N10+Candlewood!N10","v":12.84},null,"Mansfield",null,null,null,"Jim B",null,null,{"$f":"Bantam!D4","v":"Armand"},{"$f":"Bantam!O4","v":6},{"$f":"Mashapaug!D9","v":"Jeff"},{"$f":"Mashapaug!O9","v":6},{"$f":"Coventry!D18","v":"Rich B"},{"$f":"Coventry!O18","v":6},{"$f":"Beach!D15","v":"Mike G"},{"$f":"Beach!O15","v":6},{"$f":"Candlewood!D18","v":"Rich B"},{"$f":"Candlewood!O18","v":6},{"$f":"Winchester!D6","v":"Dean"},{"$f":"Winchester!O6","v":6},{"$f":"Mansfield!D8","v":"Jason"},{"$f":"Mansfield!O8","v":6},{"$f":"Aspinook!D21","v":"Scott"},{"$f":"Aspinook!O21","v":6}]
[{"$f":"I1","v":"Joe"},{"$f":"I11","v":20},{"$f":"I10","v":119},null,"Armand",8,49,null,"Joe",{"$f":"Aspinook!N11+Bantam!N11+Winchester!N11+Coventry!N11+Mansfield!N11+Mashapaug!N11+Beach!N11+Candlewood!N11","v":7.36},null,"Aspinook",null,null,null,"Joe",null,null,{"$f":"Bantam!D6","v":"Dean"},{"$f":"Bantam!O6","v":7},{"$f":"Mashapaug!D17","v":"Pete"},{"$f":"Mashapaug!O17","v":7},{"$f":"Coventry!D9","v":"Jeff"},{"$f":"Coventry!O9","v":7},{"$f":"Beach!D24","v":"Tom"},{"$f":"Beach!O24","v":7},{"$f":"Candlewood!D6","v":"Dean"},{"$f":"Candlewood!O6","v":7},{"$f":"Winchester!D9","v":"Jeff"},{"$f":"Winchester!O9","v":7},{"$f":"Mansfield!D9","v":"Jeff"},{"$f":"Mansfield!O9","v":7},{"$f":"Aspinook!D4","v":"Armand"},{"$f":"Aspinook!O4","v":7}]
[{"$f":"J1","v":"Kam"},{"$f":"J11","v":19},{"$f":"J10","v":114},null,"Rich T",8,49,null,"Kam",{"$f":"Aspinook!N12+Bantam!N12+Winchester!N12+Coventry!N12+Mansfield!N12+Mashapaug!N12+Beach!N12+Candlewood!N12","v":11.3},null,null,null,null,null,"Kam",null,null,{"$f":"Bantam!D23","v":"Steve S"},{"$f":"Bantam!O23","v":8},{"$f":"Mashapaug!D23","v":"Steve S"},{"$f":"Mashapaug!O23","v":8},{"$f":"Coventry!D23","v":"Steve S"},{"$f":"Coventry!O23","v":8},{"$f":"Beach!D16","v":"Morrie"},{"$f":"Beach!O16","v":8},{"$f":"Candlewood!D22","v":"Steve D"},{"$f":"Candlewood!O22","v":8},{"$f":"Winchester!D19","v":"Rich T"},{"$f":"Winchester!O19","v":8},{"$f":"Mansfield!D6","v":"Dean"},{"$f":"Mansfield!O6","v":8},{"$f":"Aspinook!D8","v":"Jason"},{"$f":"Aspinook!O8","v":8}]
[{"$f":"K1","v":"Kevin"},{"$f":"K11","v":11},{"$f":"K10","v":52},null,"Tom",10,51,null,"Kevin",{"$f":"Aspinook!N13+Bantam!N13+Winchester!N13+Coventry!N13+Mansfield!N13+Mashapaug!N13+Beach!N13+Candlewood!N13","v":33.19},null,null,null,null,null,"Kevin",null,null,{"$f":"Bantam!D21","v":"Scott"},{"$f":"Bantam!O21","v":9},{"$f":"Mashapaug!D24","v":"Tom"},{"$f":"Mashapaug!O24","v":9},{"$f":"Coventry!D4","v":"Armand"},{"$f":"Coventry!O4","v":9},{"$f":"Beach!D13","v":"Kevin"},{"$f":"Beach!O13","v":9},{"$f":"Candlewood!D12","v":"Kam"},{"$f":"Candlewood!O12","v":9},{"$f":"Winchester!D8","v":"Jason"},{"$f":"Winchester!O8","v":9},{"$f":"Mansfield!D17","v":"Pete"},{"$f":"Mansfield!O17","v":9},{"$f":"Aspinook!D14","v":"Mike M"},{"$f":"Aspinook!O14","v":9}]
[{"$f":"L1","v":"Mike M"},{"$f":"L11","v":15},{"$f":"L10","v":76},null,"Kevin",11,52,null,"Mike M",{"$f":"Aspinook!N14+Bantam!N14+Winchester!N14+Coventry!N14+Mansfield!N14+Mashapaug!N14+Beach!N14+Candlewood!N14","v":19.384},null,null,null,null,null,"Mike M",null,null,{"$f":"Bantam!D17","v":"Pete"},{"$f":"Bantam!O17","v":10},{"$f":"Mashapaug!D10","v":"Jim B"},{"$f":"Mashapaug!O10","v":10},{"$f":"Coventry!D19","v":"Rich T"},{"$f":"Coventry!O19","v":10},{"$f":"Beach!D17","v":"Pete"},{"$f":"Beach!O17","v":10},{"$f":"Candlewood!D20","v":"Ron"},{"$f":"Candlewood!O20","v":10},{"$f":"Winchester!D16","v":"Morrie"},{"$f":"Winchester!O16","v":10},{"$f":"Mansfield!D5","v":"Bill"},{"$f":"Mansfield!O5","v":10},{"$f":"Aspinook!D23","v":"Steve S"},{"$f":"Aspinook!O23","v":30}]
[{"$f":"M1","v":"Mike G"},{"$f":"M11","v":18},{"$f":"M10","v":105},null,"Bill",12,55,null,"Mike G",{"$f":"Aspinook!N15+Bantam!N15+Winchester!N15+Coventry!N15+Mansfield!N15+Mashapaug!N15+Beach!N15+Candlewood!N15","v":16.87},null,"Macros",null,null,null,"Mike G",null,null,{"$f":"Bantam!D24","v":"Tom"},{"$f":"Bantam!O24","v":11},{"$f":"Mashapaug!D13","v":"Kevin"},{"$f":"Mashapaug!O13","v":11},{"$f":"Coventry!D5","v":"Bill"},{"$f":"Coventry!O5","v":11},{"$f":"Beach!D19","v":"Rich T"},{"$f":"Beach!O19","v":11},{"$f":"Candlewood!D19","v":"Rich T"},{"$f":"Candlewood!O19","v":11},{"$f":"Winchester!D4","v":"Armand"},{"$f":"Winchester!O4","v":11},{"$f":"Mansfield!D21","v":"Scott"},{"$f":"Mansfield!O21","v":11},{"$f":"Aspinook!D22","v":"Steve D"},{"$f":"Aspinook!O22","v":30}]
[{"$f":"N1","v":"Morrie"},{"$f":"N11","v":14},{"$f":"N10","v":65},null,"Steve S",13,61,null,"Morrie",{"$f":"Aspinook!N16+Bantam!N16+Winchester!N16+Coventry!N16+Mansfield!N16+Mashapaug!N16+Beach!N16+Candlewood!N16","v":19.62},null,"ctl-S   Sort Upper Section",null,null,null,"Morrie",null,null,{"$f":"Bantam!D18","v":"Rich B"},{"$f":"Bantam!O18","v":12},{"$f":"Mashapaug!D19","v":"Rich T"},{"$f":"Mashapaug!O19","v":12},{"$f":"Coventry!D6","v":"Dean"},{"$f":"Coventry!O6","v":12},{"$f":"Beach!D18","v":"Rich B"},{"$f":"Beach!O18","v":12},{"$f":"Candlewood!D11","v":"Joe"},{"$f":"Candlewood!O11","v":12},{"$f":"Winchester!D5","v":"Bill"},{"$f":"Winchester!O5","v":12},{"$f":"Mansfield!D22","v":"Steve D"},{"$f":"Mansfield!O22","v":12},{"$f":"Aspinook!D17","v":"Pete"},{"$f":"Aspinook!O17","v":30}]
[{"$f":"O1","v":"Pete"},{"$f":"O11","v":6},{"$f":"O10","v":42},null,"Morrie",14,65,null,"Pete",{"$f":"Aspinook!N17+Bantam!N17+Winchester!N17+Coventry!N17+Mansfield!N17+Mashapaug!N17+Beach!N17+Candlewood!N17","v":32.160000000000004},null,"ctl-K   Copy and Paste for Position",null,null,null,"Pete",null,null,{"$f":"Bantam!D16","v":"Morrie"},{"$f":"Bantam!O16","v":13},{"$f":"Mashapaug!D5","v":"Bill"},{"$f":"Mashapaug!O5","v":13},{"$f":"Coventry!D11","v":"Joe"},{"$f":"Coventry!O11","v":13},{"$f":"Beach!D12","v":"Kam"},{"$f":"Beach!O12","v":13},{"$f":"Candlewood!D13","v":"Kevin"},{"$f":"Candlewood!O13","v":13},{"$f":"Winchester!D18","v":"Rich B"},{"$f":"Winchester!O18","v":13},{"$f":"Mansfield!D10","v":"Jim B"},{"$f":"Mansfield!O10","v":13},{"$f":"Aspinook!D16","v":"Morrie"},{"$f":"Aspinook!O16","v":30}]
[{"$f":"P1","v":"Rich B"},{"$f":"P11","v":5},{"$f":"P10","v":41},null,"Mike M",15,76,null,"Rich B",{"$f":"Aspinook!N18+Bantam!N18+Winchester!N18+Coventry!N18+Mansfield!N18+Mashapaug!N18+Beach!N18+Candlewood!N18","v":31.000000000000004},null,"ctl-L    Sort For Lunker",null,null,null,"Rich B",null,null,{"$f":"Bantam!D10","v":"Jim B"},{"$f":"Bantam!O10","v":14},{"$f":"Mashapaug!D7","v":"Jack"},{"$f":"Mashapaug!O7","v":14},{"$f":"Coventry!D21","v":"Scott"},{"$f":"Coventry!O21","v":30},{"$f":"Beach!D6","v":"Dean"},{"$f":"Beach!O6","v":14},{"$f":"Candlewood!D14","v":"Mike M"},{"$f":"Candlewood!O14","v":14},{"$f":"Winchester!D7","v":"Jack"},{"$f":"Winchester!O7","v":14},{"$f":"Mansfield!D13","v":"Kevin"},{"$f":"Mansfield!O13","v":14},{"$f":"Aspinook!D18","v":"Rich B"},{"$f":"Aspinook!O18","v":30}]
[{"$f":"Q1","v":"Rich T"},{"$f":"Q11","v":8},{"$f":"Q10","v":49},null,"Jack",16,94,null,"Rich T",{"$f":"Aspinook!N19+Bantam!N19+Winchester!N19+Coventry!N19+Mansfield!N19+Mashapaug!N19+Beach!N19+Candlewood!N19","v":27.939999999999998},null,"ctl-F   Sort Top 3 Finishers",null,null,null,"Rich T",null,null,{"$f":"Bantam!D7","v":"Jack"},{"$f":"Bantam!O7","v":15},{"$f":"Mashapaug!D15","v":"Mike G"},{"$f":"Mashapaug!O15","v":15},{"$f":"Coventry!D17","v":"Pete"},{"$f":"Coventry!O17","v":30},{"$f":"Beach!D8","v":"Jason"},{"$f":"Beach!O8","v":15},{"$f":"Candlewood!D7","v":"Jack"},{"$f":"Candlewood!O7","v":30},{"$f":"Winchester!D24","v":"Tom"},{"$f":"Winchester!O24","v":15},{"$f":"Mansfield!D4","v":"Armand"},{"$f":"Mansfield!O4","v":15},{"$f":"Aspinook!D11","v":"Joe"},{"$f":"Aspinook!O11","v":30}]
[{"$f":"R1","v":"Ron"},{"$f":"R11","v":16},{"$f":"R10","v":94},null,"Ron",16,94,null,"Ron",{"$f":"Aspinook!N20+Bantam!N20+Winchester!N20+Coventry!N20+Mansfield!N20+Mashapaug!N20+Beach!N20+Candlewood!N20","v":16.5},null,"ctl-W   Sort for Total Weight",null,null,null,"Ron",null,null,{"$f":"Bantam!D15","v":"Mike G"},{"$f":"Bantam!O15","v":16},{"$f":"Mashapaug!D21","v":"Scott"},{"$f":"Mashapaug!O21","v":16},{"$f":"Coventry!D24","v":"Tom"},{"$f":"Coventry!O24","v":30},{"$f":"Beach!D7","v":"Jack"},{"$f":"Beach!O7","v":16},{"$f":"Candlewood!D8","v":"Jason"},{"$f":"Candlewood!O8","v":30},{"$f":"Winchester!D20","v":"Ron"},{"$f":"Winchester!O20","v":30},{"$f":"Mansfield!D15","v":"Mike G"},{"$f":"Mansfield!O15","v":30},{"$f":"Aspinook!D19","v":"Rich T"},{"$f":"Aspinook!O19","v":30}]
[{"$f":"S1","v":"Scott"},{"$f":"S11","v":4},{"$f":"S10","v":34},null,"Mike G",18,105,null,"Scott",{"$f":"Aspinook!N21+Bantam!N21+Winchester!N21+Coventry!N21+Mansfield!N21+Mashapaug!N21+Beach!N21+Candlewood!N21","v":29.980000000000004},null,null,null,null,null,"Scott",null,null,{"$f":"Bantam!D13","v":"Kevin"},{"$f":"Bantam!O13","v":30},{"$f":"Mashapaug!D11","v":"Joe"},{"$f":"Mashapaug!O11","v":17},{"$f":"Coventry!D12","v":"Kam"},{"$f":"Coventry!O12","v":35},{"$f":"Beach!D11","v":"Joe"},{"$f":"Beach!O11","v":17},{"$f":"Candlewood!D5","v":"Bill"},{"$f":"Candlewood!O5","v":30},{"$f":"Winchester!D14","v":"Mike M"},{"$f":"Winchester!O14","v":30},{"$f":"Mansfield!D16","v":"Morrie"},{"$f":"Mansfield!O16","v":30},{"$f":"Aspinook!D6","v":"Dean"},{"$f":"Aspinook!O6","v":30}]
[{"$f":"T1","v":"Steve D"},{"$f":"T11","v":1},{"$f":"T10","v":23},null,"Kam",19,114,null,"Steve D",{"$f":"Aspinook!N22+Bantam!N22+Winchester!N22+Coventry!N22+Mansfield!N22+Mashapaug!N22+Beach!N22+Candlewood!N22","v":46.900000000000006},null,null,null,null,null,"Steve D",null,null,{"$f":"Bantam!D20","v":"Ron"},{"$f":"Bantam!O20","v":30},{"$f":"Mashapaug!D20","v":"Ron"},{"$f":"Mashapaug!O20","v":18},{"$f":"Coventry!D14","v":"Mike M"},{"$f":"Coventry!O14","v":35},{"$f":"Beach!D4","v":"Armand"},{"$f":"Beach!O4","v":18},{"$f":"Candlewood!D15","v":"Mike G"},{"$f":"Candlewood!O15","v":35},{"$f":"Winchester!D11","v":"Joe"},{"$f":"Winchester!O11","v":30},{"$f":"Mansfield!D11","v":"Joe"},{"$f":"Mansfield!O11","v":30},{"$f":"Aspinook!D10","v":"Jim B"},{"$f":"Aspinook!O10","v":30}]
[{"$f":"U1","v":"Steve S"},{"$f":"U11","v":13},{"$f":"U10","v":61},null,"Joe",20,119,null,"Steve S",{"$f":"Aspinook!N23+Bantam!N23+Winchester!N23+Coventry!N23+Mansfield!N23+Mashapaug!N23+Beach!N23+Candlewood!N23","v":24.95},null,null,null,null,null,"Steve S",null,null,{"$f":"Bantam!D11","v":"Joe"},{"$f":"Bantam!O11","v":30},{"$f":"Mashapaug!D14","v":"Mike M"},{"$f":"Mashapaug!O14","v":19},{"$f":"Coventry!D20","v":"Ron"},{"$f":"Coventry!O20","v":35},{"$f":"Beach!D23","v":"Steve S"},{"$f":"Beach!O23","v":30},{"$f":"Candlewood!D24","v":"Tom"},{"$f":"Candlewood!O24","v":35},{"$f":"Winchester!D12","v":"Kam"},{"$f":"Winchester!O12","v":30},{"$f":"Mansfield!D7","v":"Jack"},{"$f":"Mansfield!O7","v":30},{"$f":"Aspinook!D7","v":"Jack"},{"$f":"Aspinook!O7","v":35}]
[{"$f":"V1","v":"Tom"},{"$f":"V11","v":10},{"$f":"V10","v":51},null,"Jim B",21,137,null,"Tom",{"$f":"Aspinook!N24+Bantam!N24+Winchester!N24+Coventry!N24+Mansfield!N24+Mashapaug!N24+Beach!N24+Candlewood!N24","v":26.009999999999998},null,null,null,null,null,"Tom",null,null,{"$f":"Bantam!D12","v":"Kam"},{"$f":"Bantam!O12","v":30},{"$f":"Mashapaug!D12","v":"Kam"},{"$f":"Mashapaug!O12","v":35},{"$f":"Coventry!D15","v":"Mike G"},{"$f":"Coventry!O15","v":35},{"$f":"Beach!D20","v":"Ron"},{"$f":"Beach!O20","v":35},{"$f":"Candlewood!D10","v":"Jim B"},{"$f":"Candlewood!O10","v":35},{"$f":"Winchester!D13","v":"Kevin"},{"$f":"Winchester!O13","v":35},{"$f":"Mansfield!D23","v":"Steve S"},{"$f":"Mansfield!O23","v":30},{"$f":"Aspinook!D15","v":"Mike G"},{"$f":"Aspinook!O15","v":35}]
[{"$f":"W1","v":"X"},{"$f":"W11","v":22},{"$f":"W10","v":210},null,"X",22,210,null,"X",{"$f":"Aspinook!N25+Bantam!N25+Winchester!N25+Coventry!N25+Mansfield!N25+Mashapaug!N25+Beach!N25+Candlewood!N25","v":0},null,null,null,null,null,"X",null,null,{"$f":"Bantam!D14","v":"Mike M"},{"$f":"Bantam!O14","v":30},{"$f":"Mashapaug!D16","v":"Morrie"},{"$f":"Mashapaug!O16","v":35},{"$f":"Coventry!D10","v":"Jim B"},{"$f":"Coventry!O10","v":35},{"$f":"Beach!D10","v":"Jim B"},{"$f":"Beach!O10","v":35},{"$f":"Candlewood!D4","v":"Armand"},{"$f":"Candlewood!O4","v":35},{"$f":"Winchester!D10","v":"Jim B"},{"$f":"Winchester!O10","v":35},{"$f":"Mansfield!D12","v":"Kam"},{"$f":"Mansfield!O12","v":30},{"$f":"Aspinook!D5","v":"Bill"},{"$f":"Aspinook!O5","v":35}]
[{"$f":"X1","v":"X"},{"$f":"X11","v":22},{"$f":"X10","v":210},null,"X",22,210,null,"X",{"$f":"Aspinook!N26+Bantam!N26+Winchester!N26+Coventry!N26+Mansfield!N26+Mashapaug!N26+Beach!N26+Candlewood!N26","v":0},null,null,null,null,null,"X",null,null,{"$f":"Bantam!D25","v":"X"},{"$f":"Bantam!O25","v":35},{"$f":"Mashapaug!D25","v":"X"},{"$f":"Mashapaug!O25","v":35},{"$f":"Coventry!D25","v":"X"},{"$f":"Coventry!O25","v":35},{"$f":"Beach!D25","v":"X"},{"$f":"Beach!O25","v":35},{"$f":"Candlewood!D25","v":"X"},{"$f":"Candlewood!O25","v":35},{"$f":"Winchester!D25","v":"X"},{"$f":"Winchester!O25","v":35},{"$f":"Mansfield!D25","v":"X"},{"$f":"Mansfield!O25","v":35},{"$f":"Aspinook!D25","v":"X"},{"$f":"Aspinook!O25","v":35}]
[{"$f":"Y1","v":"X"},{"$f":"Y11","v":22},{"$f":"Y10","v":210},null,"X",22,210,null,"X",{"$f":"Aspinook!N27+Bantam!N27+Winchester!N27+Coventry!N27+Mansfield!N27+Mashapaug!N27+Beach!N27+Candlewood!N27","v":0},null,null,null,null,null,"X",null,null,{"$f":"Bantam!D26","v":"X"},{"$f":"Bantam!O26","v":35},{"$f":"Mashapaug!D27","v":"X"},{"$f":"Mashapaug!O27","v":35},{"$f":"Coventry!D26","v":"X"},{"$f":"Coventry!O26","v":35},{"$f":"Beach!D26","v":"X"},{"$f":"Beach!O26","v":35},{"$f":"Candlewood!D26","v":"X"},{"$f":"Candlewood!O26","v":35},{"$f":"Winchester!D26","v":"X"},{"$f":"Winchester!O26","v":35},{"$f":"Mansfield!D26","v":"X"},{"$f":"Mansfield!O26","v":35},{"$f":"Aspinook!D26","v":"X"},{"$f":"Aspinook!O26","v":35}]
[{"$f":"Z1","v":"X"},{"$f":"Z11","v":22},{"$f":"Z10","v":210},null,"X",22,210,null,"X",{"$f":"Aspinook!N28+Bantam!N28+Winchester!N28+Coventry!N28+Mansfield!N28+Mashapaug!N28+Beach!N28+Candlewood!N28","v":0},null,null,null,null,null,"X",null,null,{"$f":"Bantam!D27","v":"X"},{"$f":"Bantam!O27","v":35},{"$f":"Mashapaug!D26","v":"X"},{"$f":"Mashapaug!O26","v":35},{"$f":"Coventry!D27","v":"X"},{"$f":"Coventry!O27","v":35},{"$f":"Beach!D27","v":"X"},{"$f":"Beach!O27","v":35},{"$f":"Candlewood!D27","v":"X"},{"$f":"Candlewood!O27","v":35},{"$f":"Winchester!D27","v":"X"},{"$f":"Winchester!O27","v":35},{"$f":"Mansfield!D27","v":"X"},{"$f":"Mansfield!O27","v":35},{"$f":"Aspinook!D27","v":"X"},{"$f":"Aspinook!O27","v":35}]
[{"$f":"AA1","v":"X"},{"$f":"AA11","v":22},{"$f":"AA10","v":210},null,"X",22,210,null,"X",{"$f":"Aspinook!N29+Bantam!N29+Winchester!N29+Coventry!N29+Mansfield!N29+Mashapaug!N29+Beach!N29+Candlewood!N29","v":0},null,null,null,null,null,"X",null,null,{"$f":"Bantam!D28","v":"X"},{"$f":"Bantam!O28","v":35},{"$f":"Mashapaug!D28","v":"X"},{"$f":"Mashapaug!O28","v":35},{"$f":"Coventry!D28","v":"X"},{"$f":"Coventry!O28","v":35},{"$f":"Beach!D28","v":"X"},{"$f":"Beach!O28","v":35},{"$f":"Candlewood!D28","v":"X"},{"$f":"Candlewood!O28","v":35},{"$f":"Winchester!D28","v":"X"},{"$f":"Winchester!O28","v":35},{"$f":"Mansfield!D28","v":"X"},{"$f":"Mansfield!O28","v":35},{"$f":"Aspinook!D28","v":"X"},{"$f":"Aspinook!O28","v":35}]
[null,null,null,null,null,null,null,null,null,null,null,null,null,null,null,null,null,null,{"$f":"Bantam!D29","v":"X"},{"$f":"Bantam!O29","v":35},{"$f":"Mashapaug!D29","v":"X"},{"$f":"Mashapaug!O29","v":35},{"$f":"Coventry!D29","v":"X"},{"$f":"Coventry!O29","v":35},{"$f":"Beach!D29","v":"X"},{"$f":"Beach!O29","v":35},{"$f":"Candlewood!D29","v":"X"},{"$f":"Candlewood!O29","v":35},{"$f":"Winchester!D29","v":"X"},{"$f":"Winchester!O29","v":35},{"$f":"Mansfield!D29","v":"X"},{"$f":"Mansfield!O29","v":35},{"$f":"Aspinook!D29","v":"X"},{"$f":"Aspinook!O29","v":35}]
[]
[]
["Total Weight"]
[{"$f":"L15","v":"Bantam"},null,{"$f":"L16","v":"Mashapaug"},null,{"$f":"L17","v":"Coventry"},null,{"$f":"L18","v":"Beach"},null,{"$f":"L19","v":"Candlewood"},null,{"$f":"L20","v":"Winchester"},null,{"$f":"L21","v":"Mansfield"},null,{"$f":"L22","v":"Aspinook"},null,"Lbs",null,"Total Weight YTD"]
["Name","Weight","Name","Weight","Name","Weight","Name","Weight","Name","Weight","Name","Weight","Name","Weight","Name","Weight","Ytd",null,"Name","Weight"]
[{"$f":"P15","v":"Armand"},{"$f":"Bantam!N4","v":4.4400000000000004},{"$f":"P15","v":"Armand"},{"$f":"Mashapaug!N4","v":11.39},{"$f":"P15","v":"Armand"},{"$f":"Coventry!N4","v":2.29},{"$f":"P15","v":"Armand"},{"$f":"Beach!N4","v":0.67},{"$f":"P15","v":"Armand"},{"$f":"Candlewood!N4","v":0},{"$f":"P15","v":"Armand"},{"$f":"Winchester!N4","v":1.59},{"$f":"P15","v":"Armand"},{"$f":"Mansfield!N4","v":1.93},{"$f":"P15","v":"Armand"},{"$f":"Aspinook!N4","v":1.95},{"$f":"SUM(A47:P47)","v":24.26},null,"Armand",{"$f":"Q47","v":24.26}]
["Bill",{"$f":"Bantam!N5","v":7.77},"Bill",{"$f":"Mashapaug!N5","v":5.38},"Bill",{"$f":"Coventry!N5","v":1.25},"Bill",{"$f":"Beach!N5","v":4.9799999999999995},"Bill",{"$f":"Candlewood!N5","v":0},"Bill",{"$f":"Winchester!N5","v":1.58},"Bill",{"$f":"Mansfield!N5","v":3.81},"Bill",{"$f":"Aspinook!N5","v":0},24.77,null,"Bill",{"$f":"Q48","v":24.77}]
["Dean",{"$f":"Bantam!N6","v":4.38},"Dean",{"$f":"Mashapaug!N6","v":9.49},"Dean",{"$f":"Coventry!N6","v":0.89},"Dean",{"$f":"Beach!N6","v":1.33},"Dean",{"$f":"Candlewood!N6","v":2.67},"Dean",{"$f":"Winchester!N6","v":4.8499999999999996},"Dean",{"$f":"Mansfield!N6","v":5.49},"Dean",{"$f":"Aspinook!N6","v":0},29.100000000000009,null,"Dean",29.100000000000009]
["Jack",{"$f":"Bantam!N7","v":1.74},"Jack",{"$f":"Mashapaug!N7","v":5.29},"Jack",{"$f":"Coventry!N7","v":3.55},"Jack",{"$f":"Beach!N7","v":1.03},"Jack",{"$f":"Candlewood!N7","v":0},"Jack",{"$f":"Winchester!N7","v":1.05},"Jack",{"$f":"Mansfield!N7","v":0},"Jack",{"$f":"Aspinook!N7","v":0},12.66,null,"Jack",12.66]
["Jason",{"$f":"Bantam!N8","v":9.61},"Jason",{"$f":"Mashapaug!N8","v":11.17},"Jason",{"$f":"Coventry!N8","v":5.07},"Jason",{"$f":"Beach!N8","v":1.21},"Jason",{"$f":"Candlewood!N8","v":0},"Jason",{"$f":"Winchester!N8","v":3.58},"Jason",{"$f":"Mansfield!N8","v":5.57},"Jason",{"$f":"Aspinook!N8","v":1.94},38.15,null,"Jason",38.15]
["Jeff",{"$f":"Bantam!N9","v":8.56},"Jeff",{"$f":"Mashapaug!N9","v":9.19},"Jeff",{"$f":"Coventry!N9","v":3.07},"Jeff",{"$f":"Beach!N9","v":9.31},"Jeff",{"$f":"Candlewood!N9","v":4.13},"Jeff",{"$f":"Winchester!N9","v":4.6399999999999997},"Jeff",{"$f":"Mansfield!N9","v":5.53},"Jeff",{"$f":"Aspinook!N9","v":2.65},47.080000000000005,null,"Jeff",47.080000000000005]
["Jim B",{"$f":"Bantam!N10","v":3.08},"Jim B",{"$f":"Mashapaug!N10","v":7.55},"Jim B",{"$f":"Coventry!N10","v":0},"Jim B",{"$f":"Beach!N10","v":0},"Jim B",{"$f":"Candlewood!N10","v":0},"Jim B",{"$f":"Winchester!N10","v":0},"Jim B",{"$f":"Mansfield!N10","v":2.21},"Jim B",{"$f":"Aspinook!N10","v":0},12.84,null,"Jim B",12.84]
["Joe",{"$f":"Bantam!N11","v":0},"Joe",{"$f":"Mashapaug!N11","v":3.7},"Joe",{"$f":"Coventry!N11","v":0.8},"Joe",{"$f":"Beach!N11","v":0.73},"Joe",{"$f":"Candlewood!N11","v":2.13},"Joe",{"$f":"Winchester!N11","v":0},"Joe",{"$f":"Mansfield!N11","v":0},"Joe",{"$f":"Aspinook!N11","v":0},7.36,null,"Joe",7.36]
["Kam",{"$f":"Bantam!N12","v":0},"Kam",{"$f":"Mashapaug!N12","v":0},"Kam",{"$f":"Coventry!N12","v":0},"Kam",{"$f":"Beach!N12","v":1.93},"Kam",{"$f":"Candlewood!N12","v":2.42},"Kam",{"$f":"Winchester!N12","v":0},"Kam",{"$f":"Mansfield!N12","v":0},"Kam",{"$f":"Aspinook!N12","v":6.95},11.3,null,"Kam",11.3]
["Kevin",{"$f":"Bantam!N13","v":0},"Kevin",{"$f":"Mashapaug!N13","v":7.11},"Kevin",{"$f":"Coventry!N13","v":4.72},"Kevin",{"$f":"Beach!N13","v":2.5},"Kevin",{"$f":"Candlewood!N13","v":1.9},"Kevin",{"$f":"Winchester!N13","v":0},"Kevin",{"$f":"Mansfield!N13","v":2.0099999999999998},"Kevin",{"$f":"Aspinook!N13","v":14.95},33.19,null,"Kevin",33.19]
["Mike M",{"$f":"Bantam!N14","v":0},"Mike M",{"$f":"Mashapaug!N14","v":1.9},"Mike M",{"$f":"Coventry!N14","v":0},"Mike M",{"$f":"Beach!N14","v":5.87},"Mike M",{"$f":"Candlewood!N14","v":1.72},"Mike M",{"$f":"Winchester!N14","v":0},"Mike M",{"$f":"Mansfield!N14","v":8.98},"Mike M",{"$f":"Aspinook!N14","v":0.91400000000000003},19.384,null,"Mike",19.384]
["Mike G",{"$f":"Bantam!N15","v":1.28},"Mike G",{"$f":"Mashapaug!N15","v":5.05},"Mike G",{"$f":"Coventry!N15","v":0},"Mike G",{"$f":"Beach!N15","v":4.78},"Mike G",{"$f":"Candlewood!N15","v":0},"Mike G",{"$f":"Winchester!N15","v":5.76},"Mike G",{"$f":"Mansfield!N15","v":0},"Mike G",{"$f":"Aspinook!N15","v":0},16.869999999999997,null,"Mike G",16.869999999999997]
["Morrie",{"$f":"Bantam!N16","v":3.1},"Morrie",{"$f":"Mashapaug!N16","v":0},"Morrie",{"$f":"Coventry!N16","v":5.36},"Morrie",{"$f":"Beach!N16","v":3.5},"Morrie",{"$f":"Candlewood!N16","v":6.02},"Morrie",{"$f":"Winchester!N16","v":1.64},"Morrie",{"$f":"Mansfield!N16","v":0},"Morrie",{"$f":"Aspinook!N16","v":0},19.62,null,"Morrie",19.62]
["Pete",{"$f":"Bantam!N17","v":4.2300000000000004},"Pete",{"$f":"Mashapaug!N17","v":8.32},"Pete",{"$f":"Coventry!N17","v":0},"Pete",{"$f":"Beach!N17","v":2.0499999999999998},"Pete",{"$f":"Candlewood!N17","v":7.9499999999999993},"Pete",{"$f":"Winchester!N17","v":5.03},"Pete",{"$f":"Mansfield!N17","v":4.58},"Pete",{"$f":"Aspinook!N17","v":0},32.160000000000004,null,"Pete",32.160000000000004]
["Rich B",{"$f":"Bantam!N18","v":3.55},"Rich B",{"$f":"Mashapaug!N18","v":10.58},"Rich B",{"$f":"Coventry!N18","v":3.48},"Rich B",{"$f":"Beach!N18","v":1.96},"Rich B",{"$f":"Candlewood!N18","v":2.88},"Rich B",{"$f":"Winchester!N18","v":1.19},"Rich B",{"$f":"Mansfield!N18","v":7.36},"Rich B",{"$f":"Aspinook!N18","v":0},31,null,"Rich B",31]
["Rich T",{"$f":"Bantam!N19","v":5.66},"Rich T",{"$f":"Mashapaug!N19","v":6.04},"Rich T",{"$f":"Coventry!N19","v":1.78},"Rich T",{"$f":"Beach!N19","v":2.04},"Rich T",{"$f":"Candlewood!N19","v":2.35},"Rich T",{"$f":"Winchester!N19","v":3.8999999999999995},"Rich T",{"$f":"Mansfield!N19","v":6.17},"Rich T",{"$f":"Aspinook!N19","v":0},27.939999999999998,null,"Rich T",27.939999999999998]
["Ron",{"$f":"Bantam!N20","v":0},"Ron",{"$f":"Mashapaug!N20","v":2.94},"Ron",{"$f":"Coventry!N20","v":0},"Ron",{"$f":"Beach!N20","v":0},"Ron",{"$f":"Candlewood!N20","v":2.41},"Ron",{"$f":"Winchester!N20","v":0},"Ron",{"$f":"Mansfield!N20","v":6.6},"Ron",{"$f":"Aspinook!N20","v":4.55},16.5,null,"Ron",16.5]
["Scott",{"$f":"Bantam!N21","v":4.24},"Scott",{"$f":"Mashapaug!N21","v":5.03},"Scott",{"$f":"Coventry!N21","v":0},"Scott",{"$f":"Beach!N21","v":5.9799999999999995},"Scott",{"$f":"Candlewood!N21","v":3.42},"Scott",{"$f":"Winchester!N21","v":6.49},"Scott",{"$f":"Mansfield!N21","v":2.5499999999999998},"Scott",{"$f":"Aspinook!N21","v":2.27},29.980000000000004,null,"Scott",29.980000000000004]
["Steve D",{"$f":"Bantam!N22","v":8.24},"Steve D",{"$f":"Mashapaug!N22","v":9.48},"Steve D",{"$f":"Coventry!N22","v":13.24},"Steve D",{"$f":"Beach!N22","v":5.03},"Steve D",{"$f":"Candlewood!N22","v":2.56},"Steve D",{"$f":"Winchester!N22","v":5.87},"Steve D",{"$f":"Mansfield!N22","v":2.48},"Steve D",{"$f":"Aspinook!N22","v":0},46.9,null,"Steve D",46.9]
["Steve S",{"$f":"Bantam!N23","v":4.3099999999999996},"Steve S",{"$f":"Mashapaug!N23","v":8.2799999999999994},"Steve S",{"$f":"Coventry!N23","v":2.67},"Steve S",{"$f":"Beach!N23","v":0},"Steve S",{"$f":"Candlewood!N23","v":4.6399999999999997},"Steve S",{"$f":"Winchester!N23","v":5.05},"Steve S",{"$f":"Mansfield!N23","v":0},"Steve S",{"$f":"Aspinook!N23","v":0},24.95,null,"Steve S",24.95]
["Tom",{"$f":"Bantam!N24","v":4.18},"Tom",{"$f":"Mashapaug!N24","v":7.83},"Tom",{"$f":"Coventry!N24","v":0},"Tom",{"$f":"Beach!N24","v":4.43},"Tom",{"$f":"Candlewood!N24","v":0},"Tom",{"$f":"Winchester!N24","v":0.74},"Tom",{"$f":"Mansfield!N24","v":6.1},"Tom",{"$f":"Aspinook!N24","v":2.73},26.009999999999994,null,"Tom",26.009999999999994]
["X",{"$f":"Bantam!N25","v":0},"X",{"$f":"Mashapaug!N25","v":0},"X",{"$f":"Coventry!N25","v":0},"X",{"$f":"Beach!N25","v":0},"X",{"$f":"Candlewood!N25","v":0},"X",{"$f":"Winchester!N25","v":0},"X",{"$f":"Mansfield!N25","v":0},"X",{"$f":"Aspinook!N25","v":0},0,null,"X",0]
["X",{"$f":"Bantam!N26","v":0},"X",{"$f":"Mashapaug!N26","v":0},"X",{"$f":"Coventry!N26","v":0},"X",{"$f":"Beach!N26","v":0},"X",{"$f":"Candlewood!N26","v":0},"X",{"$f":"Winchester!N26","v":0},"X",{"$f":"Mansfield!N26","v":0},"X",{"$f":"Aspinook!N26","v":0},0,null,"X",0]
["X",{"$f":"Bantam!N27","v":0},"X",{"$f":"Mashapaug!N27","v":0},"X",{"$f":"Coventry!N27","v":0},"X",{"$f":"Beach!N27","v":0},"X",{"$f":"Candlewood!N27","v":0},"X",{"$f":"Winchester!N27","v":0},"X",{"$f":"Mansfield!N27","v":0},"X",{"$f":"Aspinook!N27","v":0},0,null,"X",0]
["X",{"$f":"Bantam!N28","v":0},"X",{"$f":"Mashapaug!N28","v":0},"X",{"$f":"Coventry!N28","v":0},"X",{"$f":"Beach!N28","v":0},"X",{"$f":"Candlewood!N28","v":0},"X",{"$f":"Winchester!N28","v":0},"X",{"$f":"Mansfield!N28","v":0},"X",{"$f":"Aspinook!N28","v":0},0,null,"X",0]
["X",{"$f":"Bantam!N29","v":0},"X",{"$f":"Mashapaug!N29","v":0},"X",{"$f":"Coventry!N29","v":0},"X",{"$f":"Beach!N29","v":0},"X",{"$f":"Candlewood!N29","v":0},"X",{"$f":"Winchester!N29","v":0},"X",{"$f":"Mansfield!N29","v":0},"X",{"$f":"Aspinook!N29","v":0},0,null,"X",0]
[]
["Lunkers"]
[{"$f":"A45","v":"Bantam"},null,null,{"$f":"C45","v":"Mashapaug"},null,null,{"$f":"E45","v":"Coventry"},null,null,{"$f":"G45","v":"Beach"},null,null,{"$f":"I45","v":"Candlewood"},null,null,{"$f":"K45","v":"Winchester"},null,null,{"$f":"M45","v":"Mansfield"},null,null,{"$f":"O45","v":"Aspinook"}]
["Name","Weight","L or S","Name","Weight","L or S","Name","Weight","L or S","Name","Weight","L or S","Name","Weight","L or S","Name","Weight","L or S","Name","Weight","L or S","Name","Weight","L or S"]
["Armand",{"$f":"Bantam!J4","v":0},{"$f":"Bantam!K4","v":0},"Armand",{"$f":"Mashapaug!J4","v":0},{"$f":"Mashapaug!K4","v":0},"Armand",{"$f":"Coventry!J4","v":0},{"$f":"Coventry!K4","v":0},"Armand",{"$f":"Beach!J4","v":0},{"$f":"Beach!K4","v":0},"Armand",{"$f":"Candlewood!J4","v":0},{"$f":"Candlewood!K4","v":0}," ",{"$f":"Winchester!J29","v":0}," ","Armand",{"$f":"Mansfield!J4","v":0},{"$f":"Mansfield!K4","v":0},"Armand",{"$f":"Aspinook!J4","v":0},{"$f":"Aspinook!K4","v":0}]
["Bill",{"$f":"Bantam!J5","v":0},{"$f":"Bantam!K5","v":0},"Bill",{"$f":"Mashapaug!J5","v":0},{"$f":"Mashapaug!K5","v":0},"Bill",{"$f":"Coventry!J5","v":0},{"$f":"Coventry!K5","v":0},"Bill",{"$f":"Beach!J5","v":0},{"$f":"Beach!K5","v":0},"Bill",{"$f":"Candlewood!J5","v":0},{"$f":"Candlewood!K5","v":0},"Armand",{"$f":"Winchester!J4","v":0},{"$f":"Winchester!K4","v":0},"Bill",{"$f":"Mansfield!J5","v":0},{"$f":"Mansfield!K5","v":0},"Bill",{"$f":"Aspinook!J5","v":0},{"$f":"Aspinook!K5","v":0}]
["Dean",{"$f":"Bantam!J6","v":0},{"$f":"Bantam!K6","v":0},"Dean",{"$f":"Mashapaug!J6","v":0},{"$f":"Mashapaug!K6","v":0},"Dean",{"$f":"Coventry!J6","v":0},{"$f":"Coventry!K6","v":0},"Dean",{"$f":"Beach!J6","v":0},{"$f":"Beach!K6","v":0},"Dean",{"$f":"Candlewood!J6","v":0},{"$f":"Candlewood!K6","v":0},"Bill",{"$f":"Winchester!J5","v":0},{"$f":"Winchester!K5","v":0},"Dean",{"$f":"Mansfield!J6","v":0},{"$f":"Mansfield!K6","v":0},"Dean",{"$f":"Aspinook!J6","v":0},{"$f":"Aspinook!K6","v":0}]
["Jack",{"$f":"Bantam!J7","v":0},{"$f":"Bantam!K7","v":0},"Jack",{"$f":"Mashapaug!J7","v":0},{"$f":"Mashapaug!K7","v":0},"Jack",{"$f":"Coventry!J7","v":0},{"$f":"Coventry!K7","v":0},"Jack",{"$f":"Beach!J7","v":0},{"$f":"Beach!K7","v":0},"Jack",{"$f":"Candlewood!J7","v":0},{"$f":"Candlewood!K7","v":0},"Dean",{"$f":"Winchester!J6","v":0},{"$f":"Winchester!K6","v":0},"Jack",{"$f":"Mansfield!J7","v":0},{"$f":"Mansfield!K7","v":0},"Jack",{"$f":"Aspinook!J7","v":0},{"$f":"Aspinook!K7","v":0}]
["Jeff",{"$f":"Bantam!J9","v":0},{"$f":"Bantam!K9","v":0},"Jeff",{"$f":"Mashapaug!J9","v":0},{"$f":"Mashapaug!K9","v":0},"Jason",{"$f":"Coventry!J8","v":0},{"$f":"Coventry!K8","v":0},"Jason",{"$f":"Beach!J8","v":0},{"$f":"Beach!K8","v":0},"Jason",{"$f":"Candlewood!J8","v":0},{"$f":"Candlewood!K8","v":0},"Jack",{"$f":"Winchester!J7","v":0},{"$f":"Winchester!K7","v":0},"Jason",{"$f":"Mansfield!J8","v":0},{"$f":"Mansfield!K8","v":0},"Jason",{"$f":"Aspinook!J8","v":0},{"$f":"Aspinook!K8","v":0}]
["Jim B",{"$f":"Bantam!J10","v":0},{"$f":"Bantam!K10","v":0},"Jim B",{"$f":"Mashapaug!J10","v":0},{"$f":"Mashapaug!K10","v":0},"Jeff",{"$f":"Coventry!J9","v":0},{"$f":"Coventry!K9","v":0},"Jim B",{"$f":"Beach!J10","v":0},{"$f":"Beach!K10","v":0},"Jeff",{"$f":"Candlewood!J9","v":0},{"$f":"Candlewood!K9","v":0},"Jason",{"$f":"Winchester!J8","v":0},{"$f":"Winchester!K8","v":0},"Jeff",{"$f":"Mansfield!J9","v":0},{"$f":"Mansfield!K9","v":0},"Jeff",{"$f":"Aspinook!J9","v":0},{"$f":"Aspinook!K9","v":0}]
["Joe",{"$f":"Bantam!J11","v":0},{"$f":"Bantam!K11","v":0},"Joe",{"$f":"Mashapaug!J11","v":0},{"$f":"Mashapaug!K11","v":0},"Jim B",{"$f":"Coventry!J10","v":0},{"$f":"Coventry!K10","v":0},"Joe",{"$f":"Beach!J11","v":0},{"$f":"Beach!K11","v":0},"Jim B",{"$f":"Candlewood!J10","v":0},{"$f":"Candlewood!K10","v":0},"Jeff",{"$f":"Winchester!J9","v":0},{"$f":"Winchester!K9","v":0},"Jim B",{"$f":"Mansfield!J10","v":0},{"$f":"Mansfield!K10","v":0},"Jim B",{"$f":"Aspinook!J10","v":0},{"$f":"Aspinook!K10","v":0}]
["Kam",{"$f":"Bantam!J12","v":0},{"$f":"Bantam!K12","v":0},"Kam",{"$f":"Mashapaug!J12","v":0},{"$f":"Mashapaug!K12","v":0},"Joe",{"$f":"Coventry!J11","v":0},{"$f":"Coventry!K11","v":0},"Kam",{"$f":"Beach!J12","v":0},{"$f":"Beach!K12","v":0},"Joe",{"$f":"Candlewood!J11","v":0},{"$f":"Candlewood!K11","v":0},"Jim B",{"$f":"Winchester!J10","v":0},{"$f":"Winchester!K10","v":0},"Joe",{"$f":"Mansfield!J11","v":0},{"$f":"Mansfield!K11","v":0},"Joe",{"$f":"Aspinook!J11","v":0},{"$f":"Aspinook!K11","v":0}]
["Kevin",{"$f":"Bantam!J13","v":0},{"$f":"Bantam!K13","v":0},"Kevin",{"$f":"Mashapaug!J13","v":0},{"$f":"Mashapaug!K13","v":0},"Kam",{"$f":"Coventry!J12","v":0},{"$f":"Coventry!K12","v":0},"Kevin",{"$f":"Beach!J13","v":0},{"$f":"Beach!K13","v":0},"Kam",{"$f":"Candlewood!J12","v":0},{"$f":"Candlewood!K12","v":0},"Joe",{"$f":"Winchester!J11","v":0},{"$f":"Winchester!K11","v":0},"Kam",{"$f":"Mansfield!J12","v":0},{"$f":"Mansfield!K12","v":0},"Kam",{"$f":"Aspinook!J12","v":0},{"$f":"Aspinook!K12","v":0}]
["Mike",{"$f":"Bantam!J14","v":0},{"$f":"Bantam!K14","v":0},"Mike",{"$f":"Mashapaug!J14","v":0},{"$f":"Mashapaug!K14","v":0},"Kevin",{"$f":"Coventry!J13","v":0},{"$f":"Coventry!K13","v":0},"Mike",{"$f":"Beach!J14","v":0},{"$f":"Beach!K14","v":0},"Kevin",{"$f":"Candlewood!J13","v":0},{"$f":"Candlewood!K13","v":0},"Kam",{"$f":"Winchester!J12","v":0},{"$f":"Winchester!K12","v":0},"Kevin",{"$f":"Mansfield!J13","v":0},{"$f":"Mansfield!K13","v":0},"Mike",{"$f":"Aspinook!J14","v":0},{"$f":"Aspinook!K14","v":0}]
["Mike G",{"$f":"Bantam!J15","v":0},{"$f":"Bantam!K15","v":0},"Mike G",{"$f":"Mashapaug!J15","v":0},{"$f":"Mashapaug!K15","v":0},"Mike",{"$f":"Coventry!J14","v":0},{"$f":"Coventry!K14","v":0},"Mike G",{"$f":"Beach!J15","v":0},{"$f":"Beach!K15","v":0},"Mike",{"$f":"Candlewood!J14","v":0},{"$f":"Candlewood!K14","v":0},"Kevin",{"$f":"Winchester!J13","v":0},{"$f":"Winchester!K13","v":0},"Mike",{"$f":"Mansfield!J14","v":0},{"$f":"Mansfield!K14","v":0},"Mike G",{"$f":"Aspinook!J15","v":0},{"$f":"Aspinook!K15","v":0}]
["Morrie",{"$f":"Bantam!J16","v":0},{"$f":"Bantam!K16","v":0},"Morrie",{"$f":"Mashapaug!J16","v":0},{"$f":"Mashapaug!K16","v":0},"Mike G",{"$f":"Coventry!J15","v":0},{"$f":"Coventry!K15","v":0},"Morrie",{"$f":"Beach!J16","v":0},{"$f":"Beach!K16","v":0},"Mike G",{"$f":"Candlewood!J15","v":0},{"$f":"Candlewood!K15","v":0},"Mike",{"$f":"Winchester!J14","v":0},{"$f":"Winchester!K14","v":0},"Mike G",{"$f":"Mansfield!J15","v":0},{"$f":"Mansfield!K15","v":0},"Morrie",{"$f":"Aspinook!J16","v":0},{"$f":"Aspinook!K16","v":0}]
["Pete",{"$f":"Bantam!J17","v":0},{"$f":"Bantam!K17","v":0},"Pete",{"$f":"Mashapaug!J17","v":0},{"$f":"Mashapaug!K17","v":0},"Morrie",{"$f":"Coventry!J16","v":0},{"$f":"Coventry!K16","v":0},"Pete",{"$f":"Beach!J17","v":0},{"$f":"Beach!K17","v":0},"Pete",{"$f":"Candlewood!J17","v":0},{"$f":"Candlewood!K17","v":0},"Morrie",{"$f":"Winchester!J16","v":0},{"$f":"Winchester!K16","v":0},"Morrie",{"$f":"Mansfield!J16","v":0},{"$f":"Mansfield!K16","v":0},"Pete",{"$f":"Aspinook!J17","v":0},{"$f":"Aspinook!K17","v":0}]
["Rich B",{"$f":"Bantam!J18","v":0},{"$f":"Bantam!K18","v":0},"Rich B",{"$f":"Mashapaug!J18","v":0},{"$f":"Mashapaug!K18","v":0},"Pete",{"$f":"Coventry!J17","v":0},{"$f":"Coventry!K17","v":0},"Rich B",{"$f":"Beach!J18","v":0},{"$f":"Beach!K18","v":0},"Rich B",{"$f":"Candlewood!J18","v":0},{"$f":"Candlewood!K18","v":0},"Pete",{"$f":"Winchester!J17","v":0},{"$f":"Winchester!K17","v":0},"Pete",{"$f":"Mansfield!J17","v":0},{"$f":"Mansfield!K17","v":0},"Rich B",{"$f":"Aspinook!J18","v":0},{"$f":"Aspinook!K18","v":0}]
["Rich T",{"$f":"Bantam!J19","v":0},{"$f":"Bantam!K19","v":0},"Rich T",{"$f":"Mashapaug!J19","v":0},{"$f":"Mashapaug!K19","v":0},"Rich B",{"$f":"Coventry!J18","v":0},{"$f":"Coventry!K18","v":0},"Rich T",{"$f":"Beach!J19","v":0},{"$f":"Beach!K19","v":0},"Rich T",{"$f":"Candlewood!J19","v":0},{"$f":"Candlewood!K19","v":0},"Rich B",{"$f":"Winchester!J18","v":0},{"$f":"Winchester!K18","v":0},"Rich B",{"$f":"Mansfield!J18","v":0},{"$f":"Mansfield!K18","v":0},"Rich T",{"$f":"Aspinook!J19","v":0},{"$f":"Aspinook!K19","v":0}]
["Ron",{"$f":"Bantam!J20","v":0},{"$f":"Bantam!K20","v":0},"Ron",{"$f":"Mashapaug!J20","v":0},{"$f":"Mashapaug!K20","v":0},"Rich T",{"$f":"Coventry!J19","v":0},{"$f":"Coventry!K19","v":0},"Ron",{"$f":"Beach!J20","v":0},{"$f":"Beach!K20","v":0},"Ron",{"$f":"Candlewood!J20","v":0},{"$f":"Candlewood!K20","v":0},"Rich T",{"$f":"Winchester!J19","v":0},{"$f":"Winchester!K19","v":0},"Rich T",{"$f":"Mansfield!J19","v":0},{"$f":"Mansfield!K19","v":0},"Ron",{"$f":"Aspinook!J20","v":0},{"$f":"Aspinook!K20","v":0}]
["Scott",{"$f":"Bantam!J21","v":0},{"$f":"Bantam!K21","v":0},"Scott",{"$f":"Mashapaug!J21","v":0},{"$f":"Mashapaug!K21","v":0},"Ron",{"$f":"Coventry!J20","v":0},{"$f":"Coventry!K20","v":0},"Scott",{"$f":"Beach!J21","v":0},{"$f":"Beach!K21","v":0},"Scott",{"$f":"Candlewood!J21","v":0},{"$f":"Candlewood!K21","v":0},"Ron",{"$f":"Winchester!J20","v":0},{"$f":"Winchester!K20","v":0},"Scott",{"$f":"Mansfield!J21","v":0},{"$f":"Mansfield!K21","v":0},"Scott",{"$f":"Aspinook!J21","v":0},{"$f":"Aspinook!K21","v":0}]
["Steve D",{"$f":"Bantam!J22","v":0},{"$f":"Bantam!K22","v":0},"Steve D",{"$f":"Mashapaug!J22","v":0},{"$f":"Mashapaug!K22","v":0},"Scott",{"$f":"Coventry!J21","v":0},{"$f":"Coventry!K21","v":0},"Steve D",{"$f":"Beach!J22","v":0},{"$f":"Beach!K22","v":0},"Steve D",{"$f":"Candlewood!J22","v":0},{"$f":"Candlewood!K22","v":0},"Scott",{"$f":"Winchester!J21","v":0},{"$f":"Winchester!K21","v":0},"Steve D",{"$f":"Mansfield!J22","v":0},{"$f":"Mansfield!K22","v":0},"Steve D",{"$f":"Aspinook!J22","v":0},{"$f":"Aspinook!K22","v":0}]
["Steve S",{"$f":"Bantam!J23","v":0},{"$f":"Bantam!K23","v":0},"Steve S",{"$f":"Mashapaug!J23","v":0},{"$f":"Mashapaug!K23","v":0},"Steve S",{"$f":"Coventry!J23","v":0},{"$f":"Coventry!K23","v":0},"Steve S",{"$f":"Beach!J23","v":0},{"$f":"Beach!K23","v":0},"Steve S",{"$f":"Candlewood!J23","v":0},{"$f":"Candlewood!K23","v":0},"Steve D",{"$f":"Winchester!J22","v":0},{"$f":"Winchester!K22","v":0},"Steve S",{"$f":"Mansfield!J23","v":0},{"$f":"Mansfield!K23","v":0},"Steve S",{"$f":"Aspinook!J23","v":0},{"$f":"Aspinook!K23","v":0}]
["Tom",{"$f":"Bantam!J24","v":0},{"$f":"Bantam!K24","v":0},"Tom",{"$f":"Mashapaug!J24","v":0},{"$f":"Mashapaug!K24","v":0},"Tom",{"$f":"Coventry!J24","v":0},{"$f":"Coventry!K24","v":0},"Tom",{"$f":"Beach!J24","v":0},{"$f":"Beach!K24","v":0},"Tom",{"$f":"Candlewood!J24","v":0},{"$f":"Candlewood!K24","v":0},"Steve S",{"$f":"Winchester!J23","v":0},{"$f":"Winchester!K23","v":0},"Tom",{"$f":"Mansfield!J24","v":0},{"$f":"Mansfield!K24","v":0},"Tom",{"$f":"Aspinook!J24","v":0},{"$f":"Aspinook!K24","v":0}]
["X",{"$f":"Bantam!J25","v":0},{"$f":"Bantam!K25","v":0},"X",{"$f":"Mashapaug!J25","v":0},{"$f":"Mashapaug!K25","v":0},"X",{"$f":"Coventry!J25","v":0},{"$f":"Coventry!K25","v":0},"X",{"$f":"Beach!J25","v":0},{"$f":"Beach!K25","v":0},"X",{"$f":"Candlewood!J25","v":0},{"$f":"Candlewood!K25","v":0},"Tom",{"$f":"Winchester!J24","v":0},{"$f":"Winchester!K24","v":0},"X",{"$f":"Mansfield!J25","v":0},{"$f":"Mansfield!K25","v":0},"X",{"$f":"Aspinook!J25","v":0},{"$f":"Aspinook!K25","v":0}]
["X",{"$f":"Bantam!J26","v":0},{"$f":"Bantam!K26","v":0},"X",{"$f":"Mashapaug!J26","v":0},{"$f":"Mashapaug!K26","v":0},"X",{"$f":"Coventry!J26","v":0},{"$f":"Coventry!K26","v":0},"X",{"$f":"Beach!J26","v":0},{"$f":"Beach!K26","v":0},"X",{"$f":"Candlewood!J26","v":0},{"$f":"Candlewood!K26","v":0},"X",{"$f":"Winchester!J25","v":0},{"$f":"Winchester!K25","v":0},"X",{"$f":"Mansfield!J26","v":0},{"$f":"Mansfield!K26","v":0},"X",{"$f":"Aspinook!J26","v":0},{"$f":"Aspinook!K26","v":0}]
["X",{"$f":"Bantam!J27","v":0},{"$f":"Bantam!K27","v":0},"X",{"$f":"Mashapaug!J27","v":0},{"$f":"Mashapaug!K27","v":0},"X",{"$f":"Coventry!J27","v":0},{"$f":"Coventry!K27","v":0},"X",{"$f":"Beach!J27","v":0},{"$f":"Beach!K27","v":0},"X",{"$f":"Candlewood!J27","v":0},{"$f":"Candlewood!K27","v":0},"X",{"$f":"Winchester!J26","v":0},{"$f":"Winchester!K26","v":0},"X",{"$f":"Mansfield!J27","v":0},{"$f":"Mansfield!K27","v":0},"X",{"$f":"Aspinook!J27","v":0},{"$f":"Aspinook!K27","v":0}]
[{"$f":"P38","v":"X"},{"$f":"Bantam!J28","v":0},{"$f":"Bantam!K28","v":0},{"$f":"S38","v":"X"},{"$f":"Mashapaug!J28","v":0},{"$f":"Mashapaug!K28","v":0},"X",{"$f":"Coventry!J28","v":0},{"$f":"Coventry!K28","v":0},{"$f":"Y38","v":"X"},{"$f":"Beach!J28","v":0},{"$f":"Beach!K28","v":0},"X",{"$f":"Candlewood!J28","v":0},{"$f":"Candlewood!K28","v":0},"X",{"$f":"Winchester!J27","v":0},{"$f":"Winchester!K27","v":0},"X",{"$f":"Mansfield!J28","v":0},{"$f":"Mansfield!K28","v":0},"X",{"$f":"Aspinook!J28","v":0},{"$f":"Aspinook!K28","v":0}]
["Jason",{"$f":"Bantam!J8","v":4.2},{"$f":"Bantam!K8","v":"LMB"},"Jason",{"$f":"Mashapaug!J8","v":4.3899999999999997},{"$f":"Mashapaug!K8","v":"LMB"},"Steve",{"$f":"Coventry!J22","v":6.39},{"$f":"Coventry!K22","v":"LMB"},"Jeff",{"$f":"Beach!J9","v":5.96},{"$f":"Beach!K9","v":"LMB"},"Morrie",{"$f":"Candlewood!J16","v":3.47},{"$f":"Candlewood!K16","v":"SMB"},{"$f":"AE39","v":"X"},{"$f":"Winchester!J28","v":0},{"$f":"Winchester!K28","v":0},"X",{"$f":"Mansfield!J29","v":0},{"$f":"Mansfield!K29","v":0},"X",{"$f":"Aspinook!J29","v":0},{"$f":"Aspinook!K29","v":0}]
["Jason",{"$f":"Bantam!J8","v":4.2},{"$f":"Bantam!K8","v":"LMB"},"Jason",{"$f":"Mashapaug!J8","v":4.3899999999999997},{"$f":"Mashapaug!K8","v":"LMB"},"Steve D",{"$f":"Coventry!J22","v":6.39},{"$f":"Coventry!K22","v":"LMB"},"Jeff",{"$f":"Beach!J9","v":5.96},{"$f":"Beach!K9","v":"LMB"},"Morrie",{"$f":"Candlewood!J16","v":3.47},{"$f":"Candlewood!K16","v":"SMB"},"Mike G",{"$f":"Winchester!J15","v":3.83},{"$f":"Winchester!K15","v":"LMB"},"Ron",{"$f":"Mansfield!J20","v":2.91},{"$f":"Mansfield!K20","v":"LMB"},"Kevin",{"$f":"Aspinook!J13","v":5.4},{"$f":"Aspinook!K13","v":"LMB"}]
[{"$f":"A102","v":"Jason"},{"$f":"B102","v":4.2},{"$f":"C102","v":"LMB"},{"$f":"D102","v":"Jason"},4.3899999999999997,{"$f":"F102","v":"LMB"},{"$f":"G102","v":"Steve D"},{"$f":"H102","v":6.39},{"$f":"I102","v":"LMB"},"Jeff",5.96,"LMB","Morrie",3.47,"SMB","Mike G",3.83,"LMB","Ron",2.91,"LMB","Kevin",5.4,"LMB"]

{"sheet":"Report","index":10,"n_rows":34,"n_cols":12,"rows_kept":34,"cut":false,"hidden":false,"merged":[[48,0,48,2],[2,10,2,11],[2,4,2,8],[2,0,2,2],[27,5,27,6],[30,5,30,6],[25,5,25,6],[25,7,25,8],[26,5,26,6],[28,5,28,6],[29,5,29,6],[30,7,30,8],[0,0,0,11],[26,7,26,8],[28,7,28,8],[29,7,29,8],[27,7,27,8],[31,7,31,8],[31,5,31,6],[32,5,32,6],[33,5,33,6],[32,7,32,8],[33,7,33,8]]}
["MVBC 2016 Year-To-Date Report"]
[{"$f":"A2:L34","v":0}]
["Individual Standings",null,null,null,"Lunkers",null,null,null,null,null,"Individual Adj'd Total Weight"]
["Name","Position","Points",null,"Lake / River","Name","Weight","Species","Trophy",null,"Name","Adj'd Weight"]
[{"$f":"YTD!E15","v":"Steve D"},{"$f":"YTD!F15","v":1},{"$f":"YTD!G15","v":23},null,{"$f":"YTD!L15","v":"Bantam"},{"$f":"IF(YTD!A103=\"X\",\"N/A\",YTD!A103)","v":"Jason"},{"$f":"YTD!B103","v":4.2},{"$f":"IF(YTD!C103=0,\"N/A\",YTD!C103)","v":"LMB"},{"$f":"IF((H5=\"LMB\")*AND(G5>=6),\"Yes\",IF((H5=\"SMB\")*AND(G5>=4),\"Yes\",\"No\"))","v":"No"},null,{"$f":"YTD!S52","v":"Jeff"},{"$f":"YTD!T52","v":47.080000000000005}]
[{"$f":"YTD!E16","v":"Jeff"},{"$f":"YTD!F16","v":2},{"$f":"YTD!G16","v":25},null,{"$f":"YTD!L16","v":"Mashapaug"},{"$f":"IF(YTD!D103=\"X\",\"N/A\",YTD!D103)","v":"Jason"},{"$f":"YTD!E103","v":4.3899999999999997},{"$f":"IF(YTD!F103=0,\"N/A\",YTD!F103)","v":"LMB"},{"$f":"IF((H6=\"LMB\")*AND(G6>=6),\"Yes\",IF((H6=\"SMB\")*AND(G6>=4),\"Yes\",\"No\"))","v":"No"},null,{"$f":"YTD!S65","v":"Steve D"},{"$f":"YTD!T65","v":46.9}]
[{"$f":"YTD!E17","v":"Jason"},{"$f":"YTD!F17","v":3},{"$f":"YTD!G17","v":29},null,{"$f":"YTD!L17","v":"Coventry"},{"$f":"IF(YTD!G103=\"X\",\"N/A\",YTD!G103)","v":"Steve D"},{"$f":"YTD!H103","v":6.39},{"$f":"IF(YTD!I103=0,\"N/A\",YTD!I103)","v":"LMB"},"Yes",null,{"$f":"YTD!S51","v":"Jason"},{"$f":"YTD!T51","v":38.15}]
[{"$f":"YTD!E18","v":"Scott"},{"$f":"YTD!F18","v":4},{"$f":"YTD!G18","v":34},null,{"$f":"YTD!L18","v":"Beach"},{"$f":"IF(YTD!J103=\"X\",\"N/A\",YTD!J103)","v":"Jeff"},{"$f":"YTD!K103","v":5.96},{"$f":"IF(YTD!L103=0,\"N/A\",YTD!L103)","v":"LMB"},"No",null,{"$f":"YTD!S56","v":"Kevin"},{"$f":"YTD!T56","v":33.19}]
[{"$f":"YTD!E19","v":"Rich B"},{"$f":"YTD!F19","v":5},{"$f":"YTD!G19","v":41},null,{"$f":"YTD!L19","v":"Candlewood"},{"$f":"IF(YTD!M103=\"X\",\"N/A\",YTD!M103)","v":"Morrie"},{"$f":"YTD!N103","v":3.47},{"$f":"IF(YTD!O103=0,\"N/A\",YTD!O103)","v":"SMB"},{"$f":"IF((H9=\"LMB\")*AND(G9>=6),\"Yes\",IF((H9=\"SMB\")*AND(G9>=4),\"Yes\",\"No\"))","v":"No"},null,{"$f":"YTD!S60","v":"Pete"},{"$f":"YTD!T60","v":32.160000000000004}]
[{"$f":"YTD!E20","v":"Pete"},{"$f":"YTD!F20","v":6},{"$f":"YTD!G20","v":42},null,{"$f":"YTD!L20","v":"Winchester"},{"$f":"IF(YTD!P103=\"X\",\"N/A\",YTD!P103)","v":"Mike G"},{"$f":"YTD!Q103","v":3.83},{"$f":"IF(YTD!R103=0,\"N/A\",YTD!R103)","v":"LMB"},{"$f":"IF((H10=\"LMB\")*AND(G10>=6),\"Yes\",IF((H10=\"SMB\")*AND(G10>=4),\"Yes\",\"No\"))","v":"No"},null,{"$f":"YTD!S61","v":"Rich B"},{"$f":"YTD!T61","v":31}]
[{"$f":"YTD!E21","v":"Dean"},{"$f":"YTD!F21","v":7},{"$f":"YTD!G21","v":44},null,{"$f":"YTD!L21","v":"Mansfield"},{"$f":"IF(YTD!S103=\"X\",\"N/A\",YTD!S103)","v":"Ron"},{"$f":"YTD!T103","v":2.91},{"$f":"IF(YTD!U103=0,\"N/A\",YTD!U103)","v":"LMB"},"No",null,{"$f":"YTD!S64","v":"Scott"},{"$f":"YTD!T64","v":29.980000000000004}]
[{"$f":"YTD!E22","v":"Armand"},{"$f":"YTD!F22","v":8},{"$f":"YTD!G22","v":49},null,{"$f":"YTD!L22","v":"Aspinook"},{"$f":"IF(YTD!V103=\"X\",\"N/A\",YTD!V103)","v":"Kevin"},{"$f":"YTD!W103","v":5.4},{"$f":"IF(YTD!X103=0,\"N/A\",YTD!X103)","v":"LMB"},{"$f":"IF((H12=\"LMB\")*AND(G12>=6),\"Yes\",IF((H12=\"SMB\")*AND(G12>=4),\"Yes\",\"No\"))","v":"No"},null,{"$f":"YTD!S49","v":"Dean"},{"$f":"YTD!T49","v":29.100000000000009}]
[{"$f":"YTD!E23","v":"Rich T"},{"$f":"YTD!F23","v":8},{"$f":"YTD!G23","v":49},null,null,null,null,null,null,null,{"$f":"YTD!S62","v":"Rich T"},{"$f":"YTD!T62","v":27.939999999999998}]
[{"$f":"YTD!E24","v":"Tom"},{"$f":"YTD!F24","v":10},{"$f":"YTD!G24","v":51},null,"Statistics",null,null,null,null,null,{"$f":"YTD!S67","v":"Tom"},{"$f":"YTD!T67","v":26.009999999999994}]
[{"$f":"YTD!E25","v":"Kevin"},{"$f":"YTD!F25","v":11},{"$f":"YTD!G25","v":52},null,"Lake / River","Anglers","Fish","Total Wt","Avg Wt",null,{"$f":"YTD!S66","v":"Steve S"},{"$f":"YTD!T66","v":24.95}]
[{"$f":"YTD!E26","v":"Bill"},{"$f":"YTD!F26","v":12},{"$f":"YTD!G26","v":55},null,{"$f":"YTD!L15","v":"Bantam"},{"$f":"Bantam!E30","v":21},{"$f":"Bantam!M30","v":38},{"$f":"Bantam!L30","v":78.37},{"$f":"IF(G16=0,0,H16/G16)","v":2.0623684210526316},null,{"$f":"YTD!S48","v":"Bill"},{"$f":"YTD!T48","v":24.77}]
[{"$f":"YTD!E27","v":"Steve S"},{"$f":"YTD!F27","v":13},{"$f":"YTD!G27","v":61},null,{"$f":"YTD!L16","v":"Mashapaug"},{"$f":"Mashapaug!E30","v":19},{"$f":"Mashapaug!M30","v":82},{"$f":"Mashapaug!L30","v":135.72},1.6551219512195121,null,{"$f":"YTD!S47","v":"Armand"},{"$f":"YTD!T47","v":24.26}]
[{"$f":"YTD!E28","v":"Morrie"},{"$f":"YTD!F28","v":14},{"$f":"YTD!G28","v":65},null,{"$f":"YTD!L17","v":"Coventry"},{"$f":"Coventry!E30","v":16},{"$f":"Coventry!M30","v":35},{"$f":"Coventry!L30","v":48.57},1.3877142857142857,null,{"$f":"YTD!S59","v":"Morrie"},{"$f":"YTD!T59","v":19.62}]
[{"$f":"YTD!E29","v":"Mike M"},{"$f":"YTD!F29","v":15},{"$f":"YTD!G29","v":76},null,{"$f":"YTD!L18","v":"Beach"},{"$f":"Beach!E30","v":19},{"$f":"Beach!M30","v":50},{"$f":"Beach!L30","v":59.93},1.1985999999999999,null,{"$f":"YTD!S57","v":"Mike"},{"$f":"YTD!T57","v":19.384}]
[{"$f":"YTD!E30","v":"Jack"},{"$f":"YTD!F30","v":16},{"$f":"YTD!G30","v":94},null,{"$f":"YTD!L19","v":"Candlewood"},{"$f":"Candlewood!E30","v":17},{"$f":"Candlewood!M30","v":23},{"$f":"Candlewood!L30","v":47.800000000000011},2.0782608695652178,null,{"$f":"YTD!S58","v":"Mike G"},{"$f":"YTD!T58","v":16.869999999999997}]
[{"$f":"YTD!E31","v":"Ron"},{"$f":"YTD!F31","v":16},{"$f":"YTD!G31","v":94},null,{"$f":"YTD!L20","v":"Winchester"},{"$f":"Winchester!E30","v":19},{"$f":"Winchester!M30","v":42},{"$f":"Winchester!L30","v":53.359999999999992},1.2704761904761903,null,{"$f":"YTD!S63","v":"Ron"},{"$f":"YTD!T63","v":16.5}]
[{"$f":"YTD!E32","v":"Mike G"},{"$f":"YTD!F32","v":18},{"$f":"YTD!G32","v":105},null,{"$f":"YTD!L21","v":"Mansfield"},{"$f":"Mansfield!E30","v":21},{"$f":"Mansfield!M30","v":47},{"$f":"Mansfield!L30","v":71.569999999999993},1.5227659574468084,null,{"$f":"YTD!S53","v":"Jim B"},{"$f":"YTD!T53","v":12.84}]
[{"$f":"YTD!E33","v":"Kam"},{"$f":"YTD!F33","v":19},{"$f":"YTD!G33","v":114},null,{"$f":"YTD!L22","v":"Aspinook"},{"$f":"Aspinook!E30","v":18},{"$f":"Aspinook!M30","v":21},{"$f":"Aspinook!L30","v":38.903999999999996},1.8525714285714283,null,{"$f":"YTD!S50","v":"Jack"},{"$f":"YTD!T50","v":12.66}]
[{"$f":"YTD!E34","v":"Joe"},{"$f":"YTD!F34","v":20},{"$f":"YTD!G34","v":119},null,null,null,null,null,null,null,{"$f":"YTD!S55","v":"Kam"},{"$f":"YTD!T55","v":11.3}]
[{"$f":"YTD!E35","v":"Jim B"},{"$f":"YTD!F35","v":21},{"$f":"YTD!G35","v":137},null,"Winning Teams",null,null,null,null,null,{"$f":"YTD!S54","v":"Joe"},{"$f":"YTD!T54","v":7.36}]
[{"$f":"YTD!E36","v":"X"},{"$f":"YTD!F36","v":22},{"$f":"YTD!G36","v":210},null,"Lake / River","Team Number",null,"Total Weight",null,null,{"$f":"YTD!S68","v":"X"},{"$f":"YTD!T68","v":0}]
[{"$f":"YTD!E37","v":"X"},{"$f":"YTD!F37","v":22},{"$f":"YTD!G37","v":210},null,{"$f":"YTD!L15","v":"Bantam"},{"$f":"IF(Teams!N4=20,\"N/A\",Teams!N4)","v":8},null,{"$f":"Teams!O4","v":11.367000000000001},null,null,{"$f":"YTD!S69","v":"X"},{"$f":"YTD!T69","v":0}]
[{"$f":"YTD!E38","v":"X"},{"$f":"YTD!F38","v":22},{"$f":"YTD!G38","v":210},null,{"$f":"YTD!L16","v":"Mashapaug"},{"$f":"IF(Teams!N34=20,\"N/A\",Teams!N34)","v":6},null,{"$f":"Teams!O34","v":18.899999999999999},null,null,{"$f":"YTD!S70","v":"X"},{"$f":"YTD!T70","v":0}]
[{"$f":"YTD!E39","v":"X"},{"$f":"YTD!F39","v":22},{"$f":"YTD!G39","v":210},null,{"$f":"YTD!L17","v":"Coventry"},{"$f":"IF(Teams!N64=20,\"N/A\",Teams!N64)","v":10},null,{"$f":"Teams!O64","v":15.91},null,null,{"$f":"YTD!S71","v":"X"},{"$f":"YTD!T71","v":0}]
[{"$f":"YTD!E40","v":"X"},{"$f":"YTD!F40","v":22},{"$f":"YTD!G40","v":210},null,{"$f":"YTD!L18","v":"Beach"},{"$f":"IF(Teams!N94=20,\"N/A\",Teams!N94)","v":7},null,{"$f":"Teams!O94","v":10.34},null,null,{"$f":"YTD!S72","v":"X"},{"$f":"YTD!T72","v":0}]
[null,null,null,null,{"$f":"YTD!L19","v":"Candlewood"},{"$f":"IF(Teams!AD4=20,\"N/A\",Teams!AD4)","v":8},null,{"$f":"Teams!AE4","v":13.969999999999999}]
[null,null,null,null,{"$f":"YTD!L20","v":"Winchester"},{"$f":"IF(Teams!AD34=20,\"N/A\",Teams!AD34)","v":1},null,{"$f":"Teams!AE34","v":10.9}]
[null,null,null,null,{"$f":"YTD!L21","v":"Mansfield"},{"$f":"IF(Teams!AD64=20,\"N/A\",Teams!AD64)","v":5},null,{"$f":"Teams!AE64","v":15.08}]
[null,null,null,null,{"$f":"YTD!L22","v":"Aspinook"},{"$f":"IF(Teams!AD94=20,\"N/A\",Teams!AD94)","v":1},null,{"$f":"Teams!AE94","v":21.9}]

{"sheet":"Sheet1","index":11,"n_rows":26,"n_cols":8,"rows_kept":26,"cut":false,"hidden":false,"merged":[]}
[]
[]
[]
[]
[]
[null,null,null,null,null,null,null,{"$f":"P15","v":0}]
[null,null,null,null,null,null,null,0]
[null,null,null,null,null,null,null,0]
[null,null,null,null,null,null,null,0]
[null,null,null,null,null,null,null,0]
[null,null,null,null,null,null,null,0]
[null,null,null,null,null,null,null,0]
[null,null,null,null,null,null,null,0]
[null,null,null,null,null,null,null,0]
[null,null,null,null,null,null,null,0]
[null,null,null,null,null,null,null,0]
[null,null,null,null,null,null,null,0]
[null,null,null,null,null,null,null,0]
[null,null,null,null,null,null,null,0]
[null,null,null,null,null,null,null,0]
[null,null,null,null,null,null,null,0]
[null,null,null,null,null,null,null,0]
[null,null,null,null,null,null,null,0]
[null,null,null,null,null,null,null,0]
[null,null,null,null,null,null,null,0]
[null,null,null,null,null,null,null,0]