{"text_format":"1","workbook":"xlsx","n_sheets":12,"sheets":["Moodus","Bantam","Gardner","Candlewood","Twin Lakes","Lillinonah","CT River","Bashan","Teams","YTD","Report","Sheet1"],"not_rendered":{"charts":0,"images":0,"macros":1,"external_links":0,"defined_names":16,"comments":0,"pivot_tables":0},"unopened":[],"bounds":{"document_bytes":16777216,"sheet_cells":100000,"rows_first":2000,"rows_last":500,"rows_between":2000,"halvings":0,"cell_chars":16384,"cell_head_chars":4096},"cells_cut":0,"cells_raw":0,"read":"whole","date_system":"1900"}

{"sheet":"Moodus","index":0,"n_rows":34,"n_cols":17,"rows_kept":34,"cut":false,"hidden":false,"merged":[[1,0,2,0],[0,0,0,16],[30,6,30,7],[30,3,30,5],[30,13,30,14],[30,10,30,12],[31,13,31,14],[32,13,32,14],[33,13,33,14],[33,6,33,7],[31,6,31,7],[32,6,32,7]]}
[{"$f":"YTD!L15","v":"Moodus"}]
[null,"Team","Fish","Member","Show","Non","Number","Number","Number","Lunker","Species","Gross","Total","Net","Points","Non Boater","# Non-"]
[null,"Number","Alone?","Name","Up?","Boater?","of LMB","of SMB","Dead","Weight","LMB/SMB","Weight","Caught","Weight","Awarded","Weight","Boaters"]
[1,5,"N",{"$f":"YTD!P15","v":"Anthony"},"Y",{"$f":"YTD!Q15","v":"Y"},1,null,null,null,null,0.88,{"$f":"G4+H4","v":1},{"$f":"L4-(I4*0.2)","v":0.88},{"$f":"IF($E4=\"N\",35,IF($M4=0,30,RANK($N4,$N$4:$N$29,0)))","v":18},{"$f":"IF(F4=\"Y\",N4,0)","v":0.88},{"$f":"IF(E4=\"N\",0,(IF(F4=\"N\",0,1)))","v":1}]
[2,9,"N",{"$f":"YTD!P16","v":"Armand"},"Y",{"$f":"YTD!Q16","v":"N"},2,null,null,null,null,1.98,2,1.98,{"$f":"IF($E5=\"N\",35,IF($M5=0,30,RANK($N5,$N$4:$N$29,0)))","v":7},0,{"$f":"IF(E5=\"N\",0,(IF(F5=\"N\",0,1)))","v":0}]
[3,2,"N",{"$f":"YTD!P17","v":"Dean"},"Y",{"$f":"YTD!Q17","v":"N"},3,null,null,5.84,"LMB",8.4,{"$f":"G6+H6","v":3},{"$f":"L6-(I6*0.2)","v":8.4},1,{"$f":"IF(F6=\"Y\",N6,0)","v":0},0]
[4,6,"N",{"$f":"YTD!P18","v":"Jack"},"Y",{"$f":"YTD!Q18","v":"Y"},2,null,null,null,null,1.75,2,1.75,8,1.75,1]
[5,8,"N",{"$f":"YTD!P19","v":"Jason"},"Y",{"$f":"YTD!Q19","v":"N"},0,null,null,null,null,0,{"$f":"G8+H8","v":0},{"$f":"L8-(I8*0.2)","v":0},30,{"$f":"IF(F8=\"Y\",N8,0)","v":0},0]
[6,2,"N",{"$f":"YTD!P20","v":"Jim B"},"Y",{"$f":"YTD!Q20","v":"Y"},1,null,null,null,null,1.07,1,1.07,13,1.07,1]
[7,1,"N",{"$f":"YTD!P21","v":"Kam"},"Y",{"$f":"YTD!Q21","v":"Y"},1,null,null,null,null,1.01,1,1.01,15,1.01,1]
[8,4,"N",{"$f":"YTD!P22","v":"Kevin"},"Y",{"$f":"YTD!Q22","v":"N"},5,null,null,null,null,5.21,{"$f":"G11+H11","v":5},{"$f":"L11-(I11*0.2)","v":5.21},2,{"$f":"IF(F11=\"Y\",N11,0)","v":0},0]
[9,4,"N",{"$f":"YTD!P23","v":"Mike M"},"Y",{"$f":"YTD!Q23","v":"Y"},1,null,null,null,null,0.94,1,0.94,16,0.94,1]
[10,10,"N",{"$f":"YTD!P24","v":"Mike G"},"Y",{"$f":"YTD!Q24","v":"Y"},3,null,null,null,null,3.15,3,3.15,5,3.15,1]
[11,10,"N",{"$f":"YTD!P25","v":"Morrie"},"Y",{"$f":"YTD!Q25","v":"N"},2,null,null,null,null,1.71,2,1.71,9,0,0]
[12,8,"N",{"$f":"YTD!P26","v":"Peter"},"Y",{"$f":"YTD!Q26","v":"Y"},4,null,null,null,null,3.97,4,3.97,4,3.97,1]
[13,7,"N",{"$f":"YTD!P27","v":"Rich B"},"Y","Y",0,null,null,null,null,0,0,0,30,0,1]
[14,3,"N",{"$f":"YTD!P28","v":"Rich T"},"Y",{"$f":"YTD!Q28","v":"Y"},3,null,null,null,null,2.77,3,2.77,6,2.77,1]
[15,3,"N",{"$f":"YTD!P29","v":"Ron"},"Y",{"$f":"YTD!Q29","v":"N"},1,null,null,null,null,1.1000000000000001,{"$f":"G18+H18","v":1},{"$f":"L18-(I18*0.2)","v":1.1000000000000001},12,0,0]
[16,9,"N",{"$f":"YTD!P30","v":"Ryan"},"Y",{"$f":"YTD!Q30","v":"Y"},1,null,null,null,null,1.21,1,1.21,10,1.21,1]
[17,7,"N",{"$f":"YTD!P31","v":"Scott"},"Y",{"$f":"YTD!Q31","v":"N"},1,null,null,null,null,0.91,{"$f":"G20+H20","v":1},{"$f":"L20-(I20*0.2)","v":0.91},17,{"$f":"IF(F20=\"Y\",N20,0)","v":0},0]
[18,1,"N",{"$f":"YTD!P32","v":"Steve D"},"Y",{"$f":"YTD!Q32","v":"N"},5,null,null,null,null,4.96,5,4.96,3,0,0]
[19,5,"N",{"$f":"YTD!P33","v":"Steve S"},"Y",{"$f":"YTD!Q33","v":"N"},1,null,null,null,null,1.1499999999999999,1,1.1499999999999999,11,0,0]
[20,6,"N",{"$f":"YTD!P34","v":"Tom "},"Y",{"$f":"YTD!Q34","v":"N"},1,null,null,null,null,1.04,{"$f":"G23+H23","v":1},{"$f":"L23-(I23*0.2)","v":1.04},14,0,0]
[21,null,"N",{"$f":"YTD!P35","v":"X"},"N",{"$f":"YTD!Q35","v":"N"},null,null,null,null,null,null,0,0,35,0,0]
[22,null,"N",{"$f":"YTD!P36","v":"X"},"N",{"$f":"YTD!Q36","v":"N"},null,null,null,null,null,null,0,0,35,0,0]
[23,null,"N",{"$f":"YTD!P37","v":"X"},"N",{"$f":"YTD!Q37","v":"N"},null,null,null,null,null,null,0,0,35,0,0]
[24,null,"N",{"$f":"YTD!P38","v":"X"},"N",{"$f":"YTD!Q38","v":"N"},null,null,null,null,null,null,0,0,35,0,0]
[25,null,"N",{"$f":"YTD!P39","v":"X"},"N",{"$f":"YTD!Q39","v":"N"},null,null,null,null,null,null,{"$f":"G28+H28","v":0},{"$f":"L28-(I28*0.2)","v":0},35,{"$f":"IF(F28=\"Y\",N28,0)","v":0},{"$f":"IF(E28=\"N\",0,(IF(F28=\"N\",0,1)))","v":0}]
[26,null,"N",{"$f":"YTD!P40","v":"X"},"N",{"$f":"YTD!Q40","v":"N"},null,null,null,null,null,null,{"$f":"G29+H29","v":0},{"$f":"L29-(I29*0.2)","v":0},35,{"$f":"IF(F29=\"Y\",N29,0)","v":0},{"$f":"IF(E29=\"N\",0,(IF(F29=\"N\",0,1)))","v":0}]
[null,null,null,"Totals",{"$f":"COUNTIF(E4:E29,\"Y\")","v":20},null,{"$f":"SUM(G4:G29)","v":38},{"$f":"SUM(H4:H29)","v":0},{"$f":"SUM(I4:I29)","v":0},{"$f":"MAX(J4:J29)","v":5.84},null,{"$f":"SUM(L4:L29)","v":43.21},{"$f":"SUM(M4:M29)","v":38},{"$f":"SUM(N4:N29)","v":43.21},null,{"$f":"SUM(P4:P29)","v":16.75},{"$f":"SUM(Q4:Q29)","v":10}]
[null,"Place","Team #","Partners",null,null,"Total Weight",null,"Place","Team #","Partners",null,null,"Total Weight",null,"NB Avg",{"$f":"IF(Q30=0,\"No Data\",P30/Q30)","v":1.675}]
[null,"1st",{"$f":"Teams!N4","v":2},{"$f":"VLOOKUP($C32,$B$4:$D$29,3,0)","v":"Dean"},"&",{"$f":"IF($B$4:$B$29=20,\"#N/A\",IF(COUNTIF($B$4:$B$29,$C32)=1,\"Alone\",LOOKUP(2,1/($B$4:$B$29=$C32),$D$4:$D$29)))","v":"Jim B"},{"$f":"Teams!O4","v":9.4700000000000006},null,"4th",{"$f":"Teams!N7","v":10},{"$f":"VLOOKUP($J32,$B$4:$D$29,3,0)","v":"Mike G"},"&",{"$f":"IF($B$4:$B$29=20,\"#N/A\",IF(COUNTIF($B$4:$B$29,$J32)=1,\"Alone\",LOOKUP(2,1/($B$4:$B$29=$J32),$D$4:$D$29)))","v":"Morrie"},{"$f":"Teams!O7","v":4.8599999999999994}]
[null,"2nd",{"$f":"Teams!N5","v":4},{"$f":"VLOOKUP($C33,$B$4:$D$29,3,0)","v":"Kevin"},"&",{"$f":"IF($B$4:$B$29=20,\"#N/A\",IF(COUNTIF($B$4:$B$29,$C33)=1,\"Alone\",LOOKUP(2,1/($B$4:$B$29=$C33),$D$4:$D$29)))","v":"Mike M"},{"$f":"Teams!O5","v":6.15},null,"5th",{"$f":"Teams!N8","v":8},{"$f":"VLOOKUP($J33,$B$4:$D$29,3,0)","v":"Jason"},"&",{"$f":"IF($B$4:$B$29=20,\"#N/A\",IF(COUNTIF($B$4:$B$29,$J33)=1,\"Alone\",LOOKUP(2,1/($B$4:$B$29=$J33),$D$4:$D$29)))","v":"Peter"},{"$f":"Teams!O8","v":3.91}]
[null,"3rd",{"$f":"Teams!N6","v":1},{"$f":"VLOOKUP($C34,$B$4:$D$29,3,0)","v":"Kam"},"&",{"$f":"IF($B$4:$B$29=20,\"#N/A\",IF(COUNTIF($B$4:$B$29,$C34)=1,\"Alone\",LOOKUP(2,1/($B$4:$B$29=$C34),$D$4:$D$29)))","v":"Steve D"},{"$f":"Teams!O6","v":5.97},null,"6th",{"$f":"Teams!N9","v":3},{"$f":"VLOOKUP($J34,$B$4:$D$29,3,0)","v":"Rich T"},"&",{"$f":"IF($B$4:$B$29=20,\"#N/A\",IF(COUNTIF($B$4:$B$29,$J34)=1,\"Alone\",LOOKUP(2,1/($B$4:$B$29=$J34),$D$4:$D$29)))","v":"Ron"},{"$f":"Teams!O9","v":3.87}]

{"sheet":"Bantam","index":1,"n_rows":34,"n_cols":17,"rows_kept":34,"cut":false,"hidden":false,"merged":[[0,0,0,16],[32,6,32,7],[32,13,32,14],[30,6,30,7],[31,6,31,7],[30,13,30,14],[31,13,31,14],[30,3,30,5],[30,10,30,12],[33,6,33,7],[33,13,33,14],[1,0,2,0]]}
[{"$f":"YTD!L16","v":"Bantam"}]
[null,"Team","Fish","Member","Show","Non","Number","Number","Number","Lunker","Species","Gross","Total","Net","Points","Non Boater","# Non-"]
[null,"Number","Alone?","Name","Up?","Boater?","of LMB","of SMB","Dead","Weight","LMB/SMB","Weight","Caught","Weight","Awarded","Weight","Boaters"]
[1,1,"N",{"$f":"YTD!P15","v":"Anthony"},"Y",{"$f":"YTD!Q15","v":"Y"},1,1,null,null,null,3.04,{"$f":"G4+H4","v":2},{"$f":"L4-(I4*0.2)","v":3.04},{"$f":"IF($E4=\"N\",35,IF($M4=0,30,RANK($N4,$N$4:$N$29,0)))","v":8},{"$f":"IF(F4=\"Y\",N4,0)","v":3.04},{"$f":"IF(E4=\"N\",0,(IF(F4=\"N\",0,1)))","v":1}]
[2,6,"N",{"$f":"YTD!P16","v":"Armand"},"Y",{"$f":"YTD!Q16","v":"N"},4,1,null,null,null,11.29,5,11.29,{"$f":"IF($E5=\"N\",35,IF($M5=0,30,RANK($N5,$N$4:$N$29,0)))","v":4},0,{"$f":"IF(E5=\"N\",0,(IF(F5=\"N\",0,1)))","v":0}]
[3,1,"N",{"$f":"YTD!P17","v":"Dean"},"Y",{"$f":"YTD!Q17","v":"N"},4,null,null,null,null,12.7,{"$f":"G6+H6","v":4},{"$f":"L6-(I6*0.2)","v":12.7},1,{"$f":"IF(F6=\"Y\",N6,0)","v":0},0]
[4,6,"N",{"$f":"YTD!P18","v":"Jack"},"Y",{"$f":"YTD!Q18","v":"Y"},0,null,null,null,null,null,0,0,30,0,1]
[5,7,"N",{"$f":"YTD!P19","v":"Jason"},"Y",{"$f":"YTD!Q19","v":"N"},2,1,null,null,null,4.95,{"$f":"G8+H8","v":3},{"$f":"L8-(I8*0.2)","v":4.95},5,{"$f":"IF(F8=\"Y\",N8,0)","v":0},0]
[6,null,"N",{"$f":"YTD!P20","v":"Jim B"},"N",{"$f":"YTD!Q20","v":"Y"},null,null,null,null,null,null,0,0,35,0,0]
[7,null,"N",{"$f":"YTD!P21","v":"Kam"},"N",{"$f":"YTD!Q21","v":"Y"},null,null,null,null,null,null,0,0,35,0,0]
[8,3,"N",{"$f":"YTD!P22","v":"Kevin"},"Y",{"$f":"YTD!Q22","v":"N"},4,1,null,5.73,"LMB",11.38,{"$f":"G11+H11","v":5},{"$f":"L11-(I11*0.2)","v":11.38},3,{"$f":"IF(F11=\"Y\",N11,0)","v":0},0]
[9,8,"N",{"$f":"YTD!P23","v":"Mike M"},"Y",{"$f":"YTD!Q23","v":"Y"},0,null,null,null,null,null,0,0,30,0,1]
[10,null,"N",{"$f":"YTD!P24","v":"Mike G"},"N",{"$f":"YTD!Q24","v":"Y"},null,null,null,null,null,null,0,0,35,0,0]
[11,5,"N",{"$f":"YTD!P25","v":"Morrie"},"Y","Y",0,null,null,null,null,null,0,0,30,0,1]
[12,4,"N",{"$f":"YTD!P26","v":"Peter"},"Y",{"$f":"YTD!Q26","v":"Y"},2,null,null,null,null,2.7,2,2.7,9,2.7,1]
[13,8,"N",{"$f":"YTD!P27","v":"Rich B"},"Y",{"$f":"YTD!Q27","v":"N"},3,null,null,null,null,4.5599999999999996,3,4.5599999999999996,7,0,0]
[14,7,"N",{"$f":"YTD!P28","v":"Rich T"},"Y",{"$f":"YTD!Q28","v":"Y"},1,null,null,null,null,1.58,1,1.58,10,1.58,1]
[15,5,"N",{"$f":"YTD!P29","v":"Ron"},"Y",{"$f":"YTD!Q29","v":"N"},0,null,null,null,null,null,{"$f":"G18+H18","v":0},{"$f":"L18-(I18*0.2)","v":0},30,0,0]
[16,3,"N",{"$f":"YTD!P30","v":"Ryan"},"Y",{"$f":"YTD!Q30","v":"Y"},0,null,null,null,null,null,0,0,30,0,1]
[17,2,"N",{"$f":"YTD!P31","v":"Scott"},"Y","Y",2,null,null,null,null,4.88,{"$f":"G20+H20","v":2},{"$f":"L20-(I20*0.2)","v":4.88},6,{"$f":"IF(F20=\"Y\",N20,0)","v":4.88},1]
[18,2,"N",{"$f":"YTD!P32","v":"Steve D"},"Y",{"$f":"YTD!Q32","v":"N"},3,2,null,null,null,11.77,5,11.77,2,0,0]
[19,9,"Y",{"$f":"YTD!P33","v":"Steve S"},"Y",{"$f":"YTD!Q33","v":"N"},1,null,null,null,null,1.34,1,1.34,11,0,0]
[20,4,"N",{"$f":"YTD!P34","v":"Tom "},"Y",{"$f":"YTD!Q34","v":"N"},null,1,null,null,null,1.05,{"$f":"G23+H23","v":1},{"$f":"L23-(I23*0.2)","v":1.05},12,0,0]
[21,null,"N",{"$f":"YTD!P35","v":"X"},"N",{"$f":"YTD!Q35","v":"N"},null,null,null,null,null,null,0,0,35,0,0]
[22,null,"N",{"$f":"YTD!P36","v":"X"},"N",{"$f":"YTD!Q36","v":"N"},null,null,null,null,null,null,0,0,35,0,0]
[23,null,"N",{"$f":"YTD!P37","v":"X"},"N",{"$f":"YTD!Q37","v":"N"},null,null,null,null,null,null,0,0,35,0,0]
[24,null,"N",{"$f":"YTD!P38","v":"X"},"N",{"$f":"YTD!Q38","v":"N"},null,null,null,null,null,null,0,0,35,0,0]
[25,null,"N",{"$f":"YTD!P39","v":"X"},"N",{"$f":"YTD!Q39","v":"N"},null,null,null,null,null,null,{"$f":"G28+H28","v":0},{"$f":"L28-(I28*0.2)","v":0},35,{"$f":"IF(F28=\"Y\",N28,0)","v":0},{"$f":"IF(E28=\"N\",0,(IF(F28=\"N\",0,1)))","v":0}]
[26,null,"N",{"$f":"YTD!P40","v":"X"},"N",{"$f":"YTD!Q40","v":"N"},null,null,null,null,null,null,{"$f":"G29+H29","v":0},{"$f":"L29-(I29*0.2)","v":0},35,{"$f":"IF(F29=\"Y\",N29,0)","v":0},{"$f":"IF(E29=\"N\",0,(IF(F29=\"N\",0,1)))","v":0}]
[null,null,null,"Totals",{"$f":"COUNTIF(E4:E29,\"Y\")","v":17},null,{"$f":"SUM(G4:G29)","v":27},{"$f":"SUM(H4:H29)","v":7},{"$f":"SUM(I4:I29)","v":0},{"$f":"MAX(J4:J29)","v":5.73},"LMB",{"$f":"SUM(L4:L29)","v":71.240000000000009},{"$f":"SUM(M4:M29)","v":34},{"$f":"SUM(N4:N29)","v":71.240000000000009},null,{"$f":"SUM(P4:P29)","v":12.2},{"$f":"SUM(Q4:Q29)","v":8}]
[null,"Place","Team #","Partners",null,null,"Total Weight",null,"Place","Team #","Partners",null,null,"Total Weight",null,"NB Avg",{"$f":"IF(Q30=0,\"No Data\",P30/Q30)","v":1.5249999999999999}]
[null,"1st",{"$f":"Teams!N34","v":2},{"$f":"VLOOKUP($C32,$B$4:$D$29,3,0)","v":"Scott"},"&",{"$f":"IF($B$4:$B$29=20,\"#N/A\",IF(COUNTIF($B$4:$B$29,$C32)=1,\"Alone\",LOOKUP(2,1/($B$4:$B$29=$C32),$D$4:$D$29)))","v":"Steve D"},{"$f":"Teams!O34","v":16.649999999999999},null,"4th",{"$f":"Teams!N37","v":6},{"$f":"VLOOKUP($J32,$B$4:$D$29,3,0)","v":"Armand"},"&",{"$f":"IF($B$4:$B$29=20,\"#N/A\",IF(COUNTIF($B$4:$B$29,$J32)=1,\"Alone\",LOOKUP(2,1/($B$4:$B$29=$J32),$D$4:$D$29)))","v":"Jack"},{"$f":"Teams!O37","v":11.29}]
[null,"2nd",{"$f":"Teams!N35","v":1},{"$f":"VLOOKUP($C33,$B$4:$D$29,3,0)","v":"Anthony"},"&",{"$f":"IF($B$4:$B$29=20,\"#N/A\",IF(COUNTIF($B$4:$B$29,$C33)=1,\"Alone\",LOOKUP(2,1/($B$4:$B$29=$C33),$D$4:$D$29)))","v":"Dean"},{"$f":"Teams!O35","v":15.739999999999998},null,"5th",{"$f":"Teams!N38","v":7},{"$f":"VLOOKUP($J33,$B$4:$D$29,3,0)","v":"Jason"},"&",{"$f":"IF($B$4:$B$29=20,\"#N/A\",IF(COUNTIF($B$4:$B$29,$J33)=1,\"Alone\",LOOKUP(2,1/($B$4:$B$29=$J33),$D$4:$D$29)))","v":"Rich T"},{"$f":"Teams!O38","v":6.53}]
[null,"3rd",{"$f":"Teams!N36","v":3},{"$f":"VLOOKUP($C34,$B$4:$D$29,3,0)","v":"Kevin"},"&",{"$f":"IF($B$4:$B$29=20,\"#N/A\",IF(COUNTIF($B$4:$B$29,$C34)=1,\"Alone\",LOOKUP(2,1/($B$4:$B$29=$C34),$D$4:$D$29)))","v":"Ryan"},{"$f":"Teams!O36","v":11.38},null,"6th",{"$f":"Teams!N39","v":8},{"$f":"VLOOKUP($J34,$B$4:$D$29,3,0)","v":"Mike M"},"&",{"$f":"IF($B$4:$B$29=20,\"#N/A\",IF(COUNTIF($B$4:$B$29,$J34)=1,\"Alone\",LOOKUP(2,1/($B$4:$B$29=$J34),$D$4:$D$29)))","v":"Rich B"},{"$f":"Teams!O39","v":4.5599999999999996}]

{"sheet":"Gardner","index":2,"n_rows":34,"n_cols":17,"rows_kept":34,"cut":false,"hidden":false,"merged":[[0,0,0,16],[30,3,30,5],[30,6,30,7],[30,10,30,12],[1,0,2,0],[33,6,33,7],[33,13,33,14],[30,13,30,14],[31,6,31,7],[31,13,31,14],[32,6,32,7],[32,13,32,14]]}
[{"$f":"YTD!L17","v":"Gardner"}]
[null,"Team","Fish","Member","Show","Non","Number","Number","Number","Lunker","Species","Gross","Total","Net","Points","Non Boater","# Non-"]
[null,"Number","Alone?","Name","Up?","Boater?","of LMB","of SMB","Dead","Weight","LMB/SMB","Weight","Caught","Weight","Awarded","Weight","Boaters"]
[1,8,"N",{"$f":"YTD!P15","v":"Anthony"},"Y",{"$f":"YTD!Q15","v":"Y"},5,null,null,null,null,9.09,{"$f":"G4+H4","v":5},{"$f":"L4-(I4*0.2)","v":9.09},{"$f":"IF($E4=\"N\",35,IF($M4=0,30,RANK($N4,$N$4:$N$29,0)))","v":1},{"$f":"IF(F4=\"Y\",N4,0)","v":9.09},{"$f":"IF(E4=\"N\",0,(IF(F4=\"N\",0,1)))","v":1}]
[2,2,"N",{"$f":"YTD!P16","v":"Armand"},"Y",{"$f":"YTD!Q16","v":"N"},3,null,null,null,null,4.2699999999999996,3,4.2699999999999996,{"$f":"IF($E5=\"N\",35,IF($M5=0,30,RANK($N5,$N$4:$N$29,0)))","v":15},0,{"$f":"IF(E5=\"N\",0,(IF(F5=\"N\",0,1)))","v":0}]
[3,6,"Y",{"$f":"YTD!P17","v":"Dean"},"Y",{"$f":"YTD!Q17","v":"N"},5,null,null,null,null,7.01,{"$f":"G6+H6","v":5},{"$f":"L6-(I6*0.2)","v":7.01},8,{"$f":"IF(F6=\"Y\",N6,0)","v":0},0]
[4,7,"N",{"$f":"YTD!P18","v":"Jack"},"Y",{"$f":"YTD!Q18","v":"Y"},4,null,null,null,null,4.9400000000000004,4,4.9400000000000004,14,4.9400000000000004,1]
[5,9,"N",{"$f":"YTD!P19","v":"Jason"},"Y","Y",4,1,null,null,null,7.56,{"$f":"G8+H8","v":5},{"$f":"L8-(I8*0.2)","v":7.56},5,{"$f":"IF(F8=\"Y\",N8,0)","v":7.56},1]
[6,null,"N",{"$f":"YTD!P20","v":"Jim B"},"N",{"$f":"YTD!Q20","v":"Y"},null,null,null,null,null,null,0,0,35,0,0]
[7,null,"N",{"$f":"YTD!P21","v":"Kam"},"N",{"$f":"YTD!Q21","v":"Y"},null,null,null,null,null,null,0,0,35,0,0]
[8,7,"N",{"$f":"YTD!P22","v":"Kevin"},"Y",{"$f":"YTD!Q22","v":"N"},4,null,null,null,null,5.89,{"$f":"G11+H11","v":4},{"$f":"L11-(I11*0.2)","v":5.89},13,{"$f":"IF(F11=\"Y\",N11,0)","v":0},0]
[9,1,"N",{"$f":"YTD!P23","v":"Mike M"},"Y",{"$f":"YTD!Q23","v":"Y"},1,null,null,null,null,0.77,1,0.77,17,0.77,1]
[10,4,"N",{"$f":"YTD!P24","v":"Mike G"},"Y",{"$f":"YTD!Q24","v":"Y"},5,null,null,null,null,6.75,5,6.75,9,6.75,1]
[11,null,"N",{"$f":"YTD!P25","v":"Morrie"},"N",{"$f":"YTD!Q25","v":"N"},null,null,null,null,null,null,0,0,35,0,0]
[12,2,"N",{"$f":"YTD!P26","v":"Peter"},"Y",{"$f":"YTD!Q26","v":"Y"},5,null,null,null,null,6.48,5,6.48,11,6.48,1]
[13,3,"N",{"$f":"YTD!P27","v":"Rich B"},"Y",{"$f":"YTD!Q27","v":"N"},5,null,1,null,null,7.96,5,7.76,4,0,0]
[14,5,"N",{"$f":"YTD!P28","v":"Rich T"},"Y",{"$f":"YTD!Q28","v":"Y"},4,1,1,3.85,"LMB",8.9499999999999993,5,8.75,2,8.75,1]
[15,4,"N",{"$f":"YTD!P29","v":"Ron"},"Y",{"$f":"YTD!Q29","v":"N"},5,null,null,null,null,8.27,{"$f":"G18+H18","v":5},{"$f":"L18-(I18*0.2)","v":8.27},3,0,0]
[16,3,"N",{"$f":"YTD!P30","v":"Ryan"},"Y",{"$f":"YTD!Q30","v":"Y"},4,null,null,null,null,6.48,4,6.48,11,6.48,1]
[17,1,"N",{"$f":"YTD!P31","v":"Scott"},"Y",{"$f":"YTD!Q31","v":"N"},2,null,null,null,null,4.13,{"$f":"G20+H20","v":2},{"$f":"L20-(I20*0.2)","v":4.13},16,{"$f":"IF(F20=\"Y\",N20,0)","v":0},0]
[18,9,"N",{"$f":"YTD!P32","v":"Steve D"},"Y",{"$f":"YTD!Q32","v":"N"},3,2,1,null,null,7.49,5,7.29,6,0,0]
[19,8,"N",{"$f":"YTD!P33","v":"Steve S"},"Y",{"$f":"YTD!Q33","v":"N"},5,null,null,null,null,6.6,5,6.6,10,0,0]
[20,5,"N",{"$f":"YTD!P34","v":"Tom "},"Y",{"$f":"YTD!Q34","v":"N"},5,null,null,null,null,7.24,{"$f":"G23+H23","v":5},{"$f":"L23-(I23*0.2)","v":7.24},7,0,0]
[21,null,"N",{"$f":"YTD!P35","v":"X"},"N",{"$f":"YTD!Q35","v":"N"},null,null,null,null,null,null,0,0,35,0,0]
[22,null,"N",{"$f":"YTD!P36","v":"X"},"N",{"$f":"YTD!Q36","v":"N"},null,null,null,null,null,null,0,0,35,0,0]
[23,null,"N",{"$f":"YTD!P37","v":"X"},"N",{"$f":"YTD!Q37","v":"N"},null,null,null,null,null,null,0,0,35,0,0]
[24,null,"N",{"$f":"YTD!P38","v":"X"},"N",{"$f":"YTD!Q38","v":"N"},null,null,null,null,null,null,0,0,35,0,0]
[25,null,"N",{"$f":"YTD!P39","v":"X"},"N",{"$f":"YTD!Q39","v":"N"},null,null,null,null,null,null,{"$f":"G28+H28","v":0},{"$f":"L28-(I28*0.2)","v":0},35,{"$f":"IF(F28=\"Y\",N28,0)","v":0},{"$f":"IF(E28=\"N\",0,(IF(F28=\"N\",0,1)))","v":0}]
[26,null,"N",{"$f":"YTD!P40","v":"X"},"N",{"$f":"YTD!Q40","v":"N"},null,null,null,null,null,null,{"$f":"G29+H29","v":0},{"$f":"L29-(I29*0.2)","v":0},35,{"$f":"IF(F29=\"Y\",N29,0)","v":0},{"$f":"IF(E29=\"N\",0,(IF(F29=\"N\",0,1)))","v":0}]
[null,null,null,"Totals",{"$f":"COUNTIF(E4:E29,\"Y\")","v":17},null,{"$f":"SUM(G4:G29)","v":69},{"$f":"SUM(H4:H29)","v":4},{"$f":"SUM(I4:I29)","v":3},{"$f":"MAX(J4:J29)","v":3.85},null,{"$f":"SUM(L4:L29)","v":109.87999999999998},{"$f":"SUM(M4:M29)","v":73},{"$f":"SUM(N4:N29)","v":109.28},null,{"$f":"SUM(P4:P29)","v":50.820000000000007},{"$f":"SUM(Q4:Q29)","v":8}]
[null,"Place","Team #","Partners",null,null,"Total Weight",null,"Place","Team #","Partners",null,null,"Total Weight",null,"NB Avg",{"$f":"IF(Q30=0,\"No Data\",P30/Q30)","v":6.3525000000000009}]
[null,"1st",{"$f":"Teams!N64","v":5},{"$f":"VLOOKUP($C32,$B$4:$D$29,3,0)","v":"Rich T"},"&",{"$f":"IF($B$4:$B$29=20,\"#N/A\",IF(COUNTIF($B$4:$B$29,$C32)=1,\"Alone\",LOOKUP(2,1/($B$4:$B$29=$C32),$D$4:$D$29)))","v":"Tom "},{"$f":"Teams!O64","v":15.99},null,"4th",{"$f":"Teams!N67","v":9},{"$f":"VLOOKUP($J32,$B$4:$D$29,3,0)","v":"Jason"},"&",{"$f":"IF($B$4:$B$29=20,\"#N/A\",IF(COUNTIF($B$4:$B$29,$J32)=1,\"Alone\",LOOKUP(2,1/($B$4:$B$29=$J32),$D$4:$D$29)))","v":"Steve D"},{"$f":"Teams!O67","v":14.85}]
[null,"2nd",{"$f":"Teams!N65","v":8},{"$f":"VLOOKUP($C33,$B$4:$D$29,3,0)","v":"Anthony"},"&",{"$f":"IF($B$4:$B$29=20,\"#N/A\",IF(COUNTIF($B$4:$B$29,$C33)=1,\"Alone\",LOOKUP(2,1/($B$4:$B$29=$C33),$D$4:$D$29)))","v":"Steve S"},{"$f":"Teams!O65","v":15.69},null,"5th",{"$f":"Teams!N68","v":3},{"$f":"VLOOKUP($J33,$B$4:$D$29,3,0)","v":"Rich B"},"&",{"$f":"IF($B$4:$B$29=20,\"#N/A\",IF(COUNTIF($B$4:$B$29,$J33)=1,\"Alone\",LOOKUP(2,1/($B$4:$B$29=$J33),$D$4:$D$29)))","v":"Ryan"},{"$f":"Teams!O68","v":14.24}]
[null,"3rd",{"$f":"Teams!N66","v":4},{"$f":"VLOOKUP($C34,$B$4:$D$29,3,0)","v":"Mike G"},"&",{"$f":"IF($B$4:$B$29=20,\"#N/A\",IF(COUNTIF($B$4:$B$29,$C34)=1,\"Alone\",LOOKUP(2,1/($B$4:$B$29=$C34),$D$4:$D$29)))","v":"Ron"},{"$f":"Teams!O66","v":15.02},null,"6th",{"$f":"Teams!N69","v":6},{"$f":"VLOOKUP($J34,$B$4:$D$29,3,0)","v":"Dean"},"&",{"$f":"IF($B$4:$B$29=20,\"#N/A\",IF(COUNTIF($B$4:$B$29,$J34)=1,\"Alone\",LOOKUP(2,1/($B$4:$B$29=$J34),$D$4:$D$29)))","v":"Alone"},{"$f":"Teams!O69","v":13.362500000000001}]

{"sheet":"Candlewood","index":3,"n_rows":34,"n_cols":17,"rows_kept":34,"cut":false,"hidden":false,"merged":[[0,0,0,16],[30,3,30,5],[30,6,30,7],[30,10,30,12],[1,0,2,0],[33,6,33,7],[33,13,33,14],[30,13,30,14],[31,6,31,7],[31,13,31,14],[32,6,32,7],[32,13,32,14]]}
[{"$f":"YTD!L18","v":"Candlewood"}]
[null,"Team","Fish","Member","Show","Non","Number","Number","Number","Lunker","Species","Gross","Total","Net","Points","Non Boater","# Non-"]
[null,"Number","Alone?","Name","Up?","Boater?","of LMB","of SMB","Dead","Weight","LMB/SMB","Weight","Caught","Weight","Awarded","Weight","Boaters"]
[1,8,"N",{"$f":"YTD!P15","v":"Anthony"},"Y",{"$f":"YTD!Q15","v":"Y"},0,null,null,null,null,null,{"$f":"G4+H4","v":0},{"$f":"L4-(I4*0.2)","v":0},{"$f":"IF($E4=\"N\",35,IF($M4=0,30,RANK($N4,$N$4:$N$29,0)))","v":30},{"$f":"IF(F4=\"Y\",N4,0)","v":0},{"$f":"IF(E4=\"N\",0,(IF(F4=\"N\",0,1)))","v":1}]
[2,4,"N",{"$f":"YTD!P16","v":"Armand"},"Y",{"$f":"YTD!Q16","v":"N"},1,null,null,null,null,1.68,1,1.68,{"$f":"IF($E5=\"N\",35,IF($M5=0,30,RANK($N5,$N$4:$N$29,0)))","v":13},0,{"$f":"IF(E5=\"N\",0,(IF(F5=\"N\",0,1)))","v":0}]
[3,2,"N",{"$f":"YTD!P17","v":"Dean"},"Y",{"$f":"YTD!Q17","v":"N"},2,null,null,null,null,5.0199999999999996,{"$f":"G6+H6","v":2},{"$f":"L6-(I6*0.2)","v":5.0199999999999996},5,{"$f":"IF(F6=\"Y\",N6,0)","v":0},0]
[4,1,"N",{"$f":"YTD!P18","v":"Jack"},"Y",{"$f":"YTD!Q18","v":"Y"},1,1,null,null,null,3.46,2,3.46,8,3.46,1]
[5,3,"N",{"$f":"YTD!P19","v":"Jason"},"Y",{"$f":"YTD!Q19","v":"N"},1,2,null,null,null,6.32,{"$f":"G8+H8","v":3},{"$f":"L8-(I8*0.2)","v":6.32},3,{"$f":"IF(F8=\"Y\",N8,0)","v":0},0]
[6,5,"N",{"$f":"YTD!P20","v":"Jim B"},"Y",{"$f":"YTD!Q20","v":"Y"},1,null,null,null,null,2.77,1,2.77,11,2.77,1]
[7,null,"N",{"$f":"YTD!P21","v":"Kam"},"N",{"$f":"YTD!Q21","v":"Y"},null,null,null,null,null,null,0,0,35,0,0]
[8,9,"N",{"$f":"YTD!P22","v":"Kevin"},"Y",{"$f":"YTD!Q22","v":"N"},2,2,null,null,null,5.94,{"$f":"G11+H11","v":4},{"$f":"L11-(I11*0.2)","v":5.94},4,{"$f":"IF(F11=\"Y\",N11,0)","v":0},0]
[9,2,"N",{"$f":"YTD!P23","v":"Mike M"},"Y",{"$f":"YTD!Q23","v":"Y"},1,null,null,4.03,"LMB",4.03,1,4.03,6,4.03,1]
[10,3,"N",{"$f":"YTD!P24","v":"Mike G"},"Y",{"$f":"YTD!Q24","v":"Y"},1,1,null,null,null,3.08,2,3.08,9,3.08,1]
[11,null,"N",{"$f":"YTD!P25","v":"Morrie"},"N",{"$f":"YTD!Q25","v":"N"},null,null,null,null,null,null,0,0,35,0,0]
[12,9,"N",{"$f":"YTD!P26","v":"Peter"},"Y",{"$f":"YTD!Q26","v":"Y"},1,null,null,null,null,1.26,1,1.26,14,1.26,1]
[13,1,"N",{"$f":"YTD!P27","v":"Rich B"},"Y",{"$f":"YTD!Q27","v":"N"},1,null,null,null,null,1.75,1,1.75,12,0,0]
[14,4,"N",{"$f":"YTD!P28","v":"Rich T"},"Y",{"$f":"YTD!Q28","v":"Y"},null,2,null,null,null,3.88,2,3.88,7,3.88,1]
[15,5,"N",{"$f":"YTD!P29","v":"Ron"},"Y",{"$f":"YTD!Q29","v":"N"},2,null,null,null,null,3.01,{"$f":"G18+H18","v":2},{"$f":"L18-(I18*0.2)","v":3.01},10,0,0]
[16,7,"N",{"$f":"YTD!P30","v":"Ryan"},"Y",{"$f":"YTD!Q30","v":"Y"},1,null,null,null,null,1,1,1,16,1,1]
[17,7,"N",{"$f":"YTD!P31","v":"Scott"},"Y",{"$f":"YTD!Q31","v":"N"},null,3,null,null,null,6.33,{"$f":"G20+H20","v":3},{"$f":"L20-(I20*0.2)","v":6.33},2,{"$f":"IF(F20=\"Y\",N20,0)","v":0},0]
[18,8,"N",{"$f":"YTD!P32","v":"Steve D"},"Y",{"$f":"YTD!Q32","v":"N"},3,2,null,null,null,6.66,5,6.66,1,0,0]
[19,null,"N",{"$f":"YTD!P33","v":"Steve S"},"N",{"$f":"YTD!Q33","v":"N"},null,null,null,null,null,null,0,0,35,0,0]
[20,6,"Y",{"$f":"YTD!P34","v":"Tom "},"Y",{"$f":"YTD!Q34","v":"N"},null,1,null,null,null,1.01,{"$f":"G23+H23","v":1},{"$f":"L23-(I23*0.2)","v":1.01},15,0,0]
[21,null,"N",{"$f":"YTD!P35","v":"X"},"N",{"$f":"YTD!Q35","v":"N"},null,null,null,null,null,null,0,0,35,0,0]
[22,null,"N",{"$f":"YTD!P36","v":"X"},"N",{"$f":"YTD!Q36","v":"N"},null,null,null,null,null,null,0,0,35,0,0]
[23,null,"N",{"$f":"YTD!P37","v":"X"},"N",{"$f":"YTD!Q37","v":"N"},null,null,null,null,null,null,0,0,35,0,0]
[24,null,"N",{"$f":"YTD!P38","v":"X"},"N",{"$f":"YTD!Q38","v":"N"},null,null,null,null,null,null,0,0,35,0,0]
[25,null,"N",{"$f":"YTD!P39","v":"X"},"N",{"$f":"YTD!Q39","v":"N"},null,null,null,null,null,null,{"$f":"G28+H28","v":0},{"$f":"L28-(I28*0.2)","v":0},35,{"$f":"IF(F28=\"Y\",N28,0)","v":0},{"$f":"IF(E28=\"N\",0,(IF(F28=\"N\",0,1)))","v":0}]
[26,null,"N",{"$f":"YTD!P40","v":"X"},"N",{"$f":"YTD!Q40","v":"N"},null,null,null,null,null,null,{"$f":"G29+H29","v":0},{"$f":"L29-(I29*0.2)","v":0},35,{"$f":"IF(F29=\"Y\",N29,0)","v":0},{"$f":"IF(E29=\"N\",0,(IF(F29=\"N\",0,1)))","v":0}]
[null,null,null,"Totals",{"$f":"COUNTIF(E4:E29,\"Y\")","v":17},null,{"$f":"SUM(G4:G29)","v":18},{"$f":"SUM(H4:H29)","v":14},{"$f":"SUM(I4:I29)","v":0},{"$f":"MAX(J4:J29)","v":4.03},null,{"$f":"SUM(L4:L29)","v":57.199999999999996},{"$f":"SUM(M4:M29)","v":32},{"$f":"SUM(N4:N29)","v":57.199999999999996},null,{"$f":"SUM(P4:P29)","v":19.48},{"$f":"SUM(Q4:Q29)","v":8}]
[null,"Place","Team #","Partners",null,null,"Total Weight",null,"Place","Team #","Partners",null,null,"Total Weight",null,"NB Avg",{"$f":"IF(Q30=0,\"No Data\",P30/Q30)","v":2.4350000000000001}]
[null,"1st",{"$f":"Teams!$N94","v":3},{"$f":"VLOOKUP($C32,$B$4:$D$29,3,0)","v":"Jason"},"&",{"$f":"IF($B$4:$B$29=20,\"#N/A\",IF(COUNTIF($B$4:$B$29,$C32)=1,\"Alone\",LOOKUP(2,1/($B$4:$B$29=$C32),$D$4:$D$29)))","v":"Mike G"},{"$f":"Teams!O94","v":9.4},null,"4th",{"$f":"Teams!$N97","v":9},{"$f":"VLOOKUP($J32,$B$4:$D$29,3,0)","v":"Kevin"},"&",{"$f":"IF($B$4:$B$29=20,\"#N/A\",IF(COUNTIF($B$4:$B$29,$J32)=1,\"Alone\",LOOKUP(2,1/($B$4:$B$29=$J32),$D$4:$D$29)))","v":"Peter"},{"$f":"Teams!O97","v":7.2}]
[null,"2nd",{"$f":"Teams!$N95","v":2},{"$f":"VLOOKUP($C33,$B$4:$D$29,3,0)","v":"Dean"},"&",{"$f":"IF($B$4:$B$29=20,\"#N/A\",IF(COUNTIF($B$4:$B$29,$C33)=1,\"Alone\",LOOKUP(2,1/($B$4:$B$29=$C33),$D$4:$D$29)))","v":"Mike M"},{"$f":"Teams!O95","v":9.0500000000000007},null,"5th",{"$f":"Teams!$N98","v":8},{"$f":"VLOOKUP($J33,$B$4:$D$29,3,0)","v":"Anthony"},"&",{"$f":"IF($B$4:$B$29=20,\"#N/A\",IF(COUNTIF($B$4:$B$29,$J33)=1,\"Alone\",LOOKUP(2,1/($B$4:$B$29=$J33),$D$4:$D$29)))","v":"Steve D"},{"$f":"Teams!O98","v":6.66}]
[null,"3rd",{"$f":"Teams!$N96","v":7},{"$f":"VLOOKUP($C34,$B$4:$D$29,3,0)","v":"Ryan"},"&",{"$f":"IF($B$4:$B$29=20,\"#N/A\",IF(COUNTIF($B$4:$B$29,$C34)=1,\"Alone\",LOOKUP(2,1/($B$4:$B$29=$C34),$D$4:$D$29)))","v":"Scott"},{"$f":"Teams!O96","v":7.33},null,"6th",{"$f":"Teams!$N99","v":5},{"$f":"VLOOKUP($J34,$B$4:$D$29,3,0)","v":"Jim B"},"&",{"$f":"IF($B$4:$B$29=20,\"#N/A\",IF(COUNTIF($B$4:$B$29,$J34)=1,\"Alone\",LOOKUP(2,1/($B$4:$B$29=$J34),$D$4:$D$29)))","v":"Ron"},{"$f":"Teams!O99","v":5.7799999999999994}]

{"sheet":"Twin Lakes","index":4,"n_rows":34,"n_cols":17,"rows_kept":34,"cut":false,"hidden":false,"merged":[[0,0,0,16],[30,3,30,5],[30,6,30,7],[30,10,30,12],[1,0,2,0],[33,6,33,7],[33,13,33,14],[30,13,30,14],[31,6,31,7],[31,13,31,14],[32,6,32,7],[32,13,32,14]]}
[{"$f":"YTD!L19","v":"Twin Lakes"}]
[null,"Team","Fish","Member","Show","Non","Number","Number","Number","Lunker","Species","Gross","Total","Net","Points","Non Boater","# Non-"]
[null,"Number","Alone?","Name","Up?","Boater?","of LMB","of SMB","Dead","Weight","LMB/SMB","Weight","Caught","Weight","Awarded","Weight","Boaters"]
[1,10,"N",{"$f":"YTD!P15","v":"Anthony"},"Y",{"$f":"YTD!Q15","v":"Y"},1,null,null,null,null,0.86,{"$f":"G4+H4","v":1},{"$f":"L4-(I4*0.2)","v":0.86},{"$f":"IF($E4=\"N\",35,IF($M4=0,30,RANK($N4,$N$4:$N$29,0)))","v":19},{"$f":"IF(F4=\"Y\",N4,0)","v":0.86},{"$f":"IF(E4=\"N\",0,(IF(F4=\"N\",0,1)))","v":1}]
[2,null,"N",{"$f":"YTD!P16","v":"Armand"},"N",{"$f":"YTD!Q16","v":"N"},null,null,null,null,null,null,0,0,{"$f":"IF($E5=\"N\",35,IF($M5=0,30,RANK($N5,$N$4:$N$29,0)))","v":35},0,{"$f":"IF(E5=\"N\",0,(IF(F5=\"N\",0,1)))","v":0}]
[3,7,"N",{"$f":"YTD!P17","v":"Dean"},"Y",{"$f":"YTD!Q17","v":"N"},2,null,null,null,null,3.15,{"$f":"G6+H6","v":2},{"$f":"L6-(I6*0.2)","v":3.15},15,{"$f":"IF(F6=\"Y\",N6,0)","v":0},0]
[4,9,"N",{"$f":"YTD!P18","v":"Jack"},"Y",{"$f":"YTD!Q18","v":"Y"},4,null,null,null,null,5.4,4,5.4,12,5.4,1]
[5,8,"N",{"$f":"YTD!P19","v":"Jason"},"Y",{"$f":"YTD!Q19","v":"N"},5,null,null,null,null,9.51,{"$f":"G8+H8","v":5},{"$f":"L8-(I8*0.2)","v":9.51},3,{"$f":"IF(F8=\"Y\",N8,0)","v":0},0]
[6,8,"N",{"$f":"YTD!P20","v":"Jim B"},"Y",{"$f":"YTD!Q20","v":"Y"},2,null,null,null,null,3.93,2,3.93,14,3.93,1]
[7,1,"N",{"$f":"YTD!P21","v":"Kam"},"Y",{"$f":"YTD!Q21","v":"Y"},4,null,null,null,null,7.05,4,7.05,4,7.05,1]
[8,4,"N",{"$f":"YTD!P22","v":"Kevin"},"Y",{"$f":"YTD!Q22","v":"N"},4,null,null,null,null,6.93,{"$f":"G11+H11","v":4},{"$f":"L11-(I11*0.2)","v":6.93},5,{"$f":"IF(F11=\"Y\",N11,0)","v":0},0]
[9,7,"N",{"$f":"YTD!P23","v":"Mike M"},"Y",{"$f":"YTD!Q23","v":"Y"},1,null,null,null,null,1.75,1,1.75,18,1.75,1]
[10,6,"N",{"$f":"YTD!P24","v":"Mike G"},"Y",{"$f":"YTD!Q24","v":"Y"},2,null,null,null,null,3.05,2,3.05,16,3.05,1]
[11,1,"N",{"$f":"YTD!P25","v":"Morrie"},"Y",{"$f":"YTD!Q25","v":"N"},1,null,null,null,null,1.97,1,1.97,17,0,0]
[12,5,"N",{"$f":"YTD!P26","v":"Peter"},"Y",{"$f":"YTD!Q26","v":"Y"},5,null,null,null,null,6.66,5,6.66,8,6.66,1]
[13,5,"N",{"$f":"YTD!P27","v":"Rich B"},"Y",{"$f":"YTD!Q27","v":"N"},3,null,null,null,null,5.12,3,5.12,13,0,0]
[14,4,"N",{"$f":"YTD!P28","v":"Rich T"},"Y",{"$f":"YTD!Q28","v":"Y"},5,null,null,null,null,12.9,5,12.9,1,12.9,1]
[15,10,"N",{"$f":"YTD!P29","v":"Ron"},"Y",{"$f":"YTD!Q29","v":"N"},3,null,null,null,null,5.67,{"$f":"G18+H18","v":3},{"$f":"L18-(I18*0.2)","v":5.67},10,0,0]
[16,3,"N",{"$f":"YTD!P30","v":"Ryan"},"Y",{"$f":"YTD!Q30","v":"Y"},5,null,1,null,null,6.97,5,6.77,6,6.77,1]
[17,9,"N",{"$f":"YTD!P31","v":"Scott"},"Y",{"$f":"YTD!Q31","v":"N"},4,null,null,null,null,5.44,{"$f":"G20+H20","v":4},{"$f":"L20-(I20*0.2)","v":5.44},11,{"$f":"IF(F20=\"Y\",N20,0)","v":0},0]
[18,2,"Y",{"$f":"YTD!P32","v":"Steve D"},"Y",{"$f":"YTD!Q32","v":"N"},5,null,null,null,null,6.74,5,6.74,7,0,0]
[19,3,"N",{"$f":"YTD!P33","v":"Steve S"},"Y",{"$f":"YTD!Q33","v":"N"},5,null,null,null,null,6.56,5,6.56,9,0,0]
[20,6,"N",{"$f":"YTD!P34","v":"Tom "},"Y",{"$f":"YTD!Q34","v":"N"},4,1,1,4.55,"LMB",10.130000000000001,{"$f":"G23+H23","v":5},{"$f":"L23-(I23*0.2)","v":9.9300000000000015},2,0,0]
[21,null,"N",{"$f":"YTD!P35","v":"X"},"N",{"$f":"YTD!Q35","v":"N"},null,null,null,null,null,null,0,0,35,0,0]
[22,null,"N",{"$f":"YTD!P36","v":"X"},"N",{"$f":"YTD!Q36","v":"N"},null,null,null,null,null,null,0,0,35,0,0]
[23,null,"N",{"$f":"YTD!P37","v":"X"},"N",{"$f":"YTD!Q37","v":"N"},null,null,null,null,null,null,0,0,35,0,0]
[24,null,"N",{"$f":"YTD!P38","v":"X"},"N",{"$f":"YTD!Q38","v":"N"},null,null,null,null,null,null,0,0,35,0,0]
[25,null,"N",{"$f":"YTD!P39","v":"X"},"N",{"$f":"YTD!Q39","v":"N"},null,null,null,null,null,null,{"$f":"G28+H28","v":0},{"$f":"L28-(I28*0.2)","v":0},35,{"$f":"IF(F28=\"Y\",N28,0)","v":0},{"$f":"IF(E28=\"N\",0,(IF(F28=\"N\",0,1)))","v":0}]
[26,null,"N",{"$f":"YTD!P40","v":"X"},"N",{"$f":"YTD!Q40","v":"N"},null,null,null,null,null,null,{"$f":"G29+H29","v":0},{"$f":"L29-(I29*0.2)","v":0},35,{"$f":"IF(F29=\"Y\",N29,0)","v":0},{"$f":"IF(E29=\"N\",0,(IF(F29=\"N\",0,1)))","v":0}]
[null,null,null,"Totals",{"$f":"COUNTIF(E4:E29,\"Y\")","v":19},null,{"$f":"SUM(G4:G29)","v":65},{"$f":"SUM(H4:H29)","v":1},{"$f":"SUM(I4:I29)","v":2},{"$f":"MAX(J4:J29)","v":4.55},null,{"$f":"SUM(L4:L29)","v":109.78999999999998},{"$f":"SUM(M4:M29)","v":66},{"$f":"SUM(N4:N29)","v":109.38999999999999},null,{"$f":"SUM(P4:P29)","v":48.370000000000005},{"$f":"SUM(Q4:Q29)","v":9}]
[null,"Place","Team #","Partners",null,null,"Total Weight",null,"Place","Team #","Partners",null,null,"Total Weight",null,"NB Avg",{"$f":"IF(Q30=0,\"No Data\",P30/Q30)","v":5.3744444444444452}]
[null,"1st",{"$f":"Teams!$AD4","v":4},{"$f":"VLOOKUP($C32,$B$4:$D$29,3,0)","v":"Kevin"},"&",{"$f":"IF($B$4:$B$29=20,\"#N/A\",IF(COUNTIF($B$4:$B$29,$C32)=1,\"Alone\",LOOKUP(2,1/($B$4:$B$29=$C32),$D$4:$D$29)))","v":"Rich T"},{"$f":"Teams!AE4","v":19.829999999999998},null,"4th",{"$f":"Teams!$AD7","v":6},{"$f":"VLOOKUP($J32,$B$4:$D$29,3,0)","v":"Mike G"},"&",{"$f":"IF($B$4:$B$29=20,\"#N/A\",IF(COUNTIF($B$4:$B$29,$J32)=1,\"Alone\",LOOKUP(2,1/($B$4:$B$29=$J32),$D$4:$D$29)))","v":"Tom "},{"$f":"Teams!AE7","v":12.98}]
[null,"2nd",{"$f":"Teams!$AD5","v":8},{"$f":"VLOOKUP($C33,$B$4:$D$29,3,0)","v":"Jason"},"&",{"$f":"IF($B$4:$B$29=20,\"#N/A\",IF(COUNTIF($B$4:$B$29,$C33)=1,\"Alone\",LOOKUP(2,1/($B$4:$B$29=$C33),$D$4:$D$29)))","v":"Jim B"},{"$f":"Teams!AE5","v":13.44},null,"5th",{"$f":"Teams!$AD8","v":2},{"$f":"VLOOKUP($J33,$B$4:$D$29,3,0)","v":"Steve D"},"&",{"$f":"IF($B$4:$B$29=20,\"#N/A\",IF(COUNTIF($B$4:$B$29,$J33)=1,\"Alone\",LOOKUP(2,1/($B$4:$B$29=$J33),$D$4:$D$29)))","v":"Alone"},{"$f":"Teams!AE8","v":12.114444444444445}]
[null,"3rd",{"$f":"Teams!$AD6","v":3},{"$f":"VLOOKUP($C34,$B$4:$D$29,3,0)","v":"Ryan"},"&",{"$f":"IF($B$4:$B$29=20,\"#N/A\",IF(COUNTIF($B$4:$B$29,$C34)=1,\"Alone\",LOOKUP(2,1/($B$4:$B$29=$C34),$D$4:$D$29)))","v":"Steve S"},{"$f":"Teams!AE6","v":13.329999999999998},null,"6th",{"$f":"Teams!$AD9","v":5},{"$f":"VLOOKUP($J34,$B$4:$D$29,3,0)","v":"Peter"},"&",{"$f":"IF($B$4:$B$29=20,\"#N/A\",IF(COUNTIF($B$4:$B$29,$J34)=1,\"Alone\",LOOKUP(2,1/($B$4:$B$29=$J34),$D$4:$D$29)))","v":"Rich B"},{"$f":"Teams!AE9","v":11.780000000000001}]

{"sheet":"Lillinonah","index":5,"n_rows":34,"n_cols":17,"rows_kept":34,"cut":false,"hidden":false,"merged":[[0,0,0,16],[30,3,30,5],[30,6,30,7],[30,10,30,12],[1,0,2,0],[33,6,33,7],[33,13,33,14],[30,13,30,14],[31,6,31,7],[31,13,31,14],[32,6,32,7],[32,13,32,14]]}
[{"$f":"YTD!L20","v":"Lillinonah"}]
[null,"Team","Fish","Member","Show","Non","Number","Number","Number","Lunker","Species","Gross","Total","Net","Points","Non Boater","# Non-"]
[null,"Number","Alone?","Name","Up?","Boater?","of LMB","of SMB","Dead","Weight","LMB/SMB","Weight","Caught","Weight","Awarded","Weight","Boaters"]
[null,8,"N",{"$f":"YTD!P15","v":"Anthony"},"Y",{"$f":"YTD!Q15","v":"Y"},1,4,2,null,null,7.61,{"$f":"G4+H4","v":5},{"$f":"L4-(I4*0.2)","v":7.21},{"$f":"IF($E4=\"N\",35,IF($M4=0,30,RANK($N4,$N$4:$N$29,0)))","v":4},{"$f":"IF(F4=\"Y\",N4,0)","v":7.21},{"$f":"IF(E4=\"N\",0,(IF(F4=\"N\",0,1)))","v":1}]
[null,7,"N",{"$f":"YTD!P16","v":"Armand"},"Y",{"$f":"YTD!Q16","v":"N"},1,2,null,null,null,3.08,3,3.08,{"$f":"IF($E5=\"N\",35,IF($M5=0,30,RANK($N5,$N$4:$N$29,0)))","v":14},0,{"$f":"IF(E5=\"N\",0,(IF(F5=\"N\",0,1)))","v":0}]
[null,3,"N",{"$f":"YTD!P17","v":"Dean"},"Y",{"$f":"YTD!Q17","v":"N"},1,4,null,null,null,6.44,{"$f":"G6+H6","v":5},{"$f":"L6-(I6*0.2)","v":6.44},5,{"$f":"IF(F6=\"Y\",N6,0)","v":0},0]
[null,2,"N",{"$f":"YTD!P18","v":"Jack"},"Y",{"$f":"YTD!Q18","v":"Y"},1,1,null,null,null,2.31,2,2.31,15,2.31,1]
[null,8,"N",{"$f":"YTD!P19","v":"Jason"},"Y",{"$f":"YTD!Q19","v":"N"},2,3,3,null,null,8.3800000000000008,{"$f":"G8+H8","v":5},{"$f":"L8-(I8*0.2)","v":7.7800000000000011},3,{"$f":"IF(F8=\"Y\",N8,0)","v":0},0]
[null,1,"N",{"$f":"YTD!P20","v":"Jim B"},"Y",{"$f":"YTD!Q20","v":"Y"},0,null,null,null,null,0,0,0,30,0,1]
[null,6,"N",{"$f":"YTD!P21","v":"Kam"},"Y",{"$f":"YTD!Q21","v":"Y"},0,1,null,null,null,3.24,1,3.24,13,3.24,1]
[null,6,"N",{"$f":"YTD!P22","v":"Kevin"},"Y",{"$f":"YTD!Q22","v":"N"},0,4,null,null,null,10.59,{"$f":"G11+H11","v":4},{"$f":"L11-(I11*0.2)","v":10.59},1,{"$f":"IF(F11=\"Y\",N11,0)","v":0},0]
[null,9,"N",{"$f":"YTD!P23","v":"Mike M"},"Y",{"$f":"YTD!Q23","v":"Y"},1,2,null,null,null,3.84,3,3.84,11,3.84,1]
[null,7,"N",{"$f":"YTD!P24","v":"Mike G"},"Y",{"$f":"YTD!Q24","v":"Y"},1,1,1,null,null,2.12,2,1.9200000000000002,16,1.9200000000000002,1]
[null,9,"N",{"$f":"YTD!P25","v":"Morrie"},"Y",{"$f":"YTD!Q25","v":"N"},0,2,null,4.3,"SMB",6.3,2,6.3,6,0,0]
[null,null,"N",{"$f":"YTD!P26","v":"Peter"},"N",{"$f":"YTD!Q26","v":"Y"},null,null,null,null,null,null,0,0,35,0,0]
[null,4,"N",{"$f":"YTD!P27","v":"Rich B"},"Y",{"$f":"YTD!Q27","v":"N"},1,2,null,null,null,4.09,3,4.09,10,0,0]
[null,4,"N",{"$f":"YTD!P28","v":"Rich T"},"Y",{"$f":"YTD!Q28","v":"Y"},0,4,null,null,null,5.85,4,5.85,8,5.85,1]
[null,null,"N",{"$f":"YTD!P29","v":"Ron"},"N",{"$f":"YTD!Q29","v":"N"},null,null,null,null,null,null,{"$f":"G18+H18","v":0},{"$f":"L18-(I18*0.2)","v":0},35,0,0]
[null,3,"N",{"$f":"YTD!P30","v":"Ryan"},"Y",{"$f":"YTD!Q30","v":"Y"},4,1,null,null,null,6.17,5,6.17,7,6.17,1]
[null,5,"N",{"$f":"YTD!P31","v":"Scott"},"Y","Y",1,3,null,null,null,4.74,{"$f":"G20+H20","v":4},{"$f":"L20-(I20*0.2)","v":4.74},9,{"$f":"IF(F20=\"Y\",N20,0)","v":4.74},1]
[null,5,"N",{"$f":"YTD!P32","v":"Steve D"},"Y",{"$f":"YTD!Q32","v":"N"},0,5,1,null,null,8.0500000000000007,5,7.8500000000000005,2,0,0]
[null,2,"N",{"$f":"YTD!P33","v":"Steve S"},"Y",{"$f":"YTD!Q33","v":"N"},1,2,null,null,null,3.68,3,3.68,12,0,0]
[null,1,"N",{"$f":"YTD!P34","v":"Tom "},"Y",{"$f":"YTD!Q34","v":"N"},0,null,null,null,null,0,{"$f":"G23+H23","v":0},{"$f":"L23-(I23*0.2)","v":0},30,0,0]
[null,null,"N",{"$f":"YTD!P35","v":"X"},"N","N",null,null,null,null,null,null,0,0,35,0,0]
[null,null,"N",{"$f":"YTD!P36","v":"X"},"N","N",null,null,null,null,null,null,0,0,35,0,0]
[null,null,"N",{"$f":"YTD!P37","v":"X"},"N","N",null,null,null,null,null,null,0,0,35,0,0]
[null,null,"N",{"$f":"YTD!P38","v":"X"},"N","N",null,null,null,null,null,null,0,0,35,0,0]
[null,null,"N",{"$f":"YTD!P39","v":"X"},"N","N",null,null,null,null,null,null,{"$f":"G28+H28","v":0},{"$f":"L28-(I28*0.2)","v":0},35,{"$f":"IF(F28=\"Y\",N28,0)","v":0},{"$f":"IF(E28=\"N\",0,(IF(F28=\"N\",0,1)))","v":0}]
[26,null,"N",{"$f":"YTD!P40","v":"X"},"N","N",null,null,null,null,null,null,{"$f":"G29+H29","v":0},{"$f":"L29-(I29*0.2)","v":0},35,{"$f":"IF(F29=\"Y\",N29,0)","v":0},{"$f":"IF(E29=\"N\",0,(IF(F29=\"N\",0,1)))","v":0}]
[null,null,null,"Totals",{"$f":"COUNTIF(E4:E29,\"Y\")","v":18},null,{"$f":"SUM(G4:G29)","v":15},{"$f":"SUM(H4:H29)","v":41},{"$f":"SUM(I4:I29)","v":7},{"$f":"MAX(J4:J29)","v":4.3},null,{"$f":"SUM(L4:L29)","v":86.49},{"$f":"SUM(M4:M29)","v":56},{"$f":"SUM(N4:N29)","v":85.09},null,{"$f":"SUM(P4:P29)","v":35.280000000000008},{"$f":"SUM(Q4:Q29)","v":9}]
[null,"Place","Team #","Partners",null,null,"Total Weight",null,"Place","Team #","Partners",null,null,"Total Weight",null,"NB Avg",{"$f":"IF(Q30=0,\"No Data\",P30/Q30)","v":3.9200000000000008}]
[null,"1st",{"$f":"Teams!$AD34","v":8},{"$f":"VLOOKUP($C32,$B$4:$D$29,3,0)","v":"Anthony"},"&",{"$f":"IF($B$4:$B$29=20,\"#N/A\",IF(COUNTIF($B$4:$B$29,$C32)=1,\"Alone\",LOOKUP(2,1/($B$4:$B$29=$C32),$D$4:$D$29)))","v":"Jason"},{"$f":"Teams!AE34","v":14.990000000000002},null,"4th",{"$f":"Teams!$AD37","v":5},{"$f":"VLOOKUP($J32,$B$4:$D$29,3,0)","v":"Scott"},"&",{"$f":"IF($B$4:$B$29=20,\"#N/A\",IF(COUNTIF($B$4:$B$29,$J32)=1,\"Alone\",LOOKUP(2,1/($B$4:$B$29=$J32),$D$4:$D$29)))","v":"Steve D"},{"$f":"Teams!AE37","v":12.59}]
[null,"2nd",{"$f":"Teams!$AD35","v":6},{"$f":"VLOOKUP($C33,$B$4:$D$29,3,0)","v":"Kam"},"&",{"$f":"IF($B$4:$B$29=20,\"#N/A\",IF(COUNTIF($B$4:$B$29,$C33)=1,\"Alone\",LOOKUP(2,1/($B$4:$B$29=$C33),$D$4:$D$29)))","v":"Kevin"},{"$f":"Teams!AE35","v":13.83},null,"5th",{"$f":"Teams!$AD38","v":9},{"$f":"VLOOKUP($J33,$B$4:$D$29,3,0)","v":"Mike M"},"&",{"$f":"IF($B$4:$B$29=20,\"#N/A\",IF(COUNTIF($B$4:$B$29,$J33)=1,\"Alone\",LOOKUP(2,1/($B$4:$B$29=$J33),$D$4:$D$29)))","v":"Morrie"},{"$f":"Teams!AE38","v":10.14}]
[null,"3rd",{"$f":"Teams!$AD36","v":3},{"$f":"VLOOKUP($C34,$B$4:$D$29,3,0)","v":"Dean"},"&",{"$f":"IF($B$4:$B$29=20,\"#N/A\",IF(COUNTIF($B$4:$B$29,$C34)=1,\"Alone\",LOOKUP(2,1/($B$4:$B$29=$C34),$D$4:$D$29)))","v":"Ryan"},{"$f":"Teams!AE36","v":12.61},null,"6th",{"$f":"Teams!$AD39","v":4},{"$f":"VLOOKUP($J34,$B$4:$D$29,3,0)","v":"Rich B"},"&",{"$f":"IF($B$4:$B$29=20,\"#N/A\",IF(COUNTIF($B$4:$B$29,$J34)=1,\"Alone\",LOOKUP(2,1/($B$4:$B$29=$J34),$D$4:$D$29)))","v":"Rich T"},{"$f":"Teams!AE39","v":9.94}]

{"sheet":"CT River","index":6,"n_rows":34,"n_cols":17,"rows_kept":34,"cut":false,"hidden":false,"merged":[[0,0,0,16],[30,3,30,5],[30,6,30,7],[30,10,30,12],[1,0,2,0],[33,6,33,7],[33,13,33,14],[30,13,30,14],[31,6,31,7],[31,13,31,14],[32,6,32,7],[32,13,32,14]]}
[{"$f":"YTD!L21","v":"CT River"}]
[null,"Team","Fish","Member","Show","Non","Number","Number","Number","Lunker","Species","Gross","Total","Net","Points","Non Boater","# Non-"]
[null,"Number","Alone?","Name","Up?","Boater?","of LMB","of SMB","Dead","Weight","LMB/SMB","Weight","Caught","Weight","Awarded","Weight","Boaters"]
[1,4,"N",{"$f":"YTD!P15","v":"Anthony"},"Y",{"$f":"YTD!Q15","v":"Y"},0,null,null,null,null,null,{"$f":"G4+H4","v":0},{"$f":"L4-(I4*0.2)","v":0},{"$f":"IF($E4=\"N\",35,IF($M4=0,30,RANK($N4,$N$4:$N$29,0)))","v":30},{"$f":"IF(F4=\"Y\",N4,0)","v":0},{"$f":"IF(E4=\"N\",0,(IF(F4=\"N\",0,1)))","v":1}]
[2,null,"N",{"$f":"YTD!P16","v":"Armand"},"N",{"$f":"YTD!Q16","v":"N"},null,null,null,null,null,null,0,0,{"$f":"IF($E5=\"N\",35,IF($M5=0,30,RANK($N5,$N$4:$N$29,0)))","v":35},0,{"$f":"IF(E5=\"N\",0,(IF(F5=\"N\",0,1)))","v":0}]
[3,9,"N",{"$f":"YTD!P17","v":"Dean"},"Y",{"$f":"YTD!Q17","v":"N"},1,null,null," ",null,1.31,{"$f":"G6+H6","v":1},{"$f":"L6-(I6*0.2)","v":1.31},9,{"$f":"IF(F6=\"Y\",N6,0)","v":0},0]
[4,9,"N",{"$f":"YTD!P18","v":"Jack"},"Y",{"$f":"YTD!Q18","v":"Y"},null,1,null,null,null,1.07,1,{"$f":"L7-(I7*0.2)","v":1.07},11,1.07,1]
[5,null,"N",{"$f":"YTD!P19","v":"Jason"},"N",{"$f":"YTD!Q19","v":"N"},null,null,null,null,null,null,{"$f":"G8+H8","v":0},{"$f":"L8-(I8*0.2)","v":0},35,{"$f":"IF(F8=\"Y\",N8,0)","v":0},0]
[6,null,"N",{"$f":"YTD!P20","v":"Jim B"},"N",{"$f":"YTD!Q20","v":"Y"},null,null,null,null,null,null,0,0,35,0,0]
[7,2,"N",{"$f":"YTD!P21","v":"Kam"},"Y",{"$f":"YTD!Q21","v":"Y"},0,null,null,null,null,null,0,0,30,0,1]
[8,1,"Y",{"$f":"YTD!P22","v":"Kevin"},"Y",{"$f":"YTD!Q22","v":"N"},1,null,null,null,null,0.83,{"$f":"G11+H11","v":1},{"$f":"L11-(I11*0.2)","v":0.83},12,{"$f":"IF(F11=\"Y\",N11,0)","v":0},0]
[9,8,"N",{"$f":"YTD!P23","v":"Mike M"},"Y",{"$f":"YTD!Q23","v":"Y"},1,1,null,null,null,2.8,2,2.8,6,2.8,1]
[10,null,"N",{"$f":"YTD!P24","v":"Mike G"},"N",{"$f":"YTD!Q24","v":"Y"},null,null,null,null,null,null,0,0,35,0,0]
[11,7,"N",{"$f":"YTD!P25","v":"Morrie"},"Y",{"$f":"YTD!Q25","v":"N"},3,null,null,null,null,4.0199999999999996,3,4.0199999999999996,3,0,0]
[12,3,"N",{"$f":"YTD!P26","v":"Peter"},"Y",{"$f":"YTD!Q26","v":"Y"},2,null,null,null,null,3.03,2,3.03,5,3.03,1]
[13,2,"N",{"$f":"YTD!P27","v":"Rich B"},"Y",{"$f":"YTD!Q27","v":"N"},2,3,null,4.43,"SMB",15.72,5,15.72,1,0,0]
[14,5,"N",{"$f":"YTD!P28","v":"Rich T"},"Y",{"$f":"YTD!Q28","v":"Y"},2,1,null,null,null,3.5,3,3.5,4,3.5,1]
[15,6,"Y",{"$f":"YTD!P29","v":"Ron"},"Y",{"$f":"YTD!Q29","v":"N"},0,null,null,null,null,null,{"$f":"G18+H18","v":0},{"$f":"L18-(I18*0.2)","v":0},30,0,0]
[16,7,"N",{"$f":"YTD!P30","v":"Ryan"},"Y",{"$f":"YTD!Q30","v":"Y"},2,null,null,null,null,2.56,2,2.56,7,2.56,1]
[17,5,"N",{"$f":"YTD!P31","v":"Scott"},"Y",{"$f":"YTD!Q31","v":"N"},0,null,null,null,null,null,{"$f":"G20+H20","v":0},{"$f":"L20-(I20*0.2)","v":0},30,{"$f":"IF(F20=\"Y\",N20,0)","v":0},0]
[18,8,"N",{"$f":"YTD!P32","v":"Steve D"},"Y",{"$f":"YTD!Q32","v":"N"},2,3,null,null,null,8.76,5,8.76,2,0,0]
[19,3,"N",{"$f":"YTD!P33","v":"Steve S"},"Y",{"$f":"YTD!Q33","v":"N"},1,null,null,null,null,1.61,1,1.61,8,0,0]
[20,4,"N",{"$f":"YTD!P34","v":"Tom "},"Y",{"$f":"YTD!Q34","v":"N"},null,1,null,null,null,1.26,{"$f":"G23+H23","v":1},{"$f":"L23-(I23*0.2)","v":1.26},10,0,0]
[21,null,"N",{"$f":"YTD!P35","v":"X"},"N",{"$f":"YTD!Q35","v":"N"},null,null,null,null,null,null,0,0,35,0,0]
[22,null,"N",{"$f":"YTD!P36","v":"X"},"N",{"$f":"YTD!Q36","v":"N"},null,null,null,null,null,null,0,0,35,0,0]
[23,null,"N",{"$f":"YTD!P37","v":"X"},"N",{"$f":"YTD!Q37","v":"N"},null,null,null,null,null,null,0,0,35,0,0]
[24,null,"N",{"$f":"YTD!P38","v":"X"},"N",{"$f":"YTD!Q38","v":"N"},null,null,null,null,null,null,0,0,35,0,0]
[25,null,"N",{"$f":"YTD!P39","v":"X"},"N",{"$f":"YTD!Q39","v":"N"},null,null,null,null,null,null,{"$f":"G28+H28","v":0},{"$f":"L28-(I28*0.2)","v":0},35,{"$f":"IF(F28=\"Y\",N28,0)","v":0},{"$f":"IF(E28=\"N\",0,(IF(F28=\"N\",0,1)))","v":0}]
[26,null,"N",{"$f":"YTD!P40","v":"X"},"N",{"$f":"YTD!Q40","v":"N"},null,null,null,null,null,null,{"$f":"G29+H29","v":0},{"$f":"L29-(I29*0.2)","v":0},35,{"$f":"IF(F29=\"Y\",N29,0)","v":0},{"$f":"IF(E29=\"N\",0,(IF(F29=\"N\",0,1)))","v":0}]
[null,null,null,"Totals",{"$f":"COUNTIF(E4:E29,\"Y\")","v":16},null,{"$f":"SUM(G4:G29)","v":17},{"$f":"SUM(H4:H29)","v":10},{"$f":"SUM(I4:I29)","v":0},{"$f":"MAX(J4:J29)","v":4.43},null,{"$f":"SUM(L4:L29)","v":46.47},{"$f":"SUM(M4:M29)","v":27},{"$f":"SUM(N4:N29)","v":46.47},null,{"$f":"SUM(P4:P29)","v":12.96},{"$f":"SUM(Q4:Q29)","v":7}]
[null,"Place","Team #","Partners",null,null,"Total Weight",null,"Place","Team #","Partners",null,null,"Total Weight",null,"NB Avg",{"$f":"IF(Q30=0,\"No Data\",P30/Q30)","v":1.8514285714285716}]
[null,"1st",{"$f":"Teams!$AD64","v":2},{"$f":"VLOOKUP($C32,$B$4:$D$29,3,0)","v":"Kam"},"&",{"$f":"IF($B$4:$B$29=20,\"#N/A\",IF(COUNTIF($B$4:$B$29,$C32)=1,\"Alone\",LOOKUP(2,1/($B$4:$B$29=$C32),$D$4:$D$29)))","v":"Rich B"},{"$f":"Teams!AE64","v":15.72},null,"4th",{"$f":"Teams!$AD67","v":3},{"$f":"VLOOKUP($J32,$B$4:$D$29,3,0)","v":"Peter"},"&",{"$f":"IF($B$4:$B$29=20,\"#N/A\",IF(COUNTIF($B$4:$B$29,$J32)=1,\"Alone\",LOOKUP(2,1/($B$4:$B$29=$J32),$D$4:$D$29)))","v":"Steve S"},{"$f":"Teams!AE67","v":4.6399999999999997}]
[null,"2nd",{"$f":"Teams!$AD65","v":8},{"$f":"VLOOKUP($C33,$B$4:$D$29,3,0)","v":"Mike M"},"&",{"$f":"IF($B$4:$B$29=20,\"#N/A\",IF(COUNTIF($B$4:$B$29,$C33)=1,\"Alone\",LOOKUP(2,1/($B$4:$B$29=$C33),$D$4:$D$29)))","v":"Steve D"},{"$f":"Teams!AE65","v":11.559999999999999},null,"5th",{"$f":"Teams!$AD68","v":5},{"$f":"VLOOKUP($J33,$B$4:$D$29,3,0)","v":"Rich T"},"&",{"$f":"IF($B$4:$B$29=20,\"#N/A\",IF(COUNTIF($B$4:$B$29,$J33)=1,\"Alone\",LOOKUP(2,1/($B$4:$B$29=$J33),$D$4:$D$29)))","v":"Scott"},{"$f":"Teams!AE68","v":3.5}]
[null,"3rd",{"$f":"Teams!$AD66","v":7},{"$f":"VLOOKUP($C34,$B$4:$D$29,3,0)","v":"Morrie"},"&",{"$f":"IF($B$4:$B$29=20,\"#N/A\",IF(COUNTIF($B$4:$B$29,$C34)=1,\"Alone\",LOOKUP(2,1/($B$4:$B$29=$C34),$D$4:$D$29)))","v":"Ryan"},{"$f":"Teams!AE66","v":6.58},null,"6th",{"$f":"Teams!$AD69","v":1},{"$f":"VLOOKUP($J34,$B$4:$D$29,3,0)","v":"Kevin"},"&",{"$f":"IF($B$4:$B$29=20,\"#N/A\",IF(COUNTIF($B$4:$B$29,$J34)=1,\"Alone\",LOOKUP(2,1/($B$4:$B$29=$J34),$D$4:$D$29)))","v":"Alone"},{"$f":"Teams!AE69","v":2.6814285714285715}]

{"sheet":"Bashan","index":7,"n_rows":34,"n_cols":17,"rows_kept":34,"cut":false,"hidden":false,"merged":[[0,0,0,16],[30,3,30,5],[30,6,30,7],[30,10,30,12],[1,0,2,0],[33,6,33,7],[33,13,33,14],[30,13,30,14],[31,6,31,7],[31,13,31,14],[32,6,32,7],[32,13,32,14]]}
[{"$f":"YTD!L22","v":"Bashan"}]
[null,"Team","Fish","Member","Show","Non","Number","Number","Number","Lunker","Species","Gross","Total","Net","Points","Non Boater","# Non-"]
[null,"Number","Alone?","Name","Up?","Boater?","of LMB","of SMB","Dead","Weight","LMB/SMB","Weight","Caught","Weight","Awarded","Weight","Boaters"]
[1,5,"N",{"$f":"YTD!P15","v":"Anthony"},"Y",{"$f":"YTD!Q15","v":"Y"},5,null,null,null,null,7.48,{"$f":"G4+H4","v":5},{"$f":"L4-(I4*0.2)","v":7.48},{"$f":"IF($E4=\"N\",35,IF($M4=0,30,RANK($N4,$N$4:$N$29,0)))","v":5},{"$f":"IF(F4=\"Y\",N4,0)","v":7.48},{"$f":"IF(E4=\"N\",0,(IF(F4=\"N\",0,1)))","v":1}]
[2,null,"N",{"$f":"YTD!P16","v":"Armand"},"N",{"$f":"YTD!Q16","v":"N"},null,null,null,null,null,null,0,0,{"$f":"IF($E5=\"N\",35,IF($M5=0,30,RANK($N5,$N$4:$N$29,0)))","v":35},0,{"$f":"IF(E5=\"N\",0,(IF(F5=\"N\",0,1)))","v":0}]
[3,3,"N",{"$f":"YTD!P17","v":"Dean"},"Y",{"$f":"YTD!Q17","v":"N"},3,null,null,null,null,3.72,{"$f":"G6+H6","v":3},{"$f":"L6-(I6*0.2)","v":3.72},11,{"$f":"IF(F6=\"Y\",N6,0)","v":0},0]
[4,null,"N",{"$f":"YTD!P18","v":"Jack"},"N",{"$f":"YTD!Q18","v":"Y"},null,null,null,null,null,null,0,0,35,0,0]
[5,null,"N",{"$f":"YTD!P19","v":"Jason"},"N",{"$f":"YTD!Q19","v":"N"},null,null,null,null,null,null,{"$f":"G8+H8","v":0},{"$f":"L8-(I8*0.2)","v":0},35,{"$f":"IF(F8=\"Y\",N8,0)","v":0},0]
[6,2,"N",{"$f":"YTD!P20","v":"Jim B"},"Y",{"$f":"YTD!Q20","v":"Y"},5,null,null,null,null,8.0500000000000007,5,8.0500000000000007,3,8.0500000000000007,1]
[7,6,"N",{"$f":"YTD!P21","v":"Kam"},"Y",{"$f":"YTD!Q21","v":"Y"},0,null,null,null,null,null,0,0,30,0,1]
[8,2,"N",{"$f":"YTD!P22","v":"Kevin"},"Y",{"$f":"YTD!Q22","v":"N"},5,null,null,null,null,6.28,{"$f":"G11+H11","v":5},{"$f":"L11-(I11*0.2)","v":6.28},8,{"$f":"IF(F11=\"Y\",N11,0)","v":0},0]
[9,4,"N",{"$f":"YTD!P23","v":"Mike M"},"Y",{"$f":"YTD!Q23","v":"Y"},4,null,null,null,null,6.33,4,6.33,7,6.33,1]
[10,null,"N",{"$f":"YTD!P24","v":"Mike G"},"N",{"$f":"YTD!Q24","v":"Y"},null,null,null,null,null,null,0,0,35,0,0]
[11,1,"N",{"$f":"YTD!P25","v":"Morrie"},"Y",{"$f":"YTD!Q25","v":"N"},2,null,null,null,null,2.33,2,2.33,12,0,0]
[12,3,"N",{"$f":"YTD!P26","v":"Peter"},"Y",{"$f":"YTD!Q26","v":"Y"},4,null,null,null,null,5.9,4,5.9,9,5.9,1]
[13,1,"N",{"$f":"YTD!P27","v":"Rich B"},"Y","Y",5,null,1,null,null,7.42,5,7.22,6,7.22,1]
[14,5,"N",{"$f":"YTD!P28","v":"Rich T"},"Y","N",5,null,null,null,null,9.36,5,9.36,1,0,0]
[15,4,"N",{"$f":"YTD!P29","v":"Ron"},"Y",{"$f":"YTD!Q29","v":"N"},1,null,null,null,null,1.99,{"$f":"G18+H18","v":1},{"$f":"L18-(I18*0.2)","v":1.99},13,0,0]
[16,7,"N",{"$f":"YTD!P30","v":"Ryan"},"Y",{"$f":"YTD!Q30","v":"Y"},5,null,1,null,null,7.96,5,7.76,4,7.76,1]
[17,6,"N",{"$f":"YTD!P31","v":"Scott"},"Y",{"$f":"YTD!Q31","v":"N"},5,null,null,null,null,5.72,{"$f":"G20+H20","v":5},{"$f":"L20-(I20*0.2)","v":5.72},10,{"$f":"IF(F20=\"Y\",N20,0)","v":0},0]
[18,7,"N",{"$f":"YTD!P32","v":"Steve D"},"Y",{"$f":"YTD!Q32","v":"N"},5,null,null,2.59,"LMB",8.09,5,8.09,2,0,0]
[19,8,"Y",{"$f":"YTD!P33","v":"Steve S"},"Y",{"$f":"YTD!Q33","v":"N"},1,null,null,null,null,1.43,1,1.43,14,0,0]
[20,null,"N",{"$f":"YTD!P34","v":"Tom "},"N",{"$f":"YTD!Q34","v":"N"},null,null,null,null,null,null,{"$f":"G23+H23","v":0},{"$f":"L23-(I23*0.2)","v":0},35,0,0]
[21,null,"N",{"$f":"YTD!P35","v":"X"},"N",{"$f":"YTD!Q35","v":"N"},null,null,null,null,null,null,0,0,35,0,0]
[22,null,"N",{"$f":"YTD!P36","v":"X"},"N",{"$f":"YTD!Q36","v":"N"},null,null,null,null,null,null,0,0,35,0,0]
[23,null,"N",{"$f":"YTD!P37","v":"X"},"N",{"$f":"YTD!Q37","v":"N"},null,null,null,null,null,null,0,0,35,0,0]
[24,null,"N",{"$f":"YTD!P38","v":"X"},"N",{"$f":"YTD!Q38","v":"N"},null,null,null,null,null,null,0,0,35,0,0]
[25,null,"N",{"$f":"YTD!P39","v":"X"},"N",{"$f":"YTD!Q39","v":"N"},null,null,null,null,null,null,{"$f":"G28+H28","v":0},{"$f":"L28-(I28*0.2)","v":0},35,{"$f":"IF(F28=\"Y\",N28,0)","v":0},{"$f":"IF(E28=\"N\",0,(IF(F28=\"N\",0,1)))","v":0}]
[26,null,"N",{"$f":"YTD!P40","v":"X"},"N",{"$f":"YTD!Q40","v":"N"},null,null,null,null,null,null,{"$f":"G29+H29","v":0},{"$f":"L29-(I29*0.2)","v":0},35,{"$f":"IF(F29=\"Y\",N29,0)","v":0},{"$f":"IF(E29=\"N\",0,(IF(F29=\"N\",0,1)))","v":0}]
[null,null,null,"Totals",{"$f":"COUNTIF(E4:E29,\"Y\")","v":15},null,{"$f":"SUM(G4:G29)","v":55},{"$f":"SUM(H4:H29)","v":0},{"$f":"SUM(I4:I29)","v":2},{"$f":"MAX(J4:J29)","v":2.59},null,{"$f":"SUM(L4:L29)","v":82.06},{"$f":"SUM(M4:M29)","v":55},{"$f":"SUM(N4:N29)","v":81.660000000000011},null,{"$f":"SUM(P4:P29)","v":42.739999999999995},{"$f":"SUM(Q4:Q29)","v":7}]
[null,"Place","Team #","Partners",null,null,"Total Weight",null,"Place","Team #","Partners",null,null,"Total Weight",null,"NB Avg",{"$f":"IF(Q30=0,\"No Data\",P30/Q30)","v":6.105714285714285}]
[null,"1st",{"$f":"Teams!$AD94","v":5},{"$f":"VLOOKUP($C32,$B$4:$D$29,3,0)","v":"Anthony"},"&",{"$f":"IF($B$4:$B$29=20,\"#N/A\",IF(COUNTIF($B$4:$B$29,$C32)=1,\"Alone\",LOOKUP(2,1/($B$4:$B$29=$C32),$D$4:$D$29)))","v":"Rich T"},{"$f":"Teams!AE94","v":16.84},null,"4th",{"$f":"Teams!$AD97","v":3},{"$f":"VLOOKUP($J32,$B$4:$D$29,3,0)","v":"Dean"},"&",{"$f":"IF($B$4:$B$29=20,\"#N/A\",IF(COUNTIF($B$4:$B$29,$J32)=1,\"Alone\",LOOKUP(2,1/($B$4:$B$29=$J32),$D$4:$D$29)))","v":"Peter"},{"$f":"Teams!AE97","v":9.620000000000001}]
[null,"2nd",{"$f":"Teams!$AD95","v":7},{"$f":"VLOOKUP($C33,$B$4:$D$29,3,0)","v":"Ryan"},"&",{"$f":"IF($B$4:$B$29=20,\"#N/A\",IF(COUNTIF($B$4:$B$29,$C33)=1,\"Alone\",LOOKUP(2,1/($B$4:$B$29=$C33),$D$4:$D$29)))","v":"Steve D"},{"$f":"Teams!AE95","v":15.85},null,"5th",{"$f":"Teams!$AD98","v":1},{"$f":"VLOOKUP($J33,$B$4:$D$29,3,0)","v":"Morrie"},"&",{"$f":"IF($B$4:$B$29=20,\"#N/A\",IF(COUNTIF($B$4:$B$29,$J33)=1,\"Alone\",LOOKUP(2,1/($B$4:$B$29=$J33),$D$4:$D$29)))","v":"Rich B"},{"$f":"Teams!AE98","v":9.5500000000000007}]
[null,"3rd",{"$f":"Teams!$AD96","v":2},{"$f":"VLOOKUP($C34,$B$4:$D$29,3,0)","v":"Jim B"},"&",{"$f":"IF($B$4:$B$29=20,\"#N/A\",IF(COUNTIF($B$4:$B$29,$C34)=1,\"Alone\",LOOKUP(2,1/($B$4:$B$29=$C34),$D$4:$D$29)))","v":"Kevin"},{"$f":"Teams!AE96","v":14.330000000000002},null,"6th",{"$f":"Teams!$AD99","v":4},{"$f":"VLOOKUP($J34,$B$4:$D$29,3,0)","v":"Mike M"},"&",{"$f":"IF($B$4:$B$29=20,\"#N/A\",IF(COUNTIF($B$4:$B$29,$J34)=1,\"Alone\",LOOKUP(2,1/($B$4:$B$29=$J34),$D$4:$D$29)))","v":"Ron"},{"$f":"Teams!AE99","v":8.32}]

{"sheet":"Teams","index":8,"n_rows":120,"n_cols":31,"rows_kept":120,"cut":false,"hidden":false,"merged":[[31,16,31,27],[1,16,1,27],[61,16,61,27],[91,16,91,27],[1,0,1,11],[31,0,31,11],[61,0,61,11],[91,0,91,11]]}
[]
[{"$f":"YTD!L15","v":"Moodus"},null,null,null,null,null,null,null,null,null,null,null,"Sort","Copy","Sort",null,{"$f":"YTD!L19","v":"Twin Lakes"},null,null,null,null,null,null,null,null,null,null,null,"Sort","Copy","Sort"]
["Team #","Alone?","Name","Net Wt",null,"Team #","Alone?","Name","Net Wt",null,"Totals","Rank","Rank","Team #","Tot Wt",null,"Team #","Alone?","Name","Net Wt",null,"Team #","Alone?","Name","Net Wt",null,"Totals","Rank","Rank","Team #","Tot Wt"]
[{"$f":"Moodus!B4","v":5},{"$f":"Moodus!C4","v":"N"},{"$f":"Moodus!D4","v":"Anthony"},{"$f":"Moodus!N4","v":0.88},null,0,"N","X",0,null,{"$f":"IF(F4=20,0,IF(F4=F5,I4+I5,IF(G4=\"Y\",I4+I$30,0)))","v":0},{"$f":"IF(K4>0,RANK(K4,K$4:K$29,0),\"\")","v":""},1,2,9.4700000000000006,null,{"$f":"'Twin Lakes'!B4","v":10},{"$f":"'Twin Lakes'!C4","v":"N"},{"$f":"'Twin Lakes'!D4","v":"Anthony"},{"$f":"'Twin Lakes'!N4","v":0.86},null,0,"N","Armand",0,null,{"$f":"IF(V4=20,0,IF(V4=V5,Y4+Y5,IF(W4=\"Y\",Y4+Y$30,0)))","v":0},{"$f":"IF(AA4>0,RANK(AA4,AA$4:AA$29,0),\"\")","v":""},1,4,19.829999999999998]
[{"$f":"Moodus!B5","v":9},{"$f":"Moodus!C5","v":"N"},{"$f":"Moodus!D5","v":"Armand"},{"$f":"Moodus!N5","v":1.98},null,0,"N","X",0,null,{"$f":"IF(F5=20,0,IF(F5=F6,I5+I6,IF(G5=\"Y\",I5+I$30,0)))","v":0},{"$f":"IF(K5>0,RANK(K5,K$4:K$29,0),\"\")","v":""},2,4,6.15,null,{"$f":"'Twin Lakes'!B5","v":0},{"$f":"'Twin Lakes'!C5","v":"N"},{"$f":"'Twin Lakes'!D5","v":"Armand"},{"$f":"'Twin Lakes'!N5","v":0},null,0,"N","X",0,null,{"$f":"IF(V5=20,0,IF(V5=V6,Y5+Y6,IF(W5=\"Y\",Y5+Y$30,0)))","v":0},{"$f":"IF(AA5>0,RANK(AA5,AA$4:AA$29,0),\"\")","v":""},2,8,13.44]
[{"$f":"Moodus!B6","v":2},{"$f":"Moodus!C6","v":"N"},{"$f":"Moodus!D6","v":"Dean"},{"$f":"Moodus!N6","v":8.4},null,0,"N","X",0,null,0,"",3,1,5.97,null,{"$f":"'Twin Lakes'!B6","v":7},{"$f":"'Twin Lakes'!C6","v":"N"},{"$f":"'Twin Lakes'!D6","v":"Dean"},{"$f":"'Twin Lakes'!N6","v":3.15},null,0,"N","X",0,null,0,"",3,3,13.329999999999998]
[{"$f":"Moodus!B7","v":6},{"$f":"Moodus!C7","v":"N"},{"$f":"Moodus!D7","v":"Jack"},{"$f":"Moodus!N7","v":1.75},null,0,"N","X",0,null,0,"",4,10,4.8599999999999994,null,{"$f":"'Twin Lakes'!B7","v":9},{"$f":"'Twin Lakes'!C7","v":"N"},{"$f":"'Twin Lakes'!D7","v":"Jack"},{"$f":"'Twin Lakes'!N7","v":5.4},null,0,"N","X",0,null,0,"",4,6,12.98]
[{"$f":"Moodus!B8","v":8},{"$f":"Moodus!C8","v":"N"},{"$f":"Moodus!D8","v":"Jason"},{"$f":"Moodus!N8","v":0},null,0,"N","X",0,null,0,"",5,8,3.91,null,{"$f":"'Twin Lakes'!B8","v":8},{"$f":"'Twin Lakes'!C8","v":"N"},{"$f":"'Twin Lakes'!D8","v":"Jason"},{"$f":"'Twin Lakes'!N8","v":9.51},null,0,"N","X",0,null,0,"",5,2,12.114444444444445]
[{"$f":"Moodus!B9","v":2},{"$f":"Moodus!C9","v":"N"},{"$f":"Moodus!D9","v":"Jim B"},{"$f":"Moodus!N9","v":1.07},null,0,"N","X",0,null,0,"",6,3,3.87,null,{"$f":"'Twin Lakes'!B9","v":8},{"$f":"'Twin Lakes'!C9","v":"N"},{"$f":"'Twin Lakes'!D9","v":"Jim B"},{"$f":"'Twin Lakes'!N9","v":3.93},null,0,"N","X",0,null,0,"",6,5,11.780000000000001]
[{"$f":"Moodus!B10","v":1},{"$f":"Moodus!C10","v":"N"},{"$f":"Moodus!D10","v":"Kam"},{"$f":"Moodus!N10","v":1.01},null,1,"N","Kam",1.01,null,5.97,3,7,9,3.19,null,{"$f":"'Twin Lakes'!B10","v":1},{"$f":"'Twin Lakes'!C10","v":"N"},{"$f":"'Twin Lakes'!D10","v":"Kam"},{"$f":"'Twin Lakes'!N10","v":7.05},null,0,"N","X",0,null,0,"",7,9,10.84]
[{"$f":"Moodus!B11","v":4},{"$f":"Moodus!C11","v":"N"},{"$f":"Moodus!D11","v":"Kevin"},{"$f":"Moodus!N11","v":5.21},null,1,"N","Steve D",4.96,null,0,"",8,6,2.79,null,{"$f":"'Twin Lakes'!B11","v":4},{"$f":"'Twin Lakes'!C11","v":"N"},{"$f":"'Twin Lakes'!D11","v":"Kevin"},{"$f":"'Twin Lakes'!N11","v":6.93},null,1,"N","Kam",7.05,null,9.02,8,8,1,9.02]
[{"$f":"Moodus!B12","v":4},{"$f":"Moodus!C12","v":"N"},{"$f":"Moodus!D12","v":"Mike M"},{"$f":"Moodus!N12","v":0.94},null,2,"N","Dean",8.4,null,9.4700000000000006,1,9,5,2.0299999999999998,null,{"$f":"'Twin Lakes'!B12","v":7},{"$f":"'Twin Lakes'!C12","v":"N"},{"$f":"'Twin Lakes'!D12","v":"Mike M"},{"$f":"'Twin Lakes'!N12","v":1.75},null,1,"N","Morrie",1.97,null,0,"",9,10,6.53]
[{"$f":"Moodus!B13","v":10},{"$f":"Moodus!C13","v":"N"},{"$f":"Moodus!D13","v":"Mike G"},{"$f":"Moodus!N13","v":3.15},null,2,"N","Jim B",1.07,null,0,"",10,7,0.91,null,{"$f":"'Twin Lakes'!B13","v":6},{"$f":"'Twin Lakes'!C13","v":"N"},{"$f":"'Twin Lakes'!D13","v":"Mike G"},{"$f":"'Twin Lakes'!N13","v":3.05},null,2,"Y","Steve D",6.74,null,12.114444444444445,5,10,7,4.9000000000000004]
[{"$f":"Moodus!B14","v":10},{"$f":"Moodus!C14","v":"N"},{"$f":"Moodus!D14","v":"Morrie"},{"$f":"Moodus!N14","v":1.71},null,3,"N","Rich T",2.77,null,3.87,6,"",0,0,null,{"$f":"'Twin Lakes'!B14","v":1},{"$f":"'Twin Lakes'!C14","v":"N"},{"$f":"'Twin Lakes'!D14","v":"Morrie"},{"$f":"'Twin Lakes'!N14","v":1.97},null,3,"N","Ryan",6.77,null,13.329999999999998,3,"",0,0]
[{"$f":"Moodus!B15","v":8},{"$f":"Moodus!C15","v":"N"},{"$f":"Moodus!D15","v":"Peter"},{"$f":"Moodus!N15","v":3.97},null,3,"N","Ron",1.1000000000000001,null,0,"","",0,0,null,{"$f":"'Twin Lakes'!B15","v":5},{"$f":"'Twin Lakes'!C15","v":"N"},{"$f":"'Twin Lakes'!D15","v":"Peter"},{"$f":"'Twin Lakes'!N15","v":6.66},null,3,"N","Steve S",6.56,null,0,"","",0,0]
[{"$f":"Moodus!B16","v":7},{"$f":"Moodus!C16","v":"N"},{"$f":"Moodus!D16","v":"Rich B"},{"$f":"Moodus!N16","v":0},null,4,"N","Kevin",5.21,null,6.15,2,"",0,0,null,{"$f":"'Twin Lakes'!B16","v":5},{"$f":"'Twin Lakes'!C16","v":"N"},{"$f":"'Twin Lakes'!D16","v":"Rich B"},{"$f":"'Twin Lakes'!N16","v":5.12},null,4,"N","Kevin",6.93,null,19.829999999999998,1,"",0,0]
[{"$f":"Moodus!B17","v":3},{"$f":"Moodus!C17","v":"N"},{"$f":"Moodus!D17","v":"Rich T"},{"$f":"Moodus!N17","v":2.77},null,4,"N","Mike M",0.94,null,0,"","",0,0,null,{"$f":"'Twin Lakes'!B17","v":4},{"$f":"'Twin Lakes'!C17","v":"N"},{"$f":"'Twin Lakes'!D17","v":"Rich T"},{"$f":"'Twin Lakes'!N17","v":12.9},null,4,"N","Rich T",12.9,null,0,"","",0,0]
[{"$f":"Moodus!B18","v":3},{"$f":"Moodus!C18","v":"N"},{"$f":"Moodus!D18","v":"Ron"},{"$f":"Moodus!N18","v":1.1000000000000001},null,5,"N","Anthony",0.88,null,2.0299999999999998,9,"",0,0,null,{"$f":"'Twin Lakes'!B18","v":10},{"$f":"'Twin Lakes'!C18","v":"N"},{"$f":"'Twin Lakes'!D18","v":"Ron"},{"$f":"'Twin Lakes'!N18","v":5.67},null,5,"N","Peter",6.66,null,11.780000000000001,6,"",0,0]
[{"$f":"Moodus!B19","v":9},{"$f":"Moodus!C19","v":"N"},{"$f":"Moodus!D19","v":"Ryan"},{"$f":"Moodus!N19","v":1.21},null,5,"N","Steve S",1.1499999999999999,null,0,"","",0,0,null,{"$f":"'Twin Lakes'!B19","v":3},{"$f":"'Twin Lakes'!C19","v":"N"},{"$f":"'Twin Lakes'!D19","v":"Ryan"},{"$f":"'Twin Lakes'!N19","v":6.77},null,5,"N","Rich B",5.12,null,0,"","",0,0]
[{"$f":"Moodus!B20","v":7},{"$f":"Moodus!C20","v":"N"},{"$f":"Moodus!D20","v":"Scott"},{"$f":"Moodus!N20","v":0.91},null,6,"N","Jack",1.75,null,2.79,8,"",1,0,null,{"$f":"'Twin Lakes'!B20","v":9},{"$f":"'Twin Lakes'!C20","v":"N"},{"$f":"'Twin Lakes'!D20","v":"Scott"},{"$f":"'Twin Lakes'!N20","v":5.44},null,6,"N","Mike G",3.05,null,12.98,4,"",0,0]
[{"$f":"Moodus!B21","v":1},{"$f":"Moodus!C21","v":"N"},{"$f":"Moodus!D21","v":"Steve D"},{"$f":"Moodus!N21","v":4.96},null,6,"N","Tom ",1.04,null,0,"","",2,0,null,{"$f":"'Twin Lakes'!B21","v":2},{"$f":"'Twin Lakes'!C21","v":"Y"},{"$f":"'Twin Lakes'!D21","v":"Steve D"},{"$f":"'Twin Lakes'!N21","v":6.74},null,6,"N","Tom ",9.9300000000000015,null,0,"","",1,0]
[{"$f":"Moodus!B22","v":5},{"$f":"Moodus!C22","v":"N"},{"$f":"Moodus!D22","v":"Steve S"},{"$f":"Moodus!N22","v":1.1499999999999999},null,7,"N","Rich B",0,null,0.91,10,"",3,0,null,{"$f":"'Twin Lakes'!B22","v":3},{"$f":"'Twin Lakes'!C22","v":"N"},{"$f":"'Twin Lakes'!D22","v":"Steve S"},{"$f":"'Twin Lakes'!N22","v":6.56},null,7,"N","Dean",3.15,null,4.9000000000000004,10,"",3,0]
[{"$f":"Moodus!B23","v":6},{"$f":"Moodus!C23","v":"N"},{"$f":"Moodus!D23","v":"Tom "},{"$f":"Moodus!N23","v":1.04},null,7,"N","Scott",0.91,null,0,"","",4,0,null,{"$f":"'Twin Lakes'!B23","v":6},{"$f":"'Twin Lakes'!C23","v":"N"},{"$f":"'Twin Lakes'!D23","v":"Tom "},{"$f":"'Twin Lakes'!N23","v":9.9300000000000015},null,7,"N","Mike M",1.75,null,0,"","",4,0]
[{"$f":"Moodus!B24","v":0},{"$f":"Moodus!C24","v":"N"},{"$f":"Moodus!D24","v":"X"},{"$f":"Moodus!N24","v":0},null,8,"N","Jason",0,null,3.91,5,"",5,0,null,{"$f":"'Twin Lakes'!B24","v":0},{"$f":"'Twin Lakes'!C24","v":"N"},{"$f":"'Twin Lakes'!D24","v":"X"},{"$f":"'Twin Lakes'!N24","v":0},null,8,"N","Jason",9.51,null,13.44,2,"",5,0]
[{"$f":"Moodus!B25","v":0},{"$f":"Moodus!C25","v":"N"},{"$f":"Moodus!D25","v":"X"},{"$f":"Moodus!N25","v":0},null,8,"N","Peter",3.91,null,0,"","",6,0,null,{"$f":"'Twin Lakes'!B25","v":0},{"$f":"'Twin Lakes'!C25","v":"N"},{"$f":"'Twin Lakes'!D25","v":"X"},{"$f":"'Twin Lakes'!N25","v":0},null,8,"N","Jim B",3.93,null,0,"","",6,0]
[{"$f":"Moodus!B26","v":0},{"$f":"Moodus!C26","v":"N"},{"$f":"Moodus!D26","v":"X"},{"$f":"Moodus!N26","v":0},null,9,"N","Armand",1.98,null,3.19,7,"",7,0,null,{"$f":"'Twin Lakes'!B26","v":0},{"$f":"'Twin Lakes'!C26","v":"N"},{"$f":"'Twin Lakes'!D26","v":"X"},{"$f":"'Twin Lakes'!N26","v":0},null,9,"N","Jack",5.4,null,10.84,7,"",7,0]
[{"$f":"Moodus!B27","v":0},{"$f":"Moodus!C27","v":"N"},{"$f":"Moodus!D27","v":"X"},{"$f":"Moodus!N27","v":0},null,9,"N","Ryan",1.21,null,0,"","",8,0,null,{"$f":"'Twin Lakes'!B27","v":0},{"$f":"'Twin Lakes'!C27","v":"N"},{"$f":"'Twin Lakes'!D27","v":"X"},{"$f":"'Twin Lakes'!N27","v":0},null,9,"N","Scott",5.44,null,0,"","",8,0]
[{"$f":"Moodus!B28","v":0},{"$f":"Moodus!C28","v":"N"},{"$f":"Moodus!D28","v":"X"},{"$f":"Moodus!N28","v":0},null,10,"N","Mike G",3.15,null,4.8599999999999994,4,"",9,0,null,{"$f":"'Twin Lakes'!B28","v":0},{"$f":"'Twin Lakes'!C28","v":"N"},{"$f":"'Twin Lakes'!D28","v":"X"},{"$f":"'Twin Lakes'!N28","v":0},null,10,"N","Anthony",0.86,null,6.53,9,"",9,0]
[{"$f":"Moodus!B29","v":0},{"$f":"Moodus!C29","v":"N"},{"$f":"Moodus!D29","v":"X"},{"$f":"Moodus!N29","v":0},null,10,"N","Morrie",1.71,null,0,"","",10,0,null,{"$f":"'Twin Lakes'!B29","v":0},{"$f":"'Twin Lakes'!C29","v":"N"},{"$f":"'Twin Lakes'!D29","v":"X"},{"$f":"'Twin Lakes'!N29","v":0},null,10,"N","Ron",5.67,null,0,"","",10,0]
[null,"Macro","CTL+M","Teams",1,null,null,"NB Avg",{"$f":"Moodus!Q31","v":1.675},null,null,null,null,null,null,null,null,"Macro","CTL+Y","Teams",5,null,null,"NB Avg",{"$f":"'Twin Lakes'!Q31","v":5.3744444444444452}]
[]
[{"$f":"YTD!L16","v":"Bantam"},null,null,null,null,null,null,null,null,null,null,null,"Sort","Copy","Sort",null,{"$f":"YTD!L20","v":"Lillinonah"},null,null,null,null,null,null,null,null,null,null,null,"Sort","Copy","Sort"]
["Team #","Alone?","Name","Net Wt",null,"Team #","Alone?","Name","Net Wt",null,"Totals","Rank","Rank","Team #","Tot Wt",null,"Team #","Alone?","Name","Net Wt",null,"Team #","Alone?","Name","Net Wt",null,"Totals","Rank","Rank","Team #","Tot Wt"]
[{"$f":"Bantam!B4","v":1},{"$f":"Bantam!C4","v":"N"},{"$f":"Bantam!D4","v":"Anthony"},{"$f":"Bantam!N4","v":3.04},null,0,"N","Jim B",0,null,{"$f":"IF(F34=20,0,IF(F34=F35,I34+I35,IF(G34=\"Y\",I34+I$60,0)))","v":0},{"$f":"IF(K34>0,RANK(K34,K$34:K$59,0),\"\")","v":""},1,2,16.649999999999999,null,{"$f":"Lillinonah!B4","v":8},{"$f":"Lillinonah!C4","v":"N"},{"$f":"Lillinonah!D4","v":"Anthony"},{"$f":"Lillinonah!N4","v":7.21},null,0,"N","Peter",0,null,{"$f":"IF(V34=20,0,IF(V34=V35,Y34+Y35,IF(W34=\"Y\",Y34+Y$60,0)))","v":0},{"$f":"IF(AA34>0,RANK(AA34,AA$34:AA$59,0),\"\")","v":""},1,8,14.990000000000002]
[{"$f":"Bantam!B5","v":6},{"$f":"Bantam!C5","v":"N"},{"$f":"Bantam!D5","v":"Armand"},{"$f":"Bantam!N5","v":11.29},null,0,"N","Kam",0,null,{"$f":"IF(F35=20,0,IF(F35=F36,I35+I36,IF(G35=\"Y\",I35+I$60,0)))","v":0},{"$f":"IF(K35>0,RANK(K35,K$34:K$59,0),\"\")","v":""},2,1,15.739999999999998,null,{"$f":"Lillinonah!B5","v":7},{"$f":"Lillinonah!C5","v":"N"},{"$f":"Lillinonah!D5","v":"Armand"},{"$f":"Lillinonah!N5","v":3.08},null,0,"N","Ron",0,null,{"$f":"IF(V35=20,0,IF(V35=V36,Y35+Y36,IF(W35=\"Y\",Y35+$Y$60,0)))","v":0},{"$f":"IF(AA35>0,RANK(AA35,AA$34:AA$59,0),\"\")","v":""},2,6,13.83]
[{"$f":"Bantam!B6","v":1},{"$f":"Bantam!C6","v":"N"},{"$f":"Bantam!D6","v":"Dean"},{"$f":"Bantam!N6","v":12.7},null,0,"N","Mike G",0,null,0,"",3,3,11.38,null,{"$f":"Lillinonah!B6","v":3},{"$f":"Lillinonah!C6","v":"N"},{"$f":"Lillinonah!D6","v":"Dean"},{"$f":"Lillinonah!N6","v":6.44},null,0,"N","X",0,null,0,"",3,3,12.61]
[{"$f":"Bantam!B7","v":6},{"$f":"Bantam!C7","v":"N"},{"$f":"Bantam!D7","v":"Jack"},{"$f":"Bantam!N7","v":0},null,0,"N","X",0,null,0,"",4,6,11.29,null,{"$f":"Lillinonah!B7","v":2},{"$f":"Lillinonah!C7","v":"N"},{"$f":"Lillinonah!D7","v":"Jack"},{"$f":"Lillinonah!N7","v":2.31},null,0,"N","X",0,null,0,"",4,5,12.59]
[{"$f":"Bantam!B8","v":7},{"$f":"Bantam!C8","v":"N"},{"$f":"Bantam!D8","v":"Jason"},{"$f":"Bantam!N8","v":4.95},null,0,"N","X",0,null,0,"",5,7,6.53,null,{"$f":"Lillinonah!B8","v":8},{"$f":"Lillinonah!C8","v":"N"},{"$f":"Lillinonah!D8","v":"Jason"},{"$f":"Lillinonah!N8","v":7.7800000000000011},null,0,"N","X",0,null,0,"",5,9,10.14]
[{"$f":"Bantam!B9","v":0},{"$f":"Bantam!C9","v":"N"},{"$f":"Bantam!D9","v":"Jim B"},{"$f":"Bantam!N9","v":0},null,0,"N","X",0,null,0,"",6,8,4.5599999999999996,null,{"$f":"Lillinonah!B9","v":1},{"$f":"Lillinonah!C9","v":"N"},{"$f":"Lillinonah!D9","v":"Jim B"},{"$f":"Lillinonah!N9","v":0},null,0,"N","X",0,null,0,"",6,4,9.94]
[{"$f":"Bantam!B10","v":0},{"$f":"Bantam!C10","v":"N"},{"$f":"Bantam!D10","v":"Kam"},{"$f":"Bantam!N10","v":0},null,0,"N","X",0,null,0,"",7,4,3.75,null,{"$f":"Lillinonah!B10","v":6},{"$f":"Lillinonah!C10","v":"N"},{"$f":"Lillinonah!D10","v":"Kam"},{"$f":"Lillinonah!N10","v":3.24},null,0,"N","X",0,null,0,"",7,2,5.99]
[{"$f":"Bantam!B11","v":3},{"$f":"Bantam!C11","v":"N"},{"$f":"Bantam!D11","v":"Kevin"},{"$f":"Bantam!N11","v":11.38},null,0,"N","X",0,null,0,"",8,9,2.8650000000000002,null,{"$f":"Lillinonah!B11","v":6},{"$f":"Lillinonah!C11","v":"N"},{"$f":"Lillinonah!D11","v":"Kevin"},{"$f":"Lillinonah!N11","v":10.59},null,0,"N","X",0,null,0,"",8,7,5]
[{"$f":"Bantam!B12","v":8},{"$f":"Bantam!C12","v":"N"},{"$f":"Bantam!D12","v":"Mike M"},{"$f":"Bantam!N12","v":0},null,0,"N","X",0,null,0,"","",0,0,null,{"$f":"Lillinonah!B12","v":9},{"$f":"Lillinonah!C12","v":"N"},{"$f":"Lillinonah!D12","v":"Mike M"},{"$f":"Lillinonah!N12","v":3.84},null,1,"N","Jim B",0,null,0,"","",0,0]
[{"$f":"Bantam!B13","v":0},{"$f":"Bantam!C13","v":"N"},{"$f":"Bantam!D13","v":"Mike G"},{"$f":"Bantam!N13","v":0},null,1,"N","Anthony",3.04,null,15.739999999999998,2,"",0,0,null,{"$f":"Lillinonah!B13","v":7},{"$f":"Lillinonah!C13","v":"N"},{"$f":"Lillinonah!D13","v":"Mike G"},{"$f":"Lillinonah!N13","v":1.9200000000000002},null,1,"N","Tom ",0,null,0,"","",0,0]
[{"$f":"Bantam!B14","v":5},{"$f":"Bantam!C14","v":"N"},{"$f":"Bantam!D14","v":"Morrie"},{"$f":"Bantam!N14","v":0},null,1,"N","Dean",12.7,null,0,"","",0,0,null,{"$f":"Lillinonah!B14","v":9},{"$f":"Lillinonah!C14","v":"N"},{"$f":"Lillinonah!D14","v":"Morrie"},{"$f":"Lillinonah!N14","v":6.3},null,2,"N","Jack",2.31,null,5.99,7,"",0,0]
[{"$f":"Bantam!B15","v":4},{"$f":"Bantam!C15","v":"N"},{"$f":"Bantam!D15","v":"Peter"},{"$f":"Bantam!N15","v":2.7},null,2,"N","Scott",4.88,null,16.649999999999999,1,"",0,0,null,{"$f":"Lillinonah!B15","v":0},{"$f":"Lillinonah!C15","v":"N"},{"$f":"Lillinonah!D15","v":"Peter"},{"$f":"Lillinonah!N15","v":0},null,2,"N","Steve S",3.68,null,0,"","",0,0]
[{"$f":"Bantam!B16","v":8},{"$f":"Bantam!C16","v":"N"},{"$f":"Bantam!D16","v":"Rich B"},{"$f":"Bantam!N16","v":4.5599999999999996},null,2,"N","Steve D",11.77,null,0,"","",0,0,null,{"$f":"Lillinonah!B16","v":4},{"$f":"Lillinonah!C16","v":"N"},{"$f":"Lillinonah!D16","v":"Rich B"},{"$f":"Lillinonah!N16","v":4.09},null,3,"N","Dean",6.44,null,12.61,3,"",0,0]
[{"$f":"Bantam!B17","v":7},{"$f":"Bantam!C17","v":"N"},{"$f":"Bantam!D17","v":"Rich T"},{"$f":"Bantam!N17","v":1.58},null,3,"N","Kevin",11.38,null,11.38,3,"",0,0,null,{"$f":"Lillinonah!B17","v":4},{"$f":"Lillinonah!C17","v":"N"},{"$f":"Lillinonah!D17","v":"Rich T"},{"$f":"Lillinonah!N17","v":5.85},null,3,"N","Ryan",6.17,null,0,"","",0,0]
[{"$f":"Bantam!B18","v":5},{"$f":"Bantam!C18","v":"N"},{"$f":"Bantam!D18","v":"Ron"},{"$f":"Bantam!N18","v":0},null,3,"N","Ryan",0,null,0,"","",0,0,null,{"$f":"Lillinonah!B18","v":0},{"$f":"Lillinonah!C18","v":"N"},{"$f":"Lillinonah!D18","v":"Ron"},{"$f":"Lillinonah!N18","v":0},null,4,"N","Rich B",4.09,null,9.94,6,"",0,0]
[{"$f":"Bantam!B19","v":3},{"$f":"Bantam!C19","v":"N"},{"$f":"Bantam!D19","v":"Ryan"},{"$f":"Bantam!N19","v":0},null,4,"N","Peter",2.7,null,3.75,7,"",0,0,null,{"$f":"Lillinonah!B19","v":3},{"$f":"Lillinonah!C19","v":"N"},{"$f":"Lillinonah!D19","v":"Ryan"},{"$f":"Lillinonah!N19","v":6.17},null,4,"N","Rich T",5.85,null,0,"","",0,0]
[{"$f":"Bantam!B20","v":2},{"$f":"Bantam!C20","v":"N"},{"$f":"Bantam!D20","v":"Scott"},{"$f":"Bantam!N20","v":4.88},null,4,"N","Tom ",1.05,null,0,"","",0,0,null,{"$f":"Lillinonah!B20","v":5},{"$f":"Lillinonah!C20","v":"N"},{"$f":"Lillinonah!D20","v":"Scott"},{"$f":"Lillinonah!N20","v":4.74},null,5,"N","Scott",4.74,null,12.59,4,"",1,0]
[{"$f":"Bantam!B21","v":2},{"$f":"Bantam!C21","v":"N"},{"$f":"Bantam!D21","v":"Steve D"},{"$f":"Bantam!N21","v":11.77},null,5,"N","Morrie",0,null,0,"","",1,0,null,{"$f":"Lillinonah!B21","v":5},{"$f":"Lillinonah!C21","v":"N"},{"$f":"Lillinonah!D21","v":"Steve D"},{"$f":"Lillinonah!N21","v":7.8500000000000005},null,5,"N","Steve D",7.8500000000000005,null,0,"","",1,0]
[{"$f":"Bantam!B22","v":9},{"$f":"Bantam!C22","v":"Y"},{"$f":"Bantam!D22","v":"Steve S"},{"$f":"Bantam!N22","v":1.34},null,5,"N","Ron",0,null,0,"","",2,0,null,{"$f":"Lillinonah!B22","v":2},{"$f":"Lillinonah!C22","v":"N"},{"$f":"Lillinonah!D22","v":"Steve S"},{"$f":"Lillinonah!N22","v":3.68},null,6,"N","Kam",3.24,null,13.83,2,"",2,0]
[{"$f":"Bantam!B23","v":4},{"$f":"Bantam!C23","v":"N"},{"$f":"Bantam!D23","v":"Tom "},{"$f":"Bantam!N23","v":1.05},null,6,"N","Armand",11.29,null,11.29,4,"",3,0,null,{"$f":"Lillinonah!B23","v":1},{"$f":"Lillinonah!C23","v":"N"},{"$f":"Lillinonah!D23","v":"Tom "},{"$f":"Lillinonah!N23","v":0},null,6,"N","Kevin",10.59,null,0,"","",3,0]
[{"$f":"Bantam!B24","v":0},{"$f":"Bantam!C24","v":"N"},{"$f":"Bantam!D24","v":"X"},{"$f":"Bantam!N24","v":0},null,6,"N","Jack",0,null,0,"","",4,0,null,{"$f":"Lillinonah!B24","v":0},{"$f":"Lillinonah!C24","v":"N"},{"$f":"Lillinonah!D24","v":"X"},{"$f":"Lillinonah!N24","v":0},null,7,"N","Armand",3.08,null,5,8,"",4,0]
[{"$f":"Bantam!B25","v":0},{"$f":"Bantam!C25","v":"N"},{"$f":"Bantam!D25","v":"X"},{"$f":"Bantam!N25","v":0},null,7,"N","Jason",4.95,null,6.53,5,"",5,0,null,{"$f":"Lillinonah!B25","v":0},{"$f":"Lillinonah!C25","v":"N"},{"$f":"Lillinonah!D25","v":"X"},{"$f":"Lillinonah!N25","v":0},null,7,"N","Mike G",1.9200000000000002,null,0,"","",5,0]
[{"$f":"Bantam!B26","v":0},{"$f":"Bantam!C26","v":"N"},{"$f":"Bantam!D26","v":"X"},{"$f":"Bantam!N26","v":0},null,7,"N","Rich T",1.58,null,0,"","",5,0,null,{"$f":"Lillinonah!B26","v":0},{"$f":"Lillinonah!C26","v":"N"},{"$f":"Lillinonah!D26","v":"X"},{"$f":"Lillinonah!N26","v":0},null,8,"N","Anthony",7.21,null,14.990000000000002,1,"",6,0]
[{"$f":"Bantam!B27","v":0},{"$f":"Bantam!C27","v":"N"},{"$f":"Bantam!D27","v":"X"},{"$f":"Bantam!N27","v":0},null,8,"N","Mike M",0,null,4.5599999999999996,6,"",6,0,null,{"$f":"Lillinonah!B27","v":0},{"$f":"Lillinonah!C27","v":"N"},{"$f":"Lillinonah!D27","v":"X"},{"$f":"Lillinonah!N27","v":0},null,8,"N","Jason",7.7800000000000011,null,0,"","",7,0]
[{"$f":"Bantam!B28","v":0},{"$f":"Bantam!C28","v":"N"},{"$f":"Bantam!D28","v":"X"},{"$f":"Bantam!N28","v":0},null,8,"N","Rich B",4.5599999999999996,null,0,"","",7,0,null,{"$f":"Lillinonah!B28","v":0},{"$f":"Lillinonah!C28","v":"N"},{"$f":"Lillinonah!D28","v":"X"},{"$f":"Lillinonah!N28","v":0},null,9,"N","Mike M",3.84,null,10.14,5,"",8,0]
[{"$f":"Bantam!B29","v":0},{"$f":"Bantam!C29","v":"N"},{"$f":"Bantam!D29","v":"X"},{"$f":"Bantam!N29","v":0},null,9,"Y","Steve S",1.34,null,2.8650000000000002,8,"",8,0,null,{"$f":"Lillinonah!B29","v":0},{"$f":"Lillinonah!C29","v":"N"},{"$f":"Lillinonah!D29","v":"X"},{"$f":"Lillinonah!N29","v":0},null,9,"N","Morrie",6.3,null,0,"","",9,0]
[null,"Macro","CTL+D","Teams",2,null,null,"NB Avg",{"$f":"Bantam!Q31","v":1.5249999999999999},null,null,null,null,null,null,null,null,"Macro","CTL+T","Teams",6,null,null,"NB Avg",{"$f":"Lillinonah!Q31","v":3.9200000000000008}]
[]
[{"$f":"YTD!L17","v":"Gardner"},null,null,null,null,null,null,null,null,null,null,null,"Sort","Copy","Sort",null,{"$f":"YTD!L21","v":"CT River"},null,null,null,null,null,null,null,null,null,null,null,"Sort","Copy","Sort"]
["Team #","Alone?","Name","Net Wt",null,"Team #","Alone?","Name","Net Wt",null,"Totals","Rank","Rank","Team #","Tot Wt",null,"Team #","Alone?","Name","Net Wt",null,"Team #","Alone?","Name","Net Wt",null,"Totals","Rank","Rank","Team #","Tot Wt"]
[{"$f":"Gardner!B4","v":8},{"$f":"Gardner!C4","v":"N"},{"$f":"Gardner!D4","v":"Anthony"},{"$f":"Gardner!N4","v":9.09},null,0,"N","Jim B",0,null,{"$f":"IF(F64=20,0,IF(F64=F65,I64+I65,IF(G64=\"Y\",I64+I$90,0)))","v":0},{"$f":"IF(K64>0,RANK(K64,K$64:K$89,0),\"\")","v":""},1,5,15.99,null,{"$f":"'CT River'!B4","v":4},{"$f":"'CT River'!C4","v":"N"},{"$f":"'CT River'!D4","v":"Anthony"},{"$f":"'CT River'!N4","v":0},null,0,"N","Armand",0,null,{"$f":"IF(V64=20,0,IF(V64=V65,Y64+Y65,IF(W64=\"Y\",Y64+Y$90,0)))","v":0},{"$f":"IF(AA64>0,RANK(AA64,AA$64:AA$89,0),\"\")","v":""},1,2,15.72]
[{"$f":"Gardner!B5","v":2},{"$f":"Gardner!C5","v":"N"},{"$f":"Gardner!D5","v":"Armand"},{"$f":"Gardner!N5","v":4.2699999999999996},null,0,"N","Kam",0,null,{"$f":"IF(F65=20,0,IF(F65=F66,I65+I66,IF(G65=\"Y\",I65+I$90,0)))","v":0},{"$f":"IF(K65>0,RANK(K65,K$64:K$89,0),\"\")","v":""},2,8,15.69,null,{"$f":"'CT River'!B5","v":0},{"$f":"'CT River'!C5","v":"N"},{"$f":"'CT River'!D5","v":"Armand"},{"$f":"'CT River'!N5","v":0},null,0,"N","Jason",0,null,{"$f":"IF(V65=20,0,IF(V65=V66,Y65+Y66,IF(W65=\"Y\",Y65+Y$90,0)))","v":0},{"$f":"IF(AA65>0,RANK(AA65,AA$64:AA$89,0),\"\")","v":""},2,8,11.559999999999999]
[{"$f":"Gardner!B6","v":6},{"$f":"Gardner!C6","v":"Y"},{"$f":"Gardner!D6","v":"Dean"},{"$f":"Gardner!N6","v":7.01},null,0,"N","Morrie",0,null,0,"",3,4,15.02,null,{"$f":"'CT River'!B6","v":9},{"$f":"'CT River'!C6","v":"N"},{"$f":"'CT River'!D6","v":"Dean"},{"$f":"'CT River'!N6","v":1.31},null,0,"N","Jim B",0,null,0,"",3,7,6.58]
[{"$f":"Gardner!B7","v":7},{"$f":"Gardner!C7","v":"N"},{"$f":"Gardner!D7","v":"Jack"},{"$f":"Gardner!N7","v":4.9400000000000004},null,0,"N","X",0,null,0,"",4,9,14.85,null,{"$f":"'CT River'!B7","v":9},{"$f":"'CT River'!C7","v":"N"},{"$f":"'CT River'!D7","v":"Jack"},{"$f":"'CT River'!N7","v":1.07},null,0,"N","Mike G",0,null,0,"",4,3,4.6399999999999997]
[{"$f":"Gardner!B8","v":9},{"$f":"Gardner!C8","v":"N"},{"$f":"Gardner!D8","v":"Jason"},{"$f":"Gardner!N8","v":7.56},null,0,"N","X",0,null,0,"",5,3,14.24,null,{"$f":"'CT River'!B8","v":0},{"$f":"'CT River'!C8","v":"N"},{"$f":"'CT River'!D8","v":"Jason"},{"$f":"'CT River'!N8","v":0},null,0,"N","X",0,null,0,"",5,5,3.5]
[{"$f":"Gardner!B9","v":0},{"$f":"Gardner!C9","v":"N"},{"$f":"Gardner!D9","v":"Jim B"},{"$f":"Gardner!N9","v":0},null,0,"N","X",0,null,0,"",6,6,13.362500000000001,null,{"$f":"'CT River'!B9","v":0},{"$f":"'CT River'!C9","v":"N"},{"$f":"'CT River'!D9","v":"Jim B"},{"$f":"'CT River'!N9","v":0},null,0,"N","X",0,null,0,"",6,1,2.6814285714285715]
[{"$f":"Gardner!B10","v":0},{"$f":"Gardner!C10","v":"N"},{"$f":"Gardner!D10","v":"Kam"},{"$f":"Gardner!N10","v":0},null,0,"N","X",0,null,0,"",7,7,10.83,null,{"$f":"'CT River'!B10","v":2},{"$f":"'CT River'!C10","v":"N"},{"$f":"'CT River'!D10","v":"Kam"},{"$f":"'CT River'!N10","v":0},null,0,"N","X",0,null,0,"",7,9,2.38]
[{"$f":"Gardner!B11","v":7},{"$f":"Gardner!C11","v":"N"},{"$f":"Gardner!D11","v":"Kevin"},{"$f":"Gardner!N11","v":5.89},null,0,"N","X",0,null,0,"",8,2,10.75,null,{"$f":"'CT River'!B11","v":1},{"$f":"'CT River'!C11","v":"Y"},{"$f":"'CT River'!D11","v":"Kevin"},{"$f":"'CT River'!N11","v":0.83},null,0,"N","X",0,null,0,"",8,6,1.8514285714285716]
[{"$f":"Gardner!B12","v":1},{"$f":"Gardner!C12","v":"N"},{"$f":"Gardner!D12","v":"Mike M"},{"$f":"Gardner!N12","v":0.77},null,0,"N","X",0,null,0,"",9,1,4.9000000000000004,null,{"$f":"'CT River'!B12","v":8},{"$f":"'CT River'!C12","v":"N"},{"$f":"'CT River'!D12","v":"Mike M"},{"$f":"'CT River'!N12","v":2.8},null,0,"N","X",0,null,0,"",9,4,1.26]
[{"$f":"Gardner!B13","v":4},{"$f":"Gardner!C13","v":"N"},{"$f":"Gardner!D13","v":"Mike G"},{"$f":"Gardner!N13","v":6.75},null,1,"N","Mike M",0.77,null,4.9000000000000004,9,"",0,0,null,{"$f":"'CT River'!B13","v":0},{"$f":"'CT River'!C13","v":"N"},{"$f":"'CT River'!D13","v":"Mike G"},{"$f":"'CT River'!N13","v":0},null,0,"N","X",0,null,0,"","",0,0]
[{"$f":"Gardner!B14","v":0},{"$f":"Gardner!C14","v":"N"},{"$f":"Gardner!D14","v":"Morrie"},{"$f":"Gardner!N14","v":0},null,1,"N","Scott",4.13,null,0,"","",0,0,null,{"$f":"'CT River'!B14","v":7},{"$f":"'CT River'!C14","v":"N"},{"$f":"'CT River'!D14","v":"Morrie"},{"$f":"'CT River'!N14","v":4.0199999999999996},null,1,"Y","Kevin",0.83,null,2.6814285714285715,6,"",0,0]
[{"$f":"Gardner!B15","v":2},{"$f":"Gardner!C15","v":"N"},{"$f":"Gardner!D15","v":"Peter"},{"$f":"Gardner!N15","v":6.48},null,2,"N","Armand",4.2699999999999996,null,10.75,8,"",0,0,null,{"$f":"'CT River'!B15","v":3},{"$f":"'CT River'!C15","v":"N"},{"$f":"'CT River'!D15","v":"Peter"},{"$f":"'CT River'!N15","v":3.03},null,2,"N","Kam",0,null,15.72,1,"",0,0]
[{"$f":"Gardner!B16","v":3},{"$f":"Gardner!C16","v":"N"},{"$f":"Gardner!D16","v":"Rich B"},{"$f":"Gardner!N16","v":7.76},null,2,"N","Peter",6.48,null,0,"","",0,0,null,{"$f":"'CT River'!B16","v":2},{"$f":"'CT River'!C16","v":"N"},{"$f":"'CT River'!D16","v":"Rich B"},{"$f":"'CT River'!N16","v":15.72},null,2,"N","Rich B",15.72,null,0,"","",0,0]
[{"$f":"Gardner!B17","v":5},{"$f":"Gardner!C17","v":"N"},{"$f":"Gardner!D17","v":"Rich T"},{"$f":"Gardner!N17","v":8.75},null,3,"N","Rich B",7.76,null,14.24,5,"",0,0,null,{"$f":"'CT River'!B17","v":5},{"$f":"'CT River'!C17","v":"N"},{"$f":"'CT River'!D17","v":"Rich T"},{"$f":"'CT River'!N17","v":3.5},null,3,"N","Peter",3.03,null,4.6399999999999997,4,"",0,0]
[{"$f":"Gardner!B18","v":4},{"$f":"Gardner!C18","v":"N"},{"$f":"Gardner!D18","v":"Ron"},{"$f":"Gardner!N18","v":8.27},null,3,"N","Ryan",6.48,null,0,"","",0,0,null,{"$f":"'CT River'!B18","v":6},{"$f":"'CT River'!C18","v":"Y"},{"$f":"'CT River'!D18","v":"Ron"},{"$f":"'CT River'!N18","v":0},null,3,"N","Steve S",1.61,null,0,"","",0,0]
[{"$f":"Gardner!B19","v":3},{"$f":"Gardner!C19","v":"N"},{"$f":"Gardner!D19","v":"Ryan"},{"$f":"Gardner!N19","v":6.48},null,4,"N","Mike G",6.75,null,15.02,3,"",0,0,null,{"$f":"'CT River'!B19","v":7},{"$f":"'CT River'!C19","v":"N"},{"$f":"'CT River'!D19","v":"Ryan"},{"$f":"'CT River'!N19","v":2.56},null,4,"N","Anthony",0,null,1.26,9,"",0,0]
[{"$f":"Gardner!B20","v":1},{"$f":"Gardner!C20","v":"N"},{"$f":"Gardner!D20","v":"Scott"},{"$f":"Gardner!N20","v":4.13},null,4,"N","Ron",8.27,null,0,"","",0,0,null,{"$f":"'CT River'!B20","v":5},{"$f":"'CT River'!C20","v":"N"},{"$f":"'CT River'!D20","v":"Scott"},{"$f":"'CT River'!N20","v":0},null,4,"N","Tom ",1.26,null,0,"","",0,0]
[{"$f":"Gardner!B21","v":9},{"$f":"Gardner!C21","v":"N"},{"$f":"Gardner!D21","v":"Steve D"},{"$f":"Gardner!N21","v":7.29},null,5,"N","Rich T",8.75,null,15.99,1,"",0,0,null,{"$f":"'CT River'!B21","v":8},{"$f":"'CT River'!C21","v":"N"},{"$f":"'CT River'!D21","v":"Steve D"},{"$f":"'CT River'!N21","v":8.76},null,5,"N","Rich T",3.5,null,3.5,5,"",0,0]
[{"$f":"Gardner!B22","v":8},{"$f":"Gardner!C22","v":"N"},{"$f":"Gardner!D22","v":"Steve S"},{"$f":"Gardner!N22","v":6.6},null,5,"N","Tom ",7.24,null,0,"","",1,0,null,{"$f":"'CT River'!B22","v":3},{"$f":"'CT River'!C22","v":"N"},{"$f":"'CT River'!D22","v":"Steve S"},{"$f":"'CT River'!N22","v":1.61},null,5,"N","Scott",0,null,0,"","",0,0]
[{"$f":"Gardner!B23","v":5},{"$f":"Gardner!C23","v":"N"},{"$f":"Gardner!D23","v":"Tom "},{"$f":"Gardner!N23","v":7.24},null,6,"Y","Dean",7.01,null,13.362500000000001,6,"",2,0,null,{"$f":"'CT River'!B23","v":4},{"$f":"'CT River'!C23","v":"N"},{"$f":"'CT River'!D23","v":"Tom "},{"$f":"'CT River'!N23","v":1.26},null,6,"Y","Ron",0,null,1.8514285714285716,8,"",2,0]
[{"$f":"Gardner!B24","v":0},{"$f":"Gardner!C24","v":"N"},{"$f":"Gardner!D24","v":"X"},{"$f":"Gardner!N24","v":0},null,7,"N","Jack",4.9400000000000004,null,10.83,7,"",3,0,null,{"$f":"'CT River'!B24","v":0},{"$f":"'CT River'!C24","v":"N"},{"$f":"'CT River'!D24","v":"X"},{"$f":"'CT River'!N24","v":0},null,7,"N","Morrie",4.0199999999999996,null,6.58,3,"",3,0]
[{"$f":"Gardner!B25","v":0},{"$f":"Gardner!C25","v":"N"},{"$f":"Gardner!D25","v":"X"},{"$f":"Gardner!N25","v":0},null,7,"N","Kevin",5.89,null,0,"","",4,0,null,{"$f":"'CT River'!B25","v":0},{"$f":"'CT River'!C25","v":"N"},{"$f":"'CT River'!D25","v":"X"},{"$f":"'CT River'!N25","v":0},null,7,"N","Ryan",2.56,null,0,"","",4,0]
[{"$f":"Gardner!B26","v":0},{"$f":"Gardner!C26","v":"N"},{"$f":"Gardner!D26","v":"X"},{"$f":"Gardner!N26","v":0},null,8,"N","Anthony",9.09,null,15.69,2,"",5,0,null,{"$f":"'CT River'!B26","v":0},{"$f":"'CT River'!C26","v":"N"},{"$f":"'CT River'!D26","v":"X"},{"$f":"'CT River'!N26","v":0},null,8,"N","Mike M",2.8,null,11.559999999999999,2,"",5,0]
[{"$f":"Gardner!B27","v":0},{"$f":"Gardner!C27","v":"N"},{"$f":"Gardner!D27","v":"X"},{"$f":"Gardner!N27","v":0},null,8,"N","Steve S",6.6,null,0,"","",7,0,null,{"$f":"'CT River'!B27","v":0},{"$f":"'CT River'!C27","v":"N"},{"$f":"'CT River'!D27","v":"X"},{"$f":"'CT River'!N27","v":0},null,8,"N","Steve D",8.76,null,0,"","",7,0]
[{"$f":"Gardner!B28","v":0},{"$f":"Gardner!C28","v":"N"},{"$f":"Gardner!D28","v":"X"},{"$f":"Gardner!N28","v":0},null,9,"N","Jason",7.56,null,14.85,4,"",8,0,null,{"$f":"'CT River'!B28","v":0},{"$f":"'CT River'!C28","v":"N"},{"$f":"'CT River'!D28","v":"X"},{"$f":"'CT River'!N28","v":0},null,9,"N","Dean",1.31,null,2.38,7,"",8,0]
[{"$f":"Gardner!B29","v":0},{"$f":"Gardner!C29","v":"N"},{"$f":"Gardner!D29","v":"X"},{"$f":"Gardner!N29","v":0},null,9,"N","Steve D",7.29,null,0,"","",9,0,null,{"$f":"'CT River'!B29","v":0},{"$f":"'CT River'!C29","v":"N"},{"$f":"'CT River'!D29","v":"X"},{"$f":"'CT River'!N29","v":0},null,9,"N","Jack",1.07,null,0,"","",9,0]
[null,"Macro","CTL+H","Teams",3,null,null,"NB Avg",{"$f":"Gardner!Q31","v":6.3525000000000009},null,null,null,null,null,null,null,null,"Macro","CTL+E","Teams",7,null,null,"NB Avg",{"$f":"'CT River'!Q31","v":1.8514285714285716}]
[]
[{"$f":"YTD!L18","v":"Candlewood"},null,null,null,null,null,null,null,null,null,null,null,"Sort","Copy","Sort",null,{"$f":"YTD!L22","v":"Bashan"},null,null,null,null,null,null,null,null,null,null,null,"Sort","Copy","Sort"]
["Team #","Alone?","Name","Net Wt",null,"Team #","Alone?","Name","Net Wt",null,"Totals","Rank","Rank","Team #","Tot Wt",null,"Team #","Alone?","Name","Net Wt",null,"Team #","Alone?","Name","Net Wt",null,"Totals","Rank","Rank","Team #","Tot Wt"]
[{"$f":"Candlewood!B4","v":8},{"$f":"Candlewood!C4","v":"N"},{"$f":"Candlewood!D4","v":"Anthony"},{"$f":"Candlewood!N4","v":0},null,0,"N","Kam",0,null,{"$f":"IF(F94=20,0,IF(F94=F95,I94+I95,IF(G94=\"Y\",I94+I$120,0)))","v":0},{"$f":"IF(K94>0,RANK(K94,K$94:K$119,0),\"\")","v":""},1,3,9.4,null,{"$f":"Bashan!B4","v":5},{"$f":"Bashan!C4","v":"N"},{"$f":"Bashan!D4","v":"Anthony"},{"$f":"Bashan!N4","v":7.48},null,0,"N","Armand",0,null,{"$f":"IF(V94=20,0,IF(V94=V95,Y94+Y95,IF(W94=\"Y\",Y94+Y$120,0)))","v":0},{"$f":"IF(AA94>0,RANK(AA94,AA$94:AA$119,0),\"\")","v":""},1,5,16.84]
[{"$f":"Candlewood!B5","v":4},{"$f":"Candlewood!C5","v":"N"},{"$f":"Candlewood!D5","v":"Armand"},{"$f":"Candlewood!N5","v":1.68},null,0,"N","Morrie",0,null,{"$f":"IF(F95=20,0,IF(F95=F96,I95+I96,IF(G95=\"Y\",I95+I$120,0)))","v":0},{"$f":"IF(K95>0,RANK(K95,K$94:K$119,0),\"\")","v":""},2,2,9.0500000000000007,null,{"$f":"Bashan!B5","v":0},{"$f":"Bashan!C5","v":"N"},{"$f":"Bashan!D5","v":"Armand"},{"$f":"Bashan!N5","v":0},null,0,"N","Jack",0,null,{"$f":"IF(V95=20,0,IF(V95=V96,Y95+Y96,IF(W95=\"Y\",Y95+Y$120,0)))","v":0},{"$f":"IF(AA95>0,RANK(AA95,AA$94:AA$119,0),\"\")","v":""},2,7,15.85]
[{"$f":"Candlewood!B6","v":2},{"$f":"Candlewood!C6","v":"N"},{"$f":"Candlewood!D6","v":"Dean"},{"$f":"Candlewood!N6","v":5.0199999999999996},null,0,"N","Steve S",0,null,0,"",3,7,7.33,null,{"$f":"Bashan!B6","v":3},{"$f":"Bashan!C6","v":"N"},{"$f":"Bashan!D6","v":"Dean"},{"$f":"Bashan!N6","v":3.72},null,0,"N","Jason",0,null,0,"",3,2,14.330000000000002]
[{"$f":"Candlewood!B7","v":1},{"$f":"Candlewood!C7","v":"N"},{"$f":"Candlewood!D7","v":"Jack"},{"$f":"Candlewood!N7","v":3.46},null,0,"N","X",0,null,0,"",4,9,7.2,null,{"$f":"Bashan!B7","v":0},{"$f":"Bashan!C7","v":"N"},{"$f":"Bashan!D7","v":"Jack"},{"$f":"Bashan!N7","v":0},null,0,"N","Mike G",0,null,0,"",4,3,9.620000000000001]
[{"$f":"Candlewood!B8","v":3},{"$f":"Candlewood!C8","v":"N"},{"$f":"Candlewood!D8","v":"Jason"},{"$f":"Candlewood!N8","v":6.32},null,0,"N","X",0,null,0,"",5,8,6.66,null,{"$f":"Bashan!B8","v":0},{"$f":"Bashan!C8","v":"N"},{"$f":"Bashan!D8","v":"Jason"},{"$f":"Bashan!N8","v":0},null,0,"N","Tom ",0,null,0,"",5,1,9.5500000000000007]
[{"$f":"Candlewood!B9","v":5},{"$f":"Candlewood!C9","v":"N"},{"$f":"Candlewood!D9","v":"Jim B"},{"$f":"Candlewood!N9","v":2.77},null,0,"N","X",0,null,0,"",6,5,5.7799999999999994,null,{"$f":"Bashan!B9","v":2},{"$f":"Bashan!C9","v":"N"},{"$f":"Bashan!D9","v":"Jim B"},{"$f":"Bashan!N9","v":8.0500000000000007},null,0,"N","X",0,null,0,"",6,4,8.32]
[{"$f":"Candlewood!B10","v":0},{"$f":"Candlewood!C10","v":"N"},{"$f":"Candlewood!D10","v":"Kam"},{"$f":"Candlewood!N10","v":0},null,0,"N","X",0,null,0,"",7,4,5.56,null,{"$f":"Bashan!B10","v":6},{"$f":"Bashan!C10","v":"N"},{"$f":"Bashan!D10","v":"Kam"},{"$f":"Bashan!N10","v":0},null,0,"N","X",0,null,0,"",7,8,7.5357142857142847]
[{"$f":"Candlewood!B11","v":9},{"$f":"Candlewood!C11","v":"N"},{"$f":"Candlewood!D11","v":"Kevin"},{"$f":"Candlewood!N11","v":5.94},null,0,"N","X",0,null,0,"",8,1,5.21,null,{"$f":"Bashan!B11","v":2},{"$f":"Bashan!C11","v":"N"},{"$f":"Bashan!D11","v":"Kevin"},{"$f":"Bashan!N11","v":6.28},null,0,"N","X",0,null,0,"",8,6,5.72]
[{"$f":"Candlewood!B12","v":2},{"$f":"Candlewood!C12","v":"N"},{"$f":"Candlewood!D12","v":"Mike M"},{"$f":"Candlewood!N12","v":4.03},null,0,"N","X",0,null,0,"",9,6,3.4450000000000003,null,{"$f":"Bashan!B12","v":4},{"$f":"Bashan!C12","v":"N"},{"$f":"Bashan!D12","v":"Mike M"},{"$f":"Bashan!N12","v":6.33},null,0,"N","X",0,null,0,"","",0,0]
[{"$f":"Candlewood!B13","v":3},{"$f":"Candlewood!C13","v":"N"},{"$f":"Candlewood!D13","v":"Mike G"},{"$f":"Candlewood!N13","v":3.08},null,1,"N","Jack",3.46,null,5.21,8,"",0,0,null,{"$f":"Bashan!B13","v":0},{"$f":"Bashan!C13","v":"N"},{"$f":"Bashan!D13","v":"Mike G"},{"$f":"Bashan!N13","v":0},null,0,"N","X",0,null,0,"","",0,0]
[{"$f":"Candlewood!B14","v":0},{"$f":"Candlewood!C14","v":"N"},{"$f":"Candlewood!D14","v":"Morrie"},{"$f":"Candlewood!N14","v":0},null,1,"N","Rich B",1.75,null,0,"","",0,0,null,{"$f":"Bashan!B14","v":1},{"$f":"Bashan!C14","v":"N"},{"$f":"Bashan!D14","v":"Morrie"},{"$f":"Bashan!N14","v":2.33},null,0,"N","X",0,null,0,"","",0,0]
[{"$f":"Candlewood!B15","v":9},{"$f":"Candlewood!C15","v":"N"},{"$f":"Candlewood!D15","v":"Peter"},{"$f":"Candlewood!N15","v":1.26},null,2,"N","Dean",5.0199999999999996,null,9.0500000000000007,2,"",0,0,null,{"$f":"Bashan!B15","v":3},{"$f":"Bashan!C15","v":"N"},{"$f":"Bashan!D15","v":"Peter"},{"$f":"Bashan!N15","v":5.9},null,1,"N","Morrie",2.33,null,9.5500000000000007,5,"",0,0]
[{"$f":"Candlewood!B16","v":1},{"$f":"Candlewood!C16","v":"N"},{"$f":"Candlewood!D16","v":"Rich B"},{"$f":"Candlewood!N16","v":1.75},null,2,"N","Mike M",4.03,null,0,"","",0,0,null,{"$f":"Bashan!B16","v":1},{"$f":"Bashan!C16","v":"N"},{"$f":"Bashan!D16","v":"Rich B"},{"$f":"Bashan!N16","v":7.22},null,1,"N","Rich B",7.22,null,0,"","",0,0]
[{"$f":"Candlewood!B17","v":4},{"$f":"Candlewood!C17","v":"N"},{"$f":"Candlewood!D17","v":"Rich T"},{"$f":"Candlewood!N17","v":3.88},null,3,"N","Jason",6.32,null,9.4,1,"",0,0,null,{"$f":"Bashan!B17","v":5},{"$f":"Bashan!C17","v":"N"},{"$f":"Bashan!D17","v":"Rich T"},{"$f":"Bashan!N17","v":9.36},null,2,"N","Jim B",8.0500000000000007,null,14.330000000000002,3,"",0,0]
[{"$f":"Candlewood!B18","v":5},{"$f":"Candlewood!C18","v":"N"},{"$f":"Candlewood!D18","v":"Ron"},{"$f":"Candlewood!N18","v":3.01},null,3,"N","Mike G",3.08,null,0,"","",0,0,null,{"$f":"Bashan!B18","v":4},{"$f":"Bashan!C18","v":"N"},{"$f":"Bashan!D18","v":"Ron"},{"$f":"Bashan!N18","v":1.99},null,2,"N","Kevin",6.28,null,0,"","",0,0]
[{"$f":"Candlewood!B19","v":7},{"$f":"Candlewood!C19","v":"N"},{"$f":"Candlewood!D19","v":"Ryan"},{"$f":"Candlewood!N19","v":1},null,4,"N","Armand",1.68,null,5.56,7,"",0,0,null,{"$f":"Bashan!B19","v":7},{"$f":"Bashan!C19","v":"N"},{"$f":"Bashan!D19","v":"Ryan"},{"$f":"Bashan!N19","v":7.76},null,3,"N","Dean",3.72,null,9.620000000000001,4,"",0,0]
[{"$f":"Candlewood!B20","v":7},{"$f":"Candlewood!C20","v":"N"},{"$f":"Candlewood!D20","v":"Scott"},{"$f":"Candlewood!N20","v":6.33},null,4,"N","Rich T",3.88,null,0,"","",0,0,null,{"$f":"Bashan!B20","v":6},{"$f":"Bashan!C20","v":"N"},{"$f":"Bashan!D20","v":"Scott"},{"$f":"Bashan!N20","v":5.72},null,3,"N","Peter",5.9,null,0,"","",0,0]
[{"$f":"Candlewood!B21","v":8},{"$f":"Candlewood!C21","v":"N"},{"$f":"Candlewood!D21","v":"Steve D"},{"$f":"Candlewood!N21","v":6.66},null,5,"N","Jim B",2.77,null,5.7799999999999994,6,"",0,0,null,{"$f":"Bashan!B21","v":7},{"$f":"Bashan!C21","v":"N"},{"$f":"Bashan!D21","v":"Steve D"},{"$f":"Bashan!N21","v":8.09},null,4,"N","Mike M",6.33,null,8.32,6,"",0,0]
[{"$f":"Candlewood!B22","v":0},{"$f":"Candlewood!C22","v":"N"},{"$f":"Candlewood!D22","v":"Steve S"},{"$f":"Candlewood!N22","v":0},null,5,"N","Ron",3.01,null,0,"","",1,0,null,{"$f":"Bashan!B22","v":8},{"$f":"Bashan!C22","v":"Y"},{"$f":"Bashan!D22","v":"Steve S"},{"$f":"Bashan!N22","v":1.43},null,4,"N","Ron",1.99,null,0,"","",0,0]
[{"$f":"Candlewood!B23","v":6},{"$f":"Candlewood!C23","v":"Y"},{"$f":"Candlewood!D23","v":"Tom "},{"$f":"Candlewood!N23","v":1.01},null,6,"Y","Tom ",1.01,null,3.4450000000000003,9,"",2,0,null,{"$f":"Bashan!B23","v":0},{"$f":"Bashan!C23","v":"N"},{"$f":"Bashan!D23","v":"Tom "},{"$f":"Bashan!N23","v":0},null,5,"N","Anthony",7.48,null,16.84,1,"",1,0]
[{"$f":"Candlewood!B24","v":0},{"$f":"Candlewood!C24","v":"N"},{"$f":"Candlewood!D24","v":"X"},{"$f":"Candlewood!N24","v":0},null,7,"N","Ryan",1,null,7.33,3,"",3,0,null,{"$f":"Bashan!B24","v":0},{"$f":"Bashan!C24","v":"N"},{"$f":"Bashan!D24","v":"X"},{"$f":"Bashan!N24","v":0},null,5,"N","Rich T",9.36,null,0,"","",2,0]
[{"$f":"Candlewood!B25","v":0},{"$f":"Candlewood!C25","v":"N"},{"$f":"Candlewood!D25","v":"X"},{"$f":"Candlewood!N25","v":0},null,7,"N","Scott",6.33,null,0,"","",4,0,null,{"$f":"Bashan!B25","v":0},{"$f":"Bashan!C25","v":"N"},{"$f":"Bashan!D25","v":"X"},{"$f":"Bashan!N25","v":0},null,6,"N","Kam",0,null,5.72,8,"",3,0]
[{"$f":"Candlewood!B26","v":0},{"$f":"Candlewood!C26","v":"N"},{"$f":"Candlewood!D26","v":"X"},{"$f":"Candlewood!N26","v":0},null,8,"N","Anthony",0,null,6.66,5,"",5,0,null,{"$f":"Bashan!B26","v":0},{"$f":"Bashan!C26","v":"N"},{"$f":"Bashan!D26","v":"X"},{"$f":"Bashan!N26","v":0},null,6,"N","Scott",5.72,null,0,"","",4,0]
[{"$f":"Candlewood!B27","v":0},{"$f":"Candlewood!C27","v":"N"},{"$f":"Candlewood!D27","v":"X"},{"$f":"Candlewood!N27","v":0},null,8,"N","Steve D",6.66,null,0,"","",7,0,null,{"$f":"Bashan!B27","v":0},{"$f":"Bashan!C27","v":"N"},{"$f":"Bashan!D27","v":"X"},{"$f":"Bashan!N27","v":0},null,7,"N","Ryan",7.76,null,15.85,2,"",5,0]
[{"$f":"Candlewood!B28","v":0},{"$f":"Candlewood!C28","v":"N"},{"$f":"Candlewood!D28","v":"X"},{"$f":"Candlewood!N28","v":0},null,9,"N","Kevin",5.94,null,7.2,4,"",8,0,null,{"$f":"Bashan!B28","v":0},{"$f":"Bashan!C28","v":"N"},{"$f":"Bashan!D28","v":"X"},{"$f":"Bashan!N28","v":0},null,7,"N","Steve D",8.09,null,0,"","",6,0]
[{"$f":"Candlewood!B29","v":0},{"$f":"Candlewood!C29","v":"N"},{"$f":"Candlewood!D29","v":"X"},{"$f":"Candlewood!N29","v":0},null,9,"N","Peter",1.26,null,0,"","",9,0,null,{"$f":"Bashan!B29","v":0},{"$f":"Bashan!C29","v":"N"},{"$f":"Bashan!D29","v":"X"},{"$f":"Bashan!N29","v":0},null,8,"Y","Steve S",1.43,null,7.5357142857142847,7,"",7,0]
[null,"Macro","CTL+N","Teams",4,null,null,"NB Avg",{"$f":"Candlewood!Q31","v":2.4350000000000001},null,null,null,null,null,null,null,null,"Macro","CTL+Q","Teams",8,null,null,"NB Avg",{"$f":"Bashan!Q31","v":6.105714285714285}]

{"sheet":"YTD","index":9,"n_rows":103,"n_cols":34,"rows_kept":103,"cut":false,"hidden":false,"merged":[[74,15,74,17],[74,18,74,20],[74,21,74,23],[15,11,15,12],[16,11,16,12],[17,11,17,12],[73,0,73,23],[74,0,74,2],[74,3,74,5],[74,6,74,8],[12,22,12,28],[43,0,43,16],[44,18,44,19],[44,0,44,1],[44,6,44,7],[14,11,14,12],[44,2,44,3],[44,4,44,5],[20,11,20,12],[44,10,44,11],[44,8,44,9],[18,11,18,12],[21,11,21,12],[13,11,13,12],[74,9,74,11],[74,12,74,14],[13,8,13,9],[19,11,19,12],[13,18,13,33],[14,30,14,31],[14,24,14,25],[44,12,44,13],[44,14,44,15],[14,32,14,33],[14,20,14,21],[14,22,14,23],[14,26,14,27],[14,28,14,29],[14,18,14,19]]}
[null,{"$f":"P15","v":"Anthony"},{"$f":"P16","v":"Armand"},{"$f":"P17","v":"Dean"},{"$f":"P18","v":"Jack"},{"$f":"P19","v":"Jason"},{"$f":"P20","v":"Jim B"},{"$f":"P21","v":"Kam"},{"$f":"P22","v":"Kevin"},{"$f":"P23","v":"Mike M"},{"$f":"P24","v":"Mike G"},{"$f":"P25","v":"Morrie"},{"$f":"P26","v":"Peter"},{"$f":"P27","v":"Rich B"},{"$f":"P28","v":"Rich T"},{"$f":"P29","v":"Ron"},{"$f":"P30","v":"Ryan"},{"$f":"P31","v":"Scott"},{"$f":"P32","v":"Steve D"},{"$f":"P33","v":"Steve S"},{"$f":"P34","v":"Tom "},{"$f":"P35","v":"X"},{"$f":"P36","v":"X"},{"$f":"P37","v":"X"},{"$f":"P38","v":"X"},{"$f":"P39","v":"X"},{"$f":"P40","v":"X"}]
[null,{"$f":"Gardner!O4","v":1},{"$f":"Bantam!O5","v":4},{"$f":"Moodus!O6","v":1},{"$f":"Moodus!O7","v":8},{"$f":"Candlewood!O8","v":3},{"$f":"Bashan!O9","v":3},{"$f":"'Twin Lakes'!O10","v":4},{"$f":"Lillinonah!O11","v":1},{"$f":"Candlewood!O12","v":6},{"$f":"Moodus!O13","v":5},{"$f":"'CT River'!O14","v":3},{"$f":"Moodus!O15","v":4},{"$f":"'CT River'!O16","v":1},{"$f":"'Twin Lakes'!O17","v":1},{"$f":"Gardner!O18","v":3},{"$f":"Bashan!O19","v":4},{"$f":"Candlewood!O20","v":2},{"$f":"Candlewood!O21","v":1},{"$f":"'CT River'!O22","v":8},{"$f":"'Twin Lakes'!O23","v":2},{"$f":"Moodus!O24","v":35},{"$f":"Bantam!O25","v":35},{"$f":"Lillinonah!O26","v":35},{"$f":"Candlewood!O27","v":35},{"$f":"'Twin Lakes'!O28","v":35},{"$f":"Bashan!O29","v":35}]
[null,{"$f":"Lillinonah!O4","v":4},{"$f":"Moodus!O5","v":7},{"$f":"Bantam!O6","v":1},{"$f":"Candlewood!O7","v":8},{"$f":"'Twin Lakes'!O8","v":3},{"$f":"Candlewood!O9","v":11},{"$f":"Lillinonah!O10","v":13},{"$f":"Moodus!O11","v":2},{"$f":"'CT River'!O12","v":6},{"$f":"Gardner!O13","v":9},{"$f":"Lillinonah!O14","v":6},{"$f":"'CT River'!O15","v":5},{"$f":"Gardner!O16","v":4},{"$f":"Bashan!O17","v":1},{"$f":"Candlewood!O18","v":10},{"$f":"'Twin Lakes'!O19","v":6},{"$f":"Bantam!O20","v":6},{"$f":"Bantam!O21","v":2},{"$f":"'Twin Lakes'!O22","v":9},{"$f":"Gardner!O23","v":7},{"$f":"Gardner!O24","v":35},{"$f":"Gardner!O25","v":35},{"$f":"'CT River'!O26","v":35},{"$f":"Lillinonah!O27","v":35},{"$f":"Gardner!O28","v":35},{"$f":"Moodus!O29","v":35}]
[null,{"$f":"Bashan!O4","v":5},{"$f":"Candlewood!O5","v":13},{"$f":"Candlewood!O6","v":5},{"$f":"'CT River'!O7","v":11},{"$f":"Lillinonah!O8","v":3},{"$f":"Moodus!O9","v":13},{"$f":"Moodus!O10","v":15},{"$f":"Bantam!O11","v":3},{"$f":"Bashan!O12","v":7},{"$f":"Candlewood!O13","v":9},{"$f":"Moodus!O14","v":9},{"$f":"'Twin Lakes'!O15","v":8},{"$f":"Bashan!O16","v":6},{"$f":"Gardner!O17","v":2},{"$f":"'Twin Lakes'!O18","v":10},{"$f":"Lillinonah!O19","v":7},{"$f":"Lillinonah!O20","v":9},{"$f":"Lillinonah!O21","v":2},{"$f":"Gardner!O22","v":10},{"$f":"'CT River'!O23","v":10},{"$f":"Bashan!O24","v":35},{"$f":"Candlewood!O25","v":35},{"$f":"Gardner!O26","v":35},{"$f":"Bantam!O27","v":35},{"$f":"Bashan!O28","v":35},{"$f":"'Twin Lakes'!O29","v":35}]
[null,{"$f":"Bantam!O4","v":8},{"$f":"Lillinonah!O5","v":14},{"$f":"Lillinonah!O6","v":5},{"$f":"'Twin Lakes'!O7","v":12},{"$f":"Bantam!O8","v":5},{"$f":"'Twin Lakes'!O9","v":14},{"$f":"'CT River'!O10","v":30},{"$f":"Candlewood!O11","v":4},{"$f":"Lillinonah!O12","v":11},{"$f":"'Twin Lakes'!O13","v":16},{"$f":"Bashan!O14","v":12},{"$f":"Bantam!O15","v":9},{"$f":"Bantam!O16","v":7},{"$f":"'CT River'!O17","v":4},{"$f":"Moodus!O18","v":12},{"$f":"'CT River'!O19","v":7},{"$f":"Bashan!O20","v":10},{"$f":"'CT River'!O21","v":2},{"$f":"Moodus!O22","v":11},{"$f":"Bantam!O23","v":12},{"$f":"'CT River'!O24","v":35},{"$f":"Moodus!O25","v":35},{"$f":"Bantam!O26","v":35},{"$f":"Bashan!O27","v":35},{"$f":"Moodus!O28","v":35},{"$f":"Candlewood!O29","v":35}]
[null,{"$f":"Moodus!O4","v":18},{"$f":"Gardner!O5","v":15},{"$f":"Gardner!O6","v":8},{"$f":"Gardner!O7","v":14},{"$f":"Gardner!O8","v":5},{"$f":"Lillinonah!O9","v":30},{"$f":"Bashan!O10","v":30},{"$f":"'Twin Lakes'!O11","v":5},{"$f":"Moodus!O12","v":16},{"$f":"Lillinonah!O13","v":16},{"$f":"'Twin Lakes'!O14","v":17},{"$f":"Bashan!O15","v":9},{"$f":"Lillinonah!O16","v":10},{"$f":"Moodus!O17","v":6},{"$f":"Bashan!O18","v":13},{"$f":"Moodus!O19","v":10},{"$f":"'Twin Lakes'!O20","v":11},{"$f":"Bashan!O21","v":2},{"$f":"Bantam!O22","v":11},{"$f":"Moodus!O23","v":14},{"$f":"Candlewood!O24","v":35},{"$f":"Lillinonah!O25","v":35},{"$f":"Moodus!O26","v":35},{"$f":"'Twin Lakes'!O27","v":35},{"$f":"Candlewood!O28","v":35},{"$f":"Bantam!O29","v":35}]
[null,{"$f":"'Twin Lakes'!O4","v":19},{"$f":"'CT River'!O5","v":35},{"$f":"'CT River'!O6","v":9},{"$f":"Lillinonah!O7","v":15},{"$f":"Moodus!O8","v":30},{"$f":"'CT River'!O9","v":35},{"$f":"Candlewood!O10","v":35},{"$f":"Bashan!O11","v":8},{"$f":"Gardner!O12","v":17},{"$f":"Bashan!O13","v":35},{"$f":"Bantam!O14","v":30},{"$f":"Gardner!O15","v":11},{"$f":"Candlewood!O16","v":12},{"$f":"Candlewood!O17","v":7},{"$f":"Bantam!O18","v":30},{"$f":"Gardner!O19","v":11},{"$f":"Gardner!O20","v":16},{"$f":"Moodus!O21","v":3},{"$f":"Lillinonah!O22","v":12},{"$f":"Candlewood!O23","v":15},{"$f":"Bantam!O24","v":35},{"$f":"'CT River'!O25","v":35},{"$f":"Bashan!O26","v":35},{"$f":"Moodus!O27","v":35},{"$f":"Bantam!O28","v":35},{"$f":"Gardner!O29","v":35}]
[null,{"$f":"Candlewood!O4","v":30},{"$f":"'Twin Lakes'!O5","v":35},{"$f":"Bashan!O6","v":11},{"$f":"Bantam!O7","v":30},{"$f":"'CT River'!O8","v":35},{"$f":"Gardner!O9","v":35},{"$f":"Gardner!O10","v":35},{"$f":"'CT River'!O11","v":12},{"$f":"'Twin Lakes'!O12","v":18},{"$f":"'CT River'!O13","v":35},{"$f":"Candlewood!O14","v":35},{"$f":"Candlewood!O15","v":14},{"$f":"'Twin Lakes'!O16","v":13},{"$f":"Lillinonah!O17","v":8},{"$f":"'CT River'!O18","v":30},{"$f":"Candlewood!O19","v":16},{"$f":"Moodus!O20","v":17},{"$f":"Gardner!O21","v":6},{"$f":"Bashan!O22","v":14},{"$f":"Lillinonah!O23","v":30},{"$f":"Lillinonah!O24","v":35},{"$f":"'Twin Lakes'!O25","v":35},{"$f":"'Twin Lakes'!O26","v":35},{"$f":"'CT River'!O27","v":35},{"$f":"Lillinonah!O28","v":35},{"$f":"Lillinonah!O29","v":35}]
[null,{"$f":"'CT River'!O4","v":30},{"$f":"Bashan!O5","v":35},{"$f":"'Twin Lakes'!O6","v":15},{"$f":"Bashan!O7","v":35},{"$f":"Bashan!O8","v":35},{"$f":"Bantam!O9","v":35},{"$f":"Bantam!O10","v":35},{"$f":"Gardner!O11","v":13},{"$f":"Bantam!O12","v":30},{"$f":"Bantam!O13","v":35},{"$f":"Gardner!O14","v":35},{"$f":"Lillinonah!O15","v":35},{"$f":"Moodus!O16","v":30},{"$f":"Bantam!O17","v":10},{"$f":"Lillinonah!O18","v":35},{"$f":"Bantam!O19","v":30},{"$f":"'CT River'!O20","v":30},{"$f":"'Twin Lakes'!O21","v":7},{"$f":"Candlewood!O22","v":35},{"$f":"Bashan!O23","v":35},{"$f":"'Twin Lakes'!O24","v":35},{"$f":"Bashan!O25","v":35},{"$f":"Candlewood!O26","v":35},{"$f":"Gardner!O27","v":35},{"$f":"'CT River'!O28","v":35},{"$f":"'CT River'!O29","v":35}]
["Pts. YTD",{"$f":"SUM(B2:B7)","v":55},88,29,68,49,106,127,{"$f":"SUM(I2:I7)","v":23},63,90,77,46,40,21,78,45,{"$f":"SUM(R2:R7)","v":54},12,61,60,210,210,210,210,210,210]
["Position",{"$f":"RANK(B10,Pts._YTD,1)","v":10},17,4,14,8,19,20,3,{"$f":"RANK(J10,Pts._YTD,1)","v":13},18,{"$f":"RANK(L10,Pts._YTD,1)","v":15},7,5,2,16,6,9,{"$f":"RANK(S10,Pts._YTD,1)","v":1},12,11,21,21,21,21,21,21]
[]
[null,null,null,null,null,null,null,null,null,null,null,null,null,null,null,null,null,null,null,null,null,null,"Use macro ctl-f"]
["Name","Position","Pts. YTD",null,"Name","Position","Pts. YTD",null,"Total Weight",null,null,"Lake / River 2017",null,null,null,"Members","NonBoater",null,"Top 3 Finishers for Each Tournament"]
[{"$f":"B1","v":"Anthony"},{"$f":"B11","v":10},{"$f":"B10","v":55},null,"Steve D",1,12,null,{"$f":"P15","v":"Anthony"},{"$f":"Bashan!N4+Moodus!N4+Lillinonah!N4+Gardner!N4+'CT River'!N4+Bantam!N4+Candlewood!N4+'Twin Lakes'!N4","v":28.56},null,"Moodus",null,null,null,"Anthony","Y",null,{"$f":"L15","v":"Moodus"},null,{"$f":"L16","v":"Bantam"},null,{"$f":"L17","v":"Gardner"},null,{"$f":"L18","v":"Candlewood"},null,{"$f":"L19","v":"Twin Lakes"},null,{"$f":"L20","v":"Lillinonah"},null,{"$f":"L21","v":"CT River"},null,{"$f":"L22","v":"Bashan"}]
[{"$f":"C1","v":"Armand"},{"$f":"C11","v":17},{"$f":"C10","v":88},null,"Rich T",2,21,null,"Armand",{"$f":"Bashan!N5+Moodus!N5+Lillinonah!N5+Gardner!N5+'CT River'!N5+Bantam!N5+Candlewood!N5+'Twin Lakes'!N5","v":22.299999999999997},null,"Bantam",null,null,null,"Armand","N",null,{"$f":"Moodus!D6","v":"Dean"},{"$f":"Moodus!O6","v":1},{"$f":"Bantam!D6","v":"Dean"},{"$f":"Bantam!O6","v":1},{"$f":"Gardner!D4","v":"Anthony"},{"$f":"Gardner!O4","v":1},{"$f":"Candlewood!D21","v":"Steve D"},{"$f":"Candlewood!O21","v":1},{"$f":"'Twin Lakes'!D17","v":"Rich T"},{"$f":"'Twin Lakes'!O17","v":1},{"$f":"Lillinonah!D11","v":"Kevin"},{"$f":"Lillinonah!O11","v":1},{"$f":"'CT River'!D16","v":"Rich B"},{"$f":"'CT River'!O16","v":1},{"$f":"Bashan!D17","v":"Rich T"},{"$f":"Bashan!O17","v":1}]
[{"$f":"D1","v":"Dean"},{"$f":"D11","v":4},{"$f":"D10","v":29},null,"Kevin",3,23,null,"Dean",{"$f":"Bashan!N6+Moodus!N6+Lillinonah!N6+Gardner!N6+'CT River'!N6+Bantam!N6+Candlewood!N6+'Twin Lakes'!N6","v":47.749999999999993},null,"Gardner",null,null,null,"Dean","N",null,{"$f":"Moodus!D11","v":"Kevin"},{"$f":"Moodus!O11","v":2},{"$f":"Bantam!D21","v":"Steve D"},{"$f":"Bantam!O21","v":2},{"$f":"Gardner!D17","v":"Rich T"},{"$f":"Gardner!O17","v":2},{"$f":"Candlewood!D20","v":"Scott"},{"$f":"Candlewood!O20","v":2},{"$f":"'Twin Lakes'!D23","v":"Tom "},{"$f":"'Twin Lakes'!O23","v":2},{"$f":"Lillinonah!D21","v":"Steve D"},{"$f":"Lillinonah!O21","v":2},{"$f":"'CT River'!D21","v":"Steve D"},{"$f":"'CT River'!O21","v":2},{"$f":"Bashan!D21","v":"Steve D"},{"$f":"Bashan!O21","v":2}]
[{"$f":"E1","v":"Jack"},{"$f":"E11","v":14},{"$f":"E10","v":68},null,"Dean",4,29,null,"Jack",{"$f":"Bashan!N7+Moodus!N7+Lillinonah!N7+Gardner!N7+'CT River'!N7+Bantam!N7+Candlewood!N7+'Twin Lakes'!N7","v":18.93},null,"Candlewood",null,null,null,"Jack","Y",null,{"$f":"Moodus!D21","v":"Steve D"},{"$f":"Moodus!O21","v":3},{"$f":"Bantam!D11","v":"Kevin"},{"$f":"Bantam!O11","v":3},{"$f":"Gardner!D18","v":"Ron"},{"$f":"Gardner!O18","v":3},{"$f":"Candlewood!D8","v":"Jason"},{"$f":"Candlewood!O8","v":3},{"$f":"'Twin Lakes'!D8","v":"Jason"},{"$f":"'Twin Lakes'!O8","v":3},{"$f":"Lillinonah!D8","v":"Jason"},{"$f":"Lillinonah!O8","v":3},{"$f":"'CT River'!D14","v":"Morrie"},{"$f":"'CT River'!O14","v":3},{"$f":"Bashan!D9","v":"Jim B"},{"$f":"Bashan!O9","v":3}]
[{"$f":"F1","v":"Jason"},{"$f":"F11","v":8},{"$f":"F10","v":49},null,"Rich B",5,40,null,"Jason",{"$f":"Bashan!N8+Moodus!N8+Lillinonah!N8+Gardner!N8+'CT River'!N8+Bantam!N8+Candlewood!N8+'Twin Lakes'!N8","v":36.119999999999997},null,"Twin Lakes",null,null,null,"Jason","N",null,{"$f":"Moodus!D15","v":"Peter"},{"$f":"Moodus!O15","v":4},{"$f":"Bantam!D5","v":"Armand"},{"$f":"Bantam!O5","v":4},{"$f":"Gardner!D16","v":"Rich B"},{"$f":"Gardner!O16","v":4},{"$f":"Candlewood!D11","v":"Kevin"},{"$f":"Candlewood!O11","v":4},{"$f":"'Twin Lakes'!D10","v":"Kam"},{"$f":"'Twin Lakes'!O10","v":4},{"$f":"Lillinonah!D4","v":"Anthony"},{"$f":"Lillinonah!O4","v":4},{"$f":"'CT River'!D17","v":"Rich T"},{"$f":"'CT River'!O17","v":4},{"$f":"Bashan!D19","v":"Ryan"},{"$f":"Bashan!O19","v":4}]
[{"$f":"G1","v":"Jim B"},{"$f":"G11","v":19},{"$f":"G10","v":106},null,"Ryan",6,45,null,"Jim B",{"$f":"Bashan!N9+Moodus!N9+Lillinonah!N9+Gardner!N9+'CT River'!N9+Bantam!N9+Candlewood!N9+'Twin Lakes'!N9","v":15.82},null,"Lillinonah",null,null,null,"Jim B","Y",null,{"$f":"Moodus!D13","v":"Mike G"},{"$f":"Moodus!O13","v":5},{"$f":"Bantam!D8","v":"Jason"},{"$f":"Bantam!O8","v":5},{"$f":"Gardner!D8","v":"Jason"},{"$f":"Gardner!O8","v":5},{"$f":"Candlewood!D6","v":"Dean"},{"$f":"Candlewood!O6","v":5},{"$f":"'Twin Lakes'!D11","v":"Kevin"},{"$f":"'Twin Lakes'!O11","v":5},{"$f":"Lillinonah!D6","v":"Dean"},{"$f":"Lillinonah!O6","v":5},{"$f":"'CT River'!D15","v":"Peter"},{"$f":"'CT River'!O15","v":5},{"$f":"Bashan!D4","v":"Anthony"},{"$f":"Bashan!O4","v":5}]
[{"$f":"H1","v":"Kam"},{"$f":"H11","v":20},{"$f":"H10","v":127},null,"Peter",7,46,null,"Kam",{"$f":"Bashan!N10+Moodus!N10+Lillinonah!N10+Gardner!N10+'CT River'!N10+Bantam!N10+Candlewood!N10+'Twin Lakes'!N10","v":11.3},null,"CT River",null,null,null,"Kam","Y",null,{"$f":"Moodus!D17","v":"Rich T"},{"$f":"Moodus!O17","v":6},{"$f":"Bantam!D20","v":"Scott"},{"$f":"Bantam!O20","v":6},{"$f":"Gardner!D21","v":"Steve D"},{"$f":"Gardner!O21","v":6},{"$f":"Candlewood!D12","v":"Mike M"},{"$f":"Candlewood!O12","v":6},{"$f":"'Twin Lakes'!D19","v":"Ryan"},{"$f":"'Twin Lakes'!O19","v":6},{"$f":"Lillinonah!D14","v":"Morrie"},{"$f":"Lillinonah!O14","v":6},{"$f":"'CT River'!D12","v":"Mike M"},{"$f":"'CT River'!O12","v":6},{"$f":"Bashan!D16","v":"Rich B"},{"$f":"Bashan!O16","v":6}]
[{"$f":"I1","v":"Kevin"},{"$f":"I11","v":3},{"$f":"I10","v":23},null,"Jason",8,49,null,"Kevin",{"$f":"Bashan!N11+Moodus!N11+Lillinonah!N11+Gardner!N11+'CT River'!N11+Bantam!N11+Candlewood!N11+'Twin Lakes'!N11","v":53.05},null,"Bashan",null,null,null,"Kevin","N",null,{"$f":"Moodus!D5","v":"Armand"},{"$f":"Moodus!O5","v":7},{"$f":"Bantam!D16","v":"Rich B"},{"$f":"Bantam!O16","v":7},{"$f":"Gardner!D23","v":"Tom "},{"$f":"Gardner!O23","v":7},{"$f":"Candlewood!D17","v":"Rich T"},{"$f":"Candlewood!O17","v":7},{"$f":"'Twin Lakes'!D21","v":"Steve D"},{"$f":"'Twin Lakes'!O21","v":7},{"$f":"Lillinonah!D19","v":"Ryan"},{"$f":"Lillinonah!O19","v":7},{"$f":"'CT River'!D19","v":"Ryan"},{"$f":"'CT River'!O19","v":7},{"$f":"Bashan!D12","v":"Mike M"},{"$f":"Bashan!O12","v":7}]
[{"$f":"J1","v":"Mike M"},{"$f":"J11","v":13},{"$f":"J10","v":63},null,"Scott",9,54,null,"Mike M",{"$f":"Bashan!N12+Moodus!N12+Lillinonah!N12+Gardner!N12+'CT River'!N12+Bantam!N12+Candlewood!N12+'Twin Lakes'!N12","v":20.46},null,null,null,null,null,"Mike M","Y",null,{"$f":"Moodus!D7","v":"Jack"},{"$f":"Moodus!O7","v":8},{"$f":"Bantam!D4","v":"Anthony"},{"$f":"Bantam!O4","v":8},{"$f":"Gardner!D6","v":"Dean"},{"$f":"Gardner!O6","v":8},{"$f":"Candlewood!D7","v":"Jack"},{"$f":"Candlewood!O7","v":8},{"$f":"'Twin Lakes'!D15","v":"Peter"},{"$f":"'Twin Lakes'!O15","v":8},{"$f":"Lillinonah!D17","v":"Rich T"},{"$f":"Lillinonah!O17","v":8},{"$f":"'CT River'!D22","v":"Steve S"},{"$f":"'CT River'!O22","v":8},{"$f":"Bashan!D11","v":"Kevin"},{"$f":"Bashan!O11","v":8}]
[{"$f":"K1","v":"Mike G"},{"$f":"K11","v":18},{"$f":"K10","v":90},null,"Anthony",10,55,null,"Mike G",{"$f":"Bashan!N13+Moodus!N13+Lillinonah!N13+Gardner!N13+'CT River'!N13+Bantam!N13+Candlewood!N13+'Twin Lakes'!N13","v":17.95},null,null,null,null,null,"Mike G","Y",null,{"$f":"Moodus!D14","v":"Morrie"},{"$f":"Moodus!O14","v":9},{"$f":"Bantam!D15","v":"Peter"},{"$f":"Bantam!O15","v":9},{"$f":"Gardner!D13","v":"Mike G"},{"$f":"Gardner!O13","v":9},{"$f":"Candlewood!D13","v":"Mike G"},{"$f":"Candlewood!O13","v":9},{"$f":"'Twin Lakes'!D22","v":"Steve S"},{"$f":"'Twin Lakes'!O22","v":9},{"$f":"Lillinonah!D20","v":"Scott"},{"$f":"Lillinonah!O20","v":9},{"$f":"'CT River'!D6","v":"Dean"},{"$f":"'CT River'!O6","v":9},{"$f":"Bashan!D15","v":"Peter"},{"$f":"Bashan!O15","v":9}]
[{"$f":"L1","v":"Morrie"},{"$f":"L11","v":15},{"$f":"L10","v":77},null,"Tom ",11,60,null,"Morrie",{"$f":"Bashan!N14+Moodus!N14+Lillinonah!N14+Gardner!N14+'CT River'!N14+Bantam!N14+Candlewood!N14+'Twin Lakes'!N14","v":16.329999999999998},null,null,null,null,null,"Morrie","N",null,{"$f":"Moodus!D19","v":"Ryan"},{"$f":"Moodus!O19","v":10},{"$f":"Bantam!D17","v":"Rich T"},{"$f":"Bantam!O17","v":10},{"$f":"Gardner!D22","v":"Steve S"},{"$f":"Gardner!O22","v":10},{"$f":"Candlewood!D18","v":"Ron"},{"$f":"Candlewood!O18","v":10},{"$f":"'Twin Lakes'!D18","v":"Ron"},{"$f":"'Twin Lakes'!O18","v":10},{"$f":"Lillinonah!D16","v":"Rich B"},{"$f":"Lillinonah!O16","v":10},{"$f":"'CT River'!D23","v":"Tom "},{"$f":"'CT River'!O23","v":10},{"$f":"Bashan!D20","v":"Scott"},{"$f":"Bashan!O20","v":10}]
[{"$f":"M1","v":"Peter"},{"$f":"M11","v":7},{"$f":"M10","v":46},null,"Steve S",12,61,null,"Peter",{"$f":"Bashan!N15+Moodus!N15+Lillinonah!N15+Gardner!N15+'CT River'!N15+Bantam!N15+Candlewood!N15+'Twin Lakes'!N15","v":30.000000000000004},null,"Macros",null,null,null,"Peter","Y",null,{"$f":"Moodus!D22","v":"Steve S"},{"$f":"Moodus!O22","v":11},{"$f":"Bantam!D22","v":"Steve S"},{"$f":"Bantam!O22","v":11},{"$f":"Gardner!D19","v":"Ryan"},{"$f":"Gardner!O19","v":11},{"$f":"Candlewood!D9","v":"Jim B"},{"$f":"Candlewood!O9","v":11},{"$f":"'Twin Lakes'!D20","v":"Scott"},{"$f":"'Twin Lakes'!O20","v":11},{"$f":"Lillinonah!D12","v":"Mike M"},{"$f":"Lillinonah!O12","v":11},{"$f":"'CT River'!D7","v":"Jack"},{"$f":"'CT River'!O7","v":11},{"$f":"Bashan!D6","v":"Dean"},{"$f":"Bashan!O6","v":11}]
[{"$f":"N1","v":"Rich B"},{"$f":"N11","v":5},{"$f":"N10","v":40},null,"Mike M",13,63,null,"Rich B",{"$f":"Bashan!N16+Moodus!N16+Lillinonah!N16+Gardner!N16+'CT River'!N16+Bantam!N16+Candlewood!N16+'Twin Lakes'!N16","v":46.22},null,"ctl-S   Sort Upper Section",null,null,null,"Rich B","N",null,{"$f":"Moodus!D18","v":"Ron"},{"$f":"Moodus!O18","v":12},{"$f":"Bantam!D23","v":"Tom "},{"$f":"Bantam!O23","v":12},{"$f":"Gardner!D15","v":"Peter"},{"$f":"Gardner!O15","v":11},{"$f":"Candlewood!D16","v":"Rich B"},{"$f":"Candlewood!O16","v":12},{"$f":"'Twin Lakes'!D7","v":"Jack"},{"$f":"'Twin Lakes'!O7","v":12},{"$f":"Lillinonah!D22","v":"Steve S"},{"$f":"Lillinonah!O22","v":12},{"$f":"'CT River'!D11","v":"Kevin"},{"$f":"'CT River'!O11","v":12},{"$f":"Bashan!D14","v":"Morrie"},{"$f":"Bashan!O14","v":12}]
[{"$f":"O1","v":"Rich T"},{"$f":"O11","v":2},{"$f":"O10","v":21},null,"Jack",14,68,null,"Rich T",{"$f":"Bashan!N17+Moodus!N17+Lillinonah!N17+Gardner!N17+'CT River'!N17+Bantam!N17+Candlewood!N17+'Twin Lakes'!N17","v":48.589999999999996},null,"ctl-K   Copy and Paste for Position",null,null,null,"Rich T","Y",null,{"$f":"Moodus!D9","v":"Jim B"},{"$f":"Moodus!O9","v":13},{"$f":"Bantam!D18","v":"Ron"},{"$f":"Bantam!O18","v":30},{"$f":"Gardner!D11","v":"Kevin"},{"$f":"Gardner!O11","v":13},{"$f":"Candlewood!D5","v":"Armand"},{"$f":"Candlewood!O5","v":13},{"$f":"'Twin Lakes'!D16","v":"Rich B"},{"$f":"'Twin Lakes'!O16","v":13},{"$f":"Lillinonah!D10","v":"Kam"},{"$f":"Lillinonah!O10","v":13},{"$f":"'CT River'!D18","v":"Ron"},{"$f":"'CT River'!O18","v":30},{"$f":"Bashan!D18","v":"Ron"},{"$f":"Bashan!O18","v":13}]
[{"$f":"P1","v":"Ron"},{"$f":"P11","v":16},{"$f":"P10","v":78},null,"Morrie",15,77,null,"Ron",{"$f":"Bashan!N18+Moodus!N18+Lillinonah!N18+Gardner!N18+'CT River'!N18+Bantam!N18+Candlewood!N18+'Twin Lakes'!N18","v":20.04},null,"ctl-L    Sort For Lunker",null,null,null,"Ron","N",null,{"$f":"Moodus!D23","v":"Tom "},{"$f":"Moodus!O23","v":14},{"$f":"Bantam!D19","v":"Ryan"},{"$f":"Bantam!O19","v":30},{"$f":"Gardner!D7","v":"Jack"},{"$f":"Gardner!O7","v":14},{"$f":"Candlewood!D15","v":"Peter"},{"$f":"Candlewood!O15","v":14},{"$f":"'Twin Lakes'!D9","v":"Jim B"},{"$f":"'Twin Lakes'!O9","v":14},{"$f":"Lillinonah!D5","v":"Armand"},{"$f":"Lillinonah!O5","v":14},{"$f":"'CT River'!D20","v":"Scott"},{"$f":"'CT River'!O20","v":30},{"$f":"Bashan!D22","v":"Steve S"},{"$f":"Bashan!O22","v":14}]
[{"$f":"Q1","v":"Ryan"},{"$f":"Q11","v":6},{"$f":"Q10","v":45},null,"Ron",16,78,null,"Ryan",{"$f":"Bashan!N19+Moodus!N19+Lillinonah!N19+Gardner!N19+'CT River'!N19+Bantam!N19+Candlewood!N19+'Twin Lakes'!N19","v":31.949999999999996},null,"ctl-F   Sort Top 3 Finishers",null,null,null,"Ryan","Y",null,{"$f":"Moodus!D10","v":"Kam"},{"$f":"Moodus!O10","v":15},{"$f":"Bantam!D7","v":"Jack"},{"$f":"Bantam!O7","v":30},{"$f":"Gardner!D5","v":"Armand"},{"$f":"Gardner!O5","v":15},{"$f":"Candlewood!D23","v":"Tom "},{"$f":"Candlewood!O23","v":15},{"$f":"'Twin Lakes'!D6","v":"Dean"},{"$f":"'Twin Lakes'!O6","v":15},{"$f":"Lillinonah!D7","v":"Jack"},{"$f":"Lillinonah!O7","v":15},{"$f":"'CT River'!D10","v":"Kam"},{"$f":"'CT River'!O10","v":30},{"$f":"Bashan!D10","v":"Kam"},{"$f":"Bashan!O10","v":30}]
[{"$f":"R1","v":"Scott"},{"$f":"R11","v":9},{"$f":"R10","v":54},null,"Armand",17,88,null,"Scott",{"$f":"Bashan!N20+Moodus!N20+Lillinonah!N20+Gardner!N20+'CT River'!N20+Bantam!N20+Candlewood!N20+'Twin Lakes'!N20","v":32.15},null,"ctl-W   Sort for Total Weight",null,null,null,"Scott","N",null,{"$f":"Moodus!D12","v":"Mike M"},{"$f":"Moodus!O12","v":16},{"$f":"Bantam!D14","v":"Morrie"},{"$f":"Bantam!O14","v":30},{"$f":"Gardner!D20","v":"Scott"},{"$f":"Gardner!O20","v":16},{"$f":"Candlewood!D19","v":"Ryan"},{"$f":"Candlewood!O19","v":16},{"$f":"'Twin Lakes'!D13","v":"Mike G"},{"$f":"'Twin Lakes'!O13","v":16},{"$f":"Lillinonah!D13","v":"Mike G"},{"$f":"Lillinonah!O13","v":16},{"$f":"'CT River'!D4","v":"Anthony"},{"$f":"'CT River'!O4","v":30},{"$f":"Bashan!D13","v":"Mike G"},{"$f":"Bashan!O13","v":35}]
[{"$f":"S1","v":"Steve D"},{"$f":"S11","v":1},{"$f":"S10","v":12},null,"Mike G",18,90,null,"Steve D",{"$f":"Bashan!N21+Moodus!N21+Lillinonah!N21+Gardner!N21+'CT River'!N21+Bantam!N21+Candlewood!N21+'Twin Lakes'!N21","v":62.12},null,null,null,null,null,"Steve D","N",null,{"$f":"Moodus!D20","v":"Scott"},{"$f":"Moodus!O20","v":17},{"$f":"Bantam!D12","v":"Mike M"},{"$f":"Bantam!O12","v":30},{"$f":"Gardner!D12","v":"Mike M"},{"$f":"Gardner!O12","v":17},{"$f":"Candlewood!D4","v":"Anthony"},{"$f":"Candlewood!O4","v":30},{"$f":"'Twin Lakes'!D14","v":"Morrie"},{"$f":"'Twin Lakes'!O14","v":17},{"$f":"Lillinonah!D23","v":"Tom "},{"$f":"Lillinonah!O23","v":30},{"$f":"'CT River'!D8","v":"Jason"},{"$f":"'CT River'!O8","v":35},{"$f":"Bashan!D8","v":"Jason"},{"$f":"Bashan!O8","v":35}]
[{"$f":"T1","v":"Steve S"},{"$f":"T11","v":12},{"$f":"T10","v":61},null,"Jim B",19,106,null,"Steve S",{"$f":"Bashan!N22+Moodus!N22+Lillinonah!N22+Gardner!N22+'CT River'!N22+Bantam!N22+Candlewood!N22+'Twin Lakes'!N22","v":22.369999999999997},null,null,null,null,null,"Steve S","N",null,{"$f":"Moodus!D4","v":"Anthony"},{"$f":"Moodus!O4","v":18},{"$f":"Bantam!D9","v":"Jim B"},{"$f":"Bantam!O9","v":35},{"$f":"Gardner!D9","v":"Jim B"},{"$f":"Gardner!O9","v":35},{"$f":"Candlewood!D14","v":"Morrie"},{"$f":"Candlewood!O14","v":35},{"$f":"'Twin Lakes'!D12","v":"Mike M"},{"$f":"'Twin Lakes'!O12","v":18},{"$f":"Lillinonah!D9","v":"Jim B"},{"$f":"Lillinonah!O9","v":30},{"$f":"'CT River'!D9","v":"Jim B"},{"$f":"'CT River'!O9","v":35},{"$f":"Bashan!D23","v":"Tom "},{"$f":"Bashan!O23","v":35}]
[{"$f":"U1","v":"Tom "},{"$f":"U11","v":11},{"$f":"U10","v":60},null,"Kam",20,127,null,"Tom ",{"$f":"Bashan!N23+Moodus!N23+Lillinonah!N23+Gardner!N23+'CT River'!N23+Bantam!N23+Candlewood!N23+'Twin Lakes'!N23","v":21.53},null,null,null,null,null,"Tom ","N",null,{"$f":"Moodus!D16","v":"Rich B"},{"$f":"Moodus!O16","v":30},{"$f":"Bantam!D10","v":"Kam"},{"$f":"Bantam!O10","v":35},{"$f":"Gardner!D14","v":"Morrie"},{"$f":"Gardner!O14","v":35},{"$f":"Candlewood!D22","v":"Steve S"},{"$f":"Candlewood!O22","v":35},{"$f":"'Twin Lakes'!D4","v":"Anthony"},{"$f":"'Twin Lakes'!O4","v":19},{"$f":"Lillinonah!D15","v":"Peter"},{"$f":"Lillinonah!O15","v":35},{"$f":"'CT River'!D5","v":"Armand"},{"$f":"'CT River'!O5","v":35},{"$f":"Bashan!D7","v":"Jack"},{"$f":"Bashan!O7","v":35}]
[{"$f":"V1","v":"X"},{"$f":"V11","v":21},{"$f":"V10","v":210},null,"X",21,210,null,"X",{"$f":"Bashan!N24+Moodus!N24+Lillinonah!N24+Gardner!N24+'CT River'!N24+Bantam!N24+Candlewood!N24+'Twin Lakes'!N24","v":0},null,null,null,null,null,"X","N",null,{"$f":"Moodus!D8","v":"Jason"},{"$f":"Moodus!O8","v":30},{"$f":"Bantam!D13","v":"Mike G"},{"$f":"Bantam!O13","v":35},{"$f":"Gardner!D10","v":"Kam"},{"$f":"Gardner!O10","v":35},{"$f":"Candlewood!D10","v":"Kam"},{"$f":"Candlewood!O10","v":35},{"$f":"'Twin Lakes'!D5","v":"Armand"},{"$f":"'Twin Lakes'!O5","v":35},{"$f":"Lillinonah!D18","v":"Ron"},{"$f":"Lillinonah!O18","v":35},{"$f":"'CT River'!D13","v":"Mike G"},{"$f":"'CT River'!O13","v":35},{"$f":"Bashan!D5","v":"Armand"},{"$f":"Bashan!O5","v":35}]
[{"$f":"W1","v":"X"},{"$f":"W11","v":21},{"$f":"W10","v":210},null,"X",21,210,null,"X",{"$f":"Bashan!N25+Moodus!N25+Lillinonah!N25+Gardner!N25+'CT River'!N25+Bantam!N25+Candlewood!N25+'Twin Lakes'!N25","v":0},null,null,null,null,null,"X","N",null,{"$f":"Moodus!D24","v":"X"},{"$f":"Moodus!O24","v":35},{"$f":"Bantam!D24","v":"X"},{"$f":"Bantam!O24","v":35},{"$f":"Gardner!D24","v":"X"},{"$f":"Gardner!O24","v":35},{"$f":"Candlewood!D24","v":"X"},{"$f":"Candlewood!O24","v":35},{"$f":"'Twin Lakes'!D24","v":"X"},{"$f":"'Twin Lakes'!O24","v":35},{"$f":"Lillinonah!D24","v":"X"},{"$f":"Lillinonah!O24","v":35},{"$f":"'CT River'!D24","v":"X"},{"$f":"'CT River'!O24","v":35},{"$f":"Bashan!D24","v":"X"},{"$f":"Bashan!O24","v":35}]
[{"$f":"X1","v":"X"},{"$f":"X11","v":21},{"$f":"X10","v":210},null,"X",21,210,null,"X",{"$f":"Bashan!N26+Moodus!N26+Lillinonah!N26+Gardner!N26+'CT River'!N26+Bantam!N26+Candlewood!N26+'Twin Lakes'!N26","v":0},null,null,null,null,null,"X","N",null,{"$f":"Moodus!D25","v":"X"},{"$f":"Moodus!O25","v":35},{"$f":"Bantam!D25","v":"X"},{"$f":"Bantam!O25","v":35},{"$f":"Gardner!D25","v":"X"},{"$f":"Gardner!O25","v":35},{"$f":"Candlewood!D25","v":"X"},{"$f":"Candlewood!O25","v":35},{"$f":"'Twin Lakes'!D25","v":"X"},{"$f":"'Twin Lakes'!O25","v":35},{"$f":"Lillinonah!D25","v":"X"},{"$f":"Lillinonah!O25","v":35},{"$f":"'CT River'!D25","v":"X"},{"$f":"'CT River'!O25","v":35},{"$f":"Bashan!D25","v":"X"},{"$f":"Bashan!O25","v":35}]
[{"$f":"Y1","v":"X"},{"$f":"Y11","v":21},{"$f":"Y10","v":210},null,"X",21,210,null,"X",{"$f":"Bashan!N27+Moodus!N27+Lillinonah!N27+Gardner!N27+'CT River'!N27+Bantam!N27+Candlewood!N27+'Twin Lakes'!N27","v":0},null,null,null,null,null,"X","N",null,{"$f":"Moodus!D26","v":"X"},{"$f":"Moodus!O26","v":35},{"$f":"Bantam!D27","v":"X"},{"$f":"Bantam!O27","v":35},{"$f":"Gardner!D26","v":"X"},{"$f":"Gardner!O26","v":35},{"$f":"Candlewood!D26","v":"X"},{"$f":"Candlewood!O26","v":35},{"$f":"'Twin Lakes'!D26","v":"X"},{"$f":"'Twin Lakes'!O26","v":35},{"$f":"Lillinonah!D26","v":"X"},{"$f":"Lillinonah!O26","v":35},{"$f":"'CT River'!D26","v":"X"},{"$f":"'CT River'!O26","v":35},{"$f":"Bashan!D26","v":"X"},{"$f":"Bashan!O26","v":35}]
[{"$f":"Z1","v":"X"},{"$f":"Z11","v":21},{"$f":"Z10","v":210},null,"X",21,210,null,"X",{"$f":"Bashan!N28+Moodus!N28+Lillinonah!N28+Gardner!N28+'CT River'!N28+Bantam!N28+Candlewood!N28+'Twin Lakes'!N28","v":0},null,null,null,null,null,"X","N",null,{"$f":"Moodus!D27","v":"X"},{"$f":"Moodus!O27","v":35},{"$f":"Bantam!D26","v":"X"},{"$f":"Bantam!O26","v":35},{"$f":"Gardner!D27","v":"X"},{"$f":"Gardner!O27","v":35},{"$f":"Candlewood!D27","v":"X"},{"$f":"Candlewood!O27","v":35},{"$f":"'Twin Lakes'!D27","v":"X"},{"$f":"'Twin Lakes'!O27","v":35},{"$f":"Lillinonah!D27","v":"X"},{"$f":"Lillinonah!O27","v":35},{"$f":"'CT River'!D27","v":"X"},{"$f":"'CT River'!O27","v":35},{"$f":"Bashan!D27","v":"X"},{"$f":"Bashan!O27","v":35}]
[{"$f":"AA1","v":"X"},{"$f":"AA11","v":21},{"$f":"AA10","v":210},null,"X",21,210,null,"X",{"$f":"Bashan!N29+Moodus!N29+Lillinonah!N29+Gardner!N29+'CT River'!N29+Bantam!N29+Candlewood!N29+'Twin Lakes'!N29","v":0},null,null,null,null,null,"X","N",null,{"$f":"Moodus!D28","v":"X"},{"$f":"Moodus!O28","v":35},{"$f":"Bantam!D28","v":"X"},{"$f":"Bantam!O28","v":35},{"$f":"Gardner!D28","v":"X"},{"$f":"Gardner!O28","v":35},{"$f":"Candlewood!D28","v":"X"},{"$f":"Candlewood!O28","v":35},{"$f":"'Twin Lakes'!D28","v":"X"},{"$f":"'Twin Lakes'!O28","v":35},{"$f":"Lillinonah!D28","v":"X"},{"$f":"Lillinonah!O28","v":35},{"$f":"'CT River'!D28","v":"X"},{"$f":"'CT River'!O28","v":35},{"$f":"Bashan!D28","v":"X"},{"$f":"Bashan!O28","v":35}]
[null,null,null,null,null,null,null,null,null,null,null,null,null,null,null,null,null,null,{"$f":"Moodus!D29","v":"X"},{"$f":"Moodus!O29","v":35},{"$f":"Bantam!D29","v":"X"},{"$f":"Bantam!O29","v":35},{"$f":"Gardner!D29","v":"X"},{"$f":"Gardner!O29","v":35},{"$f":"Candlewood!D29","v":"X"},{"$f":"Candlewood!O29","v":35},{"$f":"'Twin Lakes'!D29","v":"X"},{"$f":"'Twin Lakes'!O29","v":35},{"$f":"Lillinonah!D29","v":"X"},{"$f":"Lillinonah!O29","v":35},{"$f":"'CT River'!D29","v":"X"},{"$f":"'CT River'!O29","v":35},{"$f":"Bashan!D29","v":"X"},{"$f":"Bashan!O29","v":35}]
[]
[]
["Total Weight"]
[{"$f":"L15","v":"Moodus"},null,{"$f":"L16","v":"Bantam"},null,{"$f":"L17","v":"Gardner"},null,{"$f":"L18","v":"Candlewood"},null,{"$f":"L19","v":"Twin Lakes"},null,{"$f":"L20","v":"Lillinonah"},null,{"$f":"L21","v":"CT River"},null,{"$f":"L22","v":"Bashan"},null,"Lbs",null,"Total Weight YTD"]
["Name","Weight","Name","Weight","Name","Weight","Name","Weight","Name","Weight","Name","Weight","Name","Weight","Name","Weight","Ytd",null,"Name","Weight"]
[{"$f":"P15","v":"Anthony"},{"$f":"Moodus!N4","v":0.88},{"$f":"P15","v":"Anthony"},{"$f":"Bantam!N4","v":3.04},{"$f":"P15","v":"Anthony"},{"$f":"Gardner!N4","v":9.09},{"$f":"P15","v":"Anthony"},{"$f":"Candlewood!N4","v":0},{"$f":"P15","v":"Anthony"},{"$f":"'Twin Lakes'!N4","v":0.86},{"$f":"P15","v":"Anthony"},{"$f":"Lillinonah!N4","v":7.21},{"$f":"P15","v":"Anthony"},{"$f":"'CT River'!N4","v":0},{"$f":"P15","v":"Anthony"},{"$f":"Bashan!N4","v":7.48},{"$f":"SUM(A47:P47)","v":28.56},null,{"$f":"P15","v":"Anthony"},{"$f":"Q47","v":28.56}]
["Armand",{"$f":"Moodus!N5","v":1.98},"Armand",{"$f":"Bantam!N5","v":11.29},"Armand",{"$f":"Gardner!N5","v":4.2699999999999996},"Armand",{"$f":"Candlewood!N5","v":1.68},"Armand",{"$f":"'Twin Lakes'!N5","v":0},"Armand",{"$f":"Lillinonah!N5","v":3.08},"Armand",{"$f":"'CT River'!N5","v":0},"Armand",{"$f":"Bashan!N5","v":0},22.299999999999997,null,{"$f":"P16","v":"Armand"},{"$f":"Q48","v":22.299999999999997}]
["Dean",{"$f":"Moodus!N6","v":8.4},"Dean",{"$f":"Bantam!N6","v":12.7},"Dean",{"$f":"Gardner!N6","v":7.01},"Dean",{"$f":"Candlewood!N6","v":5.0199999999999996},"Dean",{"$f":"'Twin Lakes'!N6","v":3.15},"Dean",{"$f":"Lillinonah!N6","v":6.44},"Dean",{"$f":"'CT River'!N6","v":1.31},"Dean",{"$f":"Bashan!N6","v":3.72},47.749999999999993,null,"Dean",47.749999999999993]
["Jack",{"$f":"Moodus!N7","v":1.75},"Jack",{"$f":"Bantam!N7","v":0},"Jack",{"$f":"Gardner!N7","v":4.9400000000000004},"Jack",{"$f":"Candlewood!N7","v":3.46},"Jack",{"$f":"'Twin Lakes'!N7","v":5.4},"Jack",{"$f":"Lillinonah!N7","v":2.31},"Jack",{"$f":"'CT River'!N7","v":1.07},"Jack",{"$f":"Bashan!N7","v":0},18.93,null,"Jack",18.93]
["Jason",{"$f":"Moodus!N8","v":0},"Jason",{"$f":"Bantam!N8","v":4.95},"Jason",{"$f":"Gardner!N8","v":7.56},"Jason",{"$f":"Candlewood!N8","v":6.32},"Jason",{"$f":"'Twin Lakes'!N8","v":9.51},"Jason",{"$f":"Lillinonah!N8","v":7.7800000000000011},"Jason",{"$f":"'CT River'!N8","v":0},"Jason",{"$f":"Bashan!N8","v":0},36.119999999999997,null,"Jason",36.119999999999997]
["Jim B",{"$f":"Moodus!N9","v":1.07},"Jim B",{"$f":"Bantam!N9","v":0},"Jim B",{"$f":"Gardner!N9","v":0},"Jim B",{"$f":"Candlewood!N9","v":2.77},"Jim B",{"$f":"'Twin Lakes'!N9","v":3.93},"Jim B",{"$f":"Lillinonah!N9","v":0},"Jim B",{"$f":"'CT River'!N9","v":0},"Jim B",{"$f":"Bashan!N9","v":8.0500000000000007},15.82,null,"Jim B",15.82]
["Kam",{"$f":"Moodus!N10","v":1.01},"Kam",{"$f":"Bantam!N10","v":0},"Kam",{"$f":"Gardner!N10","v":0},"Kam",{"$f":"Candlewood!N10","v":0},"Kam",{"$f":"'Twin Lakes'!N10","v":7.05},"Kam",{"$f":"Lillinonah!N10","v":3.24},"Kam",{"$f":"'CT River'!N10","v":0},"Kam",{"$f":"Bashan!N10","v":0},11.3,null,"Kam",11.3]
["Kevin",{"$f":"Moodus!N11","v":5.21},"Kevin",{"$f":"Bantam!N11","v":11.38},"Kevin",{"$f":"Gardner!N11","v":5.89},"Kevin",{"$f":"Candlewood!N11","v":5.94},"Kevin",{"$f":"'Twin Lakes'!N11","v":6.93},"Kevin",{"$f":"Lillinonah!N11","v":10.59},"Kevin",{"$f":"'CT River'!N11","v":0.83},"Kevin",{"$f":"Bashan!N11","v":6.28},53.05,null,"Kevin",53.05]
["Mike M",{"$f":"Moodus!N12","v":0.94},"Mike M",{"$f":"Bantam!N12","v":0},"Mike M",{"$f":"Gardner!N12","v":0.77},"Mike M",{"$f":"Candlewood!N12","v":4.03},"Mike M",{"$f":"'Twin Lakes'!N12","v":1.75},"Mike M",{"$f":"Lillinonah!N12","v":3.84},"Mike M",{"$f":"'CT River'!N12","v":2.8},"Mike M",{"$f":"Bashan!N12","v":6.33},20.46,null,"Mike M",20.46]
["Mike G",{"$f":"Moodus!N13","v":3.15},"Mike G",{"$f":"Bantam!N13","v":0},"Mike G",{"$f":"Gardner!N13","v":6.75},"Mike G",{"$f":"Candlewood!N13","v":3.08},"Mike G",{"$f":"'Twin Lakes'!N13","v":3.05},"Mike G",{"$f":"Lillinonah!N13","v":1.9200000000000002},"Mike G",{"$f":"'CT River'!N13","v":0},"Mike G",{"$f":"Bashan!N13","v":0},17.950000000000003,null,"Mike G",17.950000000000003]
["Morrie",{"$f":"Moodus!N14","v":1.71},"Morrie",{"$f":"Bantam!N14","v":0},"Morrie",{"$f":"Gardner!N14","v":0},"Morrie",{"$f":"Candlewood!N14","v":0},"Morrie",{"$f":"'Twin Lakes'!N14","v":1.97},"Morrie",{"$f":"Lillinonah!N14","v":6.3},"Morrie",{"$f":"'CT River'!N14","v":4.0199999999999996},"Morrie",{"$f":"Bashan!N14","v":2.33},16.329999999999998,null,"Morrie",16.329999999999998]
["Peter",{"$f":"Moodus!N15","v":3.97},"Peter",{"$f":"Bantam!N15","v":2.7},"Peter",{"$f":"Gardner!N15","v":6.48},"Peter",{"$f":"Candlewood!N15","v":1.26},"Peter",{"$f":"'Twin Lakes'!N15","v":6.66},"Peter",{"$f":"Lillinonah!N15","v":0},"Peter",{"$f":"'CT River'!N15","v":3.03},"Peter",{"$f":"Bashan!N15","v":5.9},30,null,"Peter",30]
["Rich B",{"$f":"Moodus!N16","v":0},"Rich B",{"$f":"Bantam!N16","v":4.5599999999999996},"Rich B",{"$f":"Gardner!N16","v":7.76},"Rich B",{"$f":"Candlewood!N16","v":1.75},"Rich B",{"$f":"'Twin Lakes'!N16","v":5.12},"Rich B",{"$f":"Lillinonah!N16","v":4.09},"Rich B",{"$f":"'CT River'!N16","v":15.72},"Rich B",{"$f":"Bashan!N16","v":7.22},46.22,null,"Rich B",46.22]
["Rich T",{"$f":"Moodus!N17","v":2.77},"Rich T",{"$f":"Bantam!N17","v":1.58},"Rich T",{"$f":"Gardner!N17","v":8.75},"Rich T",{"$f":"Candlewood!N17","v":3.88},"Rich T",{"$f":"'Twin Lakes'!N17","v":12.9},"Rich T",{"$f":"Lillinonah!N17","v":5.85},"Rich T",{"$f":"'CT River'!N17","v":3.5},"Rich T",{"$f":"Bashan!N17","v":9.36},48.59,null,"Rich T",48.59]
["Ron",{"$f":"Moodus!N18","v":1.1000000000000001},"Ron",{"$f":"Bantam!N18","v":0},"Ron",{"$f":"Gardner!N18","v":8.27},"Ron",{"$f":"Candlewood!N18","v":3.01},"Ron",{"$f":"'Twin Lakes'!N18","v":5.67},"Ron",{"$f":"Lillinonah!N18","v":0},"Ron",{"$f":"'CT River'!N18","v":0},"Ron",{"$f":"Bashan!N18","v":1.99},20.039999999999996,null,"Ron",20.039999999999996]
["Ryan",{"$f":"Moodus!N19","v":1.21},"Ryan",{"$f":"Bantam!N19","v":0},"Ryan",{"$f":"Gardner!N19","v":6.48},"Ryan",{"$f":"Candlewood!N19","v":1},"Ryan",{"$f":"'Twin Lakes'!N19","v":6.77},"Ryan",{"$f":"Lillinonah!N19","v":6.17},"Ryan",{"$f":"'CT River'!N19","v":2.56},"Ryan",{"$f":"Bashan!N19","v":7.76},31.950000000000003,null,"Ryan",31.950000000000003]
["Scott",{"$f":"Moodus!N20","v":0.91},"Scott",{"$f":"Bantam!N20","v":4.88},"Scott",{"$f":"Gardner!N20","v":4.13},"Scott",{"$f":"Candlewood!N20","v":6.33},"Scott",{"$f":"'Twin Lakes'!N20","v":5.44},"Scott",{"$f":"Lillinonah!N20","v":4.74},"Scott",{"$f":"'CT River'!N20","v":0},"Scott",{"$f":"Bashan!N20","v":5.72},32.15,null,"Scott",32.15]
["Steve D",{"$f":"Moodus!N21","v":4.96},"Steve D",{"$f":"Bantam!N21","v":11.77},"Steve D",{"$f":"Gardner!N21","v":7.29},"Steve D",{"$f":"Candlewood!N21","v":6.66},"Steve D",{"$f":"'Twin Lakes'!N21","v":6.74},"Steve D",{"$f":"Lillinonah!N21","v":7.8500000000000005},"Steve D",{"$f":"'CT River'!N21","v":8.76},"Steve D",{"$f":"Bashan!N21","v":8.09},62.120000000000005,null,"Steve D",62.120000000000005]
["Steve S",{"$f":"Moodus!N22","v":1.1499999999999999},"Steve S",{"$f":"Bantam!N22","v":1.34},"Steve S",{"$f":"Gardner!N22","v":6.6},"Steve S",{"$f":"Candlewood!N22","v":0},"Steve S",{"$f":"'Twin Lakes'!N22","v":6.56},"Steve S",{"$f":"Lillinonah!N22","v":3.68},"Steve S",{"$f":"'CT River'!N22","v":1.61},"Steve S",{"$f":"Bashan!N22","v":1.43},22.369999999999997,null,"Steve S",22.369999999999997]
["Tom ",{"$f":"Moodus!N23","v":1.04},"Tom ",{"$f":"Bantam!N23","v":1.05},"Tom ",{"$f":"Gardner!N23","v":7.24},"Tom ",{"$f":"Candlewood!N23","v":1.01},"Tom ",{"$f":"'Twin Lakes'!N23","v":9.9300000000000015},"Tom ",{"$f":"Lillinonah!N23","v":0},"Tom ",{"$f":"'CT River'!N23","v":1.26},"Tom ",{"$f":"Bashan!N23","v":0},21.530000000000005,null,"Tom ",21.530000000000005]
["X",{"$f":"Moodus!N24","v":0},"X",{"$f":"Bantam!N24","v":0},"X",{"$f":"Gardner!N24","v":0},"X",{"$f":"Candlewood!N24","v":0},"X",{"$f":"'Twin Lakes'!N24","v":0},"X",{"$f":"Lillinonah!N24","v":0},"X",{"$f":"'CT River'!N24","v":0},"X",{"$f":"Bashan!N24","v":0},0,null,"X",0]
["X",{"$f":"Moodus!N25","v":0},"X",{"$f":"Bantam!N25","v":0},"X",{"$f":"Gardner!N25","v":0},"X",{"$f":"Candlewood!N25","v":0},"X",{"$f":"'Twin Lakes'!N25","v":0},"X",{"$f":"Lillinonah!N25","v":0},"X",{"$f":"'CT River'!N25","v":0},"X",{"$f":"Bashan!N25","v":0},0,null,"X",0]
["X",{"$f":"Moodus!N26","v":0},"X",{"$f":"Bantam!N26","v":0},"X",{"$f":"Gardner!N26","v":0},"X",{"$f":"Candlewood!N26","v":0},"X",{"$f":"'Twin Lakes'!N26","v":0},"X",{"$f":"Lillinonah!N26","v":0},"X",{"$f":"'CT River'!N26","v":0},"X",{"$f":"Bashan!N26","v":0},0,null,"X",0]
["X",{"$f":"Moodus!N27","v":0},"X",{"$f":"Bantam!N27","v":0},"X",{"$f":"Gardner!N27","v":0},"X",{"$f":"Candlewood!N27","v":0},"X",{"$f":"'Twin Lakes'!N27","v":0},"X",{"$f":"Lillinonah!N27","v":0},"X",{"$f":"'CT River'!N27","v":0},"X",{"$f":"Bashan!N27","v":0},0,null,"X",0]
["X",{"$f":"Moodus!N28","v":0},"X",{"$f":"Bantam!N28","v":0},"X",{"$f":"Gardner!N28","v":0},"X",{"$f":"Candlewood!N28","v":0},"X",{"$f":"'Twin Lakes'!N28","v":0},"X",{"$f":"Lillinonah!N28","v":0},"X",{"$f":"'CT River'!N28","v":0},"X",{"$f":"Bashan!N28","v":0},0,null,"X",0]
["X",{"$f":"Moodus!N29","v":0},"X",{"$f":"Bantam!N29","v":0},"X",{"$f":"Gardner!N29","v":0},"X",{"$f":"Candlewood!N29","v":0},"X",{"$f":"'Twin Lakes'!N29","v":0},"X",{"$f":"Lillinonah!N29","v":0},"X",{"$f":"'CT River'!N29","v":0},"X",{"$f":"Bashan!N29","v":0},0,null,"X",0]
[]
["Lunkers"]
[{"$f":"A45","v":"Moodus"},null,null,{"$f":"C45","v":"Bantam"},null,null,{"$f":"E45","v":"Gardner"},null,null,{"$f":"G45","v":"Candlewood"},null,null,{"$f":"I45","v":"Twin Lakes"},null,null,{"$f":"K45","v":"Lillinonah"},null,null,{"$f":"M45","v":"CT River"},null,null,{"$f":"O45","v":"Bashan"}]
["Name","Weight","L or S","Name","Weight","L or S","Name","Weight","L or S","Name","Weight","L or S","Name","Weight","L or S","Name","Weight","L or S","Name","Weight","L or S","Name","Weight","L or S"]
[{"$f":"$P15","v":"Anthony"},{"$f":"Moodus!J4","v":0},{"$f":"Moodus!K4","v":0},{"$f":"$P15","v":"Anthony"},{"$f":"Bantam!J4","v":0},{"$f":"Bantam!K4","v":0},{"$f":"$P15","v":"Anthony"},{"$f":"Gardner!J4","v":0},{"$f":"Gardner!K4","v":0},{"$f":"$P15","v":"Anthony"},{"$f":"Candlewood!J4","v":0},{"$f":"Candlewood!K4","v":0},{"$f":"$P15","v":"Anthony"},{"$f":"'Twin Lakes'!J4","v":0},{"$f":"'Twin Lakes'!K4","v":0},{"$f":"$P15","v":"Anthony"},{"$f":"Lillinonah!J4","v":0}," ",{"$f":"$P15","v":"Anthony"},{"$f":"'CT River'!J4","v":0},{"$f":"'CT River'!K4","v":0},{"$f":"$P15","v":"Anthony"},{"$f":"Bashan!J4","v":0},{"$f":"Bashan!K4","v":0}]
["Armand",{"$f":"Moodus!J5","v":0},{"$f":"Moodus!K5","v":0},"Armand",{"$f":"Bantam!J5","v":0},{"$f":"Bantam!K5","v":0},"Armand",{"$f":"Gardner!J5","v":0},{"$f":"Gardner!K5","v":0},"Armand",{"$f":"Candlewood!J5","v":0},{"$f":"Candlewood!K5","v":0},"Armand",{"$f":"'Twin Lakes'!J5","v":0},{"$f":"'Twin Lakes'!K5","v":0},"Armand",{"$f":"Lillinonah!J5","v":0},{"$f":"Lillinonah!K4","v":0},"Armand",{"$f":"'CT River'!J5","v":0},{"$f":"'CT River'!K5","v":0},"Armand",{"$f":"Bashan!J5","v":0},{"$f":"Bashan!K5","v":0}]
["Dean",{"$f":"Moodus!J7","v":0},{"$f":"Moodus!K8","v":0},"Dean",{"$f":"Bantam!J6","v":0},{"$f":"Bantam!K6","v":0},"Dean",{"$f":"Gardner!J6","v":0},{"$f":"Gardner!K6","v":0},"Dean",{"$f":"Candlewood!J6","v":0},{"$f":"Candlewood!K6","v":0},"Dean",{"$f":"'Twin Lakes'!J6","v":0},{"$f":"'Twin Lakes'!K6","v":0},"Dean",{"$f":"Lillinonah!J6","v":0},{"$f":"Lillinonah!K5","v":0},"Dean",{"$f":"'CT River'!J7","v":0},{"$f":"'CT River'!K7","v":0},"Dean",{"$f":"Bashan!J6","v":0},{"$f":"Bashan!K6","v":0}]
["Jack",{"$f":"Moodus!J8","v":0},{"$f":"Moodus!K9","v":0},"Jack",{"$f":"Bantam!J7","v":0},{"$f":"Bantam!K7","v":0},"Jack",{"$f":"Gardner!J7","v":0},{"$f":"Gardner!K7","v":0},"Jack",{"$f":"Candlewood!J7","v":0},{"$f":"Candlewood!K7","v":0},"Jack",{"$f":"'Twin Lakes'!J7","v":0},{"$f":"'Twin Lakes'!K7","v":0},"Jack",{"$f":"Lillinonah!J7","v":0},{"$f":"Lillinonah!K6","v":0},"Jack",{"$f":"'CT River'!J8","v":0},{"$f":"'CT River'!K8","v":0},"Jack",{"$f":"Bashan!J7","v":0},{"$f":"Bashan!K7","v":0}]
["Jason",{"$f":"Moodus!J9","v":0},{"$f":"Moodus!K10","v":0},"Jason",{"$f":"Bantam!J8","v":0},{"$f":"Bantam!K8","v":0},"Jason",{"$f":"Gardner!J8","v":0},{"$f":"Gardner!K8","v":0},"Jason",{"$f":"Candlewood!J8","v":0},{"$f":"Candlewood!K8","v":0},"Jason",{"$f":"'Twin Lakes'!J8","v":0},{"$f":"'Twin Lakes'!K8","v":0},"Jason",{"$f":"Lillinonah!J8","v":0},{"$f":"Lillinonah!K7","v":0},"Jason",{"$f":"'CT River'!J9","v":0},{"$f":"'CT River'!K9","v":0},"Jason",{"$f":"Bashan!J8","v":0},{"$f":"Bashan!K8","v":0}]
["Jim B",{"$f":"Moodus!J10","v":0},{"$f":"Moodus!K11","v":0},"Jim B",{"$f":"Bantam!J9","v":0},{"$f":"Bantam!K9","v":0},"Jim B",{"$f":"Gardner!J9","v":0},{"$f":"Gardner!K9","v":0},"Jim B",{"$f":"Candlewood!J9","v":0},{"$f":"Candlewood!K9","v":0},"Jim B",{"$f":"'Twin Lakes'!J9","v":0},{"$f":"'Twin Lakes'!K9","v":0},"Jim B",{"$f":"Lillinonah!J9","v":0},{"$f":"Lillinonah!K8","v":0},"Jim B",{"$f":"'CT River'!J10","v":0},{"$f":"'CT River'!K10","v":0},"Jim B",{"$f":"Bashan!J9","v":0},{"$f":"Bashan!K9","v":0}]
["Kam",{"$f":"Moodus!J11","v":0},{"$f":"Moodus!K12","v":0},"Kam",{"$f":"Bantam!J10","v":0},{"$f":"Bantam!K10","v":0},"Kam",{"$f":"Gardner!J10","v":0},{"$f":"Gardner!K10","v":0},"Kam",{"$f":"Candlewood!J10","v":0},{"$f":"Candlewood!K9","v":0},"Kam",{"$f":"'Twin Lakes'!J10","v":0},{"$f":"'Twin Lakes'!K10","v":0},"Kam",{"$f":"Lillinonah!J10","v":0},{"$f":"Lillinonah!K9","v":0},"Kam",{"$f":"'CT River'!J11","v":0},{"$f":"'CT River'!K11","v":0},"Kam",{"$f":"Bashan!J10","v":0},{"$f":"Bashan!K10","v":0}]
["Kevin",{"$f":"Moodus!J13","v":0},{"$f":"Moodus!K14","v":0},"Kevin",{"$f":"Bantam!J13","v":0},{"$f":"Bantam!K13","v":0},"Kevin",{"$f":"Gardner!J11","v":0},{"$f":"Gardner!K11","v":0},"Kevin",{"$f":"Candlewood!J11","v":0},{"$f":"Candlewood!K10","v":0},"Kevin",{"$f":"'Twin Lakes'!J11","v":0},{"$f":"'Twin Lakes'!K11","v":0},"Kevin",{"$f":"Lillinonah!J11","v":0},{"$f":"Lillinonah!K10","v":0},"Kevin",{"$f":"'CT River'!J13","v":0},{"$f":"'CT River'!K12","v":0},"Kevin",{"$f":"Bashan!J11","v":0},{"$f":"Bashan!K11","v":0}]
["Mike M",{"$f":"Moodus!J12","v":0},{"$f":"Moodus!K13","v":0},"Mike M",{"$f":"Bantam!J12","v":0},{"$f":"Bantam!K12","v":0},"Mike M",{"$f":"Gardner!J13","v":0},{"$f":"Gardner!K13","v":0},"Mike M",{"$f":"Candlewood!J13","v":0},{"$f":"Candlewood!K11","v":0},"Mike M",{"$f":"'Twin Lakes'!J12","v":0},{"$f":"'Twin Lakes'!K13","v":0},"Mike M",{"$f":"Lillinonah!J12","v":0},{"$f":"Lillinonah!K12","v":0},"Mike M",{"$f":"'CT River'!J14","v":0},{"$f":"'CT River'!K14","v":0},"Mike M",{"$f":"Bashan!J12","v":0},{"$f":"Bashan!K13","v":0}]
["Mike G",{"$f":"Moodus!J14","v":0},{"$f":"Moodus!K15","v":0},"Mike G",{"$f":"Bantam!J14","v":0},{"$f":"Bantam!K14","v":0},"Mike G",{"$f":"Gardner!J12","v":0},{"$f":"Gardner!K12","v":0},"Mike G",{"$f":"Candlewood!J14","v":0},{"$f":"Candlewood!K13","v":0},"Mike G",{"$f":"'Twin Lakes'!J13","v":0},{"$f":"'Twin Lakes'!K12","v":0},"Mike G",{"$f":"Lillinonah!J13","v":0},{"$f":"Lillinonah!K11","v":0},"Mike G",{"$f":"'CT River'!J12","v":0},{"$f":"'CT River'!K13","v":0},"Mike G",{"$f":"Bashan!J13","v":0},{"$f":"Bashan!K12","v":0}]
["Morrie",{"$f":"Moodus!J15","v":0},{"$f":"Moodus!K16","v":0},"Morrie",{"$f":"Bantam!J15","v":0},{"$f":"Bantam!K15","v":0},"Morrie",{"$f":"Gardner!J14","v":0},{"$f":"Gardner!K14","v":0},"Mike M",{"$f":"Candlewood!J28","v":0},{"$f":"Candlewood!K28","v":0},"Morrie",{"$f":"'Twin Lakes'!J14","v":0},{"$f":"'Twin Lakes'!K14","v":0},"Morrie",{"$f":"Lillinonah!J15","v":0},{"$f":"Lillinonah!K14","v":"SMB"},"Morrie",{"$f":"'CT River'!J15","v":0},{"$f":"'CT River'!K15","v":0},"Morrie",{"$f":"Bashan!J14","v":0},{"$f":"Bashan!K14","v":0}]
["Peter",{"$f":"Moodus!J16","v":0},{"$f":"Moodus!K17","v":0},"Peter",{"$f":"Bantam!J16","v":0},{"$f":"Bantam!K16","v":0},"Peter",{"$f":"Gardner!J15","v":0},{"$f":"Gardner!K15","v":0},{"$f":"$P26","v":"Peter"},{"$f":"Candlewood!J15","v":0},{"$f":"Candlewood!K14","v":0},"Peter",{"$f":"'Twin Lakes'!J15","v":0},{"$f":"'Twin Lakes'!K15","v":0},"Peter",{"$f":"Lillinonah!J16","v":0},{"$f":"Lillinonah!K15","v":0},"Peter",{"$f":"'CT River'!J17","v":0},{"$f":"'CT River'!K17","v":0},"Peter",{"$f":"Bashan!J15","v":0},{"$f":"Bashan!K15","v":0}]
["Rich B",{"$f":"Moodus!J17","v":0},{"$f":"Moodus!K18","v":0},"Rich B",{"$f":"Bantam!J17","v":0},{"$f":"Bantam!K17","v":0},"Rich B",{"$f":"Gardner!J16","v":0},{"$f":"Gardner!K16","v":0},"Rich B",{"$f":"Candlewood!J16","v":0},{"$f":"Candlewood!K15","v":0},"Rich B",{"$f":"'Twin Lakes'!J16","v":0},{"$f":"'Twin Lakes'!K16","v":0},"Rich B",{"$f":"Lillinonah!J17","v":0},{"$f":"Lillinonah!K16","v":0},"Rich B",{"$f":"'CT River'!J18","v":0},{"$f":"'CT River'!K18","v":0},"Rich B",{"$f":"Bashan!J16","v":0},{"$f":"Bashan!K16","v":0}]
["Rich T",{"$f":"Moodus!J18","v":0},{"$f":"Moodus!K19","v":0},"Rich T",{"$f":"Bantam!J18","v":0},{"$f":"Bantam!K18","v":0},"Rich T",{"$f":"Gardner!J18","v":0},{"$f":"Gardner!K18","v":0},"Rich T",{"$f":"Candlewood!J17","v":0},{"$f":"Candlewood!K16","v":0},"Rich T",{"$f":"'Twin Lakes'!J17","v":0},{"$f":"'Twin Lakes'!K16","v":0},"Rich T",{"$f":"Lillinonah!J18","v":0},{"$f":"Lillinonah!K17","v":0},"Rich T",{"$f":"'CT River'!J19","v":0},{"$f":"'CT River'!K19","v":0},"Rich T",{"$f":"Bashan!J17","v":0},{"$f":"Bashan!K17","v":0}]
["Ron",{"$f":"Moodus!J19","v":0},{"$f":"Moodus!K20","v":0},"Ron",{"$f":"Bantam!J19","v":0},{"$f":"Bantam!K19","v":0},"Ron",{"$f":"Gardner!J19","v":0},{"$f":"Gardner!K19","v":0},"Ron",{"$f":"Candlewood!J18","v":0},{"$f":"Candlewood!K17","v":0},"Ron",{"$f":"'Twin Lakes'!J18","v":0},{"$f":"'Twin Lakes'!K17","v":0},"Ron",{"$f":"Lillinonah!J19","v":0},{"$f":"Lillinonah!K18","v":0},"Ron",{"$f":"'CT River'!J20","v":0},{"$f":"'CT River'!K20","v":0},"Ron",{"$f":"Bashan!J18","v":0},{"$f":"Bashan!K18","v":0}]
["Ryan",{"$f":"Moodus!J20","v":0},{"$f":"Moodus!K21","v":0},"Ryan",{"$f":"Bantam!J20","v":0},{"$f":"Bantam!K20","v":0},"Ryan",{"$f":"Gardner!J20","v":0},{"$f":"Gardner!K20","v":0},"Ryan",{"$f":"Candlewood!J19","v":0},{"$f":"Candlewood!K18","v":0},"Ryan",{"$f":"'Twin Lakes'!J19","v":0},{"$f":"'Twin Lakes'!K18","v":0},"Ryan",{"$f":"Lillinonah!J20","v":0},{"$f":"Lillinonah!K19","v":0},"Ryan",{"$f":"'CT River'!J21","v":0},{"$f":"'CT River'!K21","v":0},"Ryan",{"$f":"Bashan!J19","v":0},{"$f":"Bashan!K19","v":0}]
["Scott",{"$f":"Moodus!J21","v":0},{"$f":"Moodus!K22","v":0},"Scott",{"$f":"Bantam!J21","v":0},{"$f":"Bantam!K21","v":0},"Scott",{"$f":"Gardner!J21","v":0},{"$f":"Gardner!K21","v":0},"Scott",{"$f":"Candlewood!J20","v":0},{"$f":"Candlewood!K19","v":0},"Scott",{"$f":"'Twin Lakes'!J20","v":0},{"$f":"'Twin Lakes'!K19","v":0},"Scott",{"$f":"Lillinonah!J21","v":0},{"$f":"Lillinonah!K20","v":0},"Scott",{"$f":"'CT River'!J22","v":0},{"$f":"'CT River'!K22","v":0},"Scott",{"$f":"Bashan!J20","v":0},{"$f":"Bashan!K20","v":0}]
["Steve D",{"$f":"Moodus!J22","v":0},{"$f":"Moodus!K23","v":0},"Steve D",{"$f":"Bantam!J22","v":0},{"$f":"Bantam!K22","v":0},"Steve D",{"$f":"Gardner!J22","v":0},{"$f":"Gardner!K22","v":0},"Steve D",{"$f":"Candlewood!J21","v":0},{"$f":"Candlewood!K20","v":0},"Steve D",{"$f":"'Twin Lakes'!J21","v":0},{"$f":"'Twin Lakes'!K20","v":0},"Steve D",{"$f":"Lillinonah!J22","v":0},{"$f":"Lillinonah!K21","v":0},"Steve D",{"$f":"'CT River'!J23","v":0},{"$f":"'CT River'!K23","v":0},"Steve D",{"$f":"Bashan!J22","v":0},{"$f":"Bashan!K22","v":0}]
["Steve S",{"$f":"Moodus!J23","v":0},{"$f":"Moodus!K24","v":0},"Steve S",{"$f":"Bantam!J23","v":0},{"$f":"Bantam!K23","v":0},"Steve S",{"$f":"Gardner!J23","v":0},{"$f":"Gardner!K23","v":0},"Steve S",{"$f":"Candlewood!J22","v":0},{"$f":"Candlewood!K21","v":0},"Steve S",{"$f":"'Twin Lakes'!J22","v":0},{"$f":"'Twin Lakes'!K21","v":0},"Steve S",{"$f":"Lillinonah!J23","v":0},{"$f":"Lillinonah!K22","v":0},"Steve S",{"$f":"'CT River'!J24","v":0},{"$f":"'CT River'!K24","v":0},"Steve S",{"$f":"Bashan!J23","v":0},{"$f":"Bashan!K23","v":0}]
["Tom ",{"$f":"Moodus!J24","v":0},{"$f":"Moodus!K25","v":0},"Tom ",{"$f":"Bantam!J24","v":0},{"$f":"Bantam!K24","v":0},"Tom ",{"$f":"Gardner!J24","v":0},{"$f":"Gardner!K24","v":0},"Tom ",{"$f":"Candlewood!J23","v":0},{"$f":"Candlewood!K22","v":0},"Tom ",{"$f":"'Twin Lakes'!J24","v":0},{"$f":"'Twin Lakes'!K23","v":"LMB"},"Tom ",{"$f":"Lillinonah!J24","v":0},{"$f":"Lillinonah!K23","v":0},"Tom ",{"$f":"'CT River'!J25","v":0},{"$f":"'CT River'!K25","v":0},"Tom ",{"$f":"Bashan!J24","v":0},{"$f":"Bashan!K24","v":0}]
["X",{"$f":"Moodus!J25","v":0},{"$f":"Moodus!K26","v":0},"X",{"$f":"Bantam!J25","v":0},{"$f":"Bantam!K25","v":0},"X",{"$f":"Gardner!J25","v":0},{"$f":"Gardner!K25","v":0},"X",{"$f":"Candlewood!J24","v":0},{"$f":"Candlewood!K23","v":0},"X",{"$f":"'Twin Lakes'!J25","v":0},{"$f":"'Twin Lakes'!K24","v":0},"X",{"$f":"Lillinonah!J25","v":0},{"$f":"Lillinonah!K24","v":0},"X",{"$f":"'CT River'!J26","v":0},{"$f":"'CT River'!K26","v":0},"X",{"$f":"Bashan!J25","v":0},{"$f":"Bashan!K25","v":0}]
["X",{"$f":"Moodus!J26","v":0},{"$f":"Moodus!K27","v":0},"X",{"$f":"Bantam!J26","v":0},{"$f":"Bantam!K26","v":0},"X",{"$f":"Gardner!J26","v":0},{"$f":"Gardner!K26","v":0},"X",{"$f":"Candlewood!J25","v":0},{"$f":"Candlewood!K24","v":0},"X",{"$f":"'Twin Lakes'!J26","v":0},{"$f":"'Twin Lakes'!K25","v":0},"X",{"$f":"Lillinonah!J26","v":0},{"$f":"Lillinonah!K25","v":0},"X",{"$f":"'CT River'!J27","v":0},{"$f":"'CT River'!K27","v":0},"X",{"$f":"Bashan!J26","v":0},{"$f":"Bashan!K26","v":0}]
["X",{"$f":"Moodus!J27","v":0},{"$f":"Moodus!K28","v":0},"X",{"$f":"Bantam!J27","v":0},{"$f":"Bantam!K27","v":0},"X",{"$f":"Gardner!J27","v":0},{"$f":"Gardner!K27","v":0},"X",{"$f":"Candlewood!J26","v":0},{"$f":"Candlewood!K25","v":0},"X",{"$f":"'Twin Lakes'!J27","v":0},{"$f":"'Twin Lakes'!K26","v":0},"X",{"$f":"Lillinonah!J27","v":0},{"$f":"Lillinonah!K26","v":0},"X",{"$f":"'CT River'!J28","v":0},{"$f":"'CT River'!K28","v":0},"X",{"$f":"Bashan!J27","v":0},{"$f":"Bashan!K27","v":0}]
["X",0,{"$f":"Moodus!K7","v":0},"X",{"$f":"Bantam!J28","v":0},{"$f":"Bantam!K28","v":0},"X",{"$f":"Gardner!J28","v":0},{"$f":"Gardner!K28","v":0},"X",{"$f":"Candlewood!J27","v":0},{"$f":"Candlewood!K26","v":0},"X",{"$f":"'Twin Lakes'!J28","v":0},{"$f":"'Twin Lakes'!K27","v":0},"X",{"$f":"Lillinonah!J28","v":0},{"$f":"Lillinonah!K27","v":0},"X",{"$f":"'CT River'!J29","v":0},{"$f":"'CT River'!K29","v":0},"X",{"$f":"Bashan!J28","v":0},{"$f":"Bashan!K28","v":0}]
["Dean",{"$f":"Moodus!J6","v":5.84},{"$f":"Moodus!K6","v":"LMB"},"Kevin",{"$f":"Bantam!J11","v":5.73},{"$f":"Bantam!K11","v":"LMB"},"Rich T",{"$f":"Gardner!J17","v":3.85},{"$f":"Gardner!K17","v":"LMB"},"X",{"$f":"Candlewood!J28","v":0},{"$f":"Candlewood!K27","v":0},"X",{"$f":"'Twin Lakes'!J28","v":0},{"$f":"'Twin Lakes'!K28","v":0},{"$f":"AE39","v":"X"},{"$f":"Lillinonah!J28","v":0},{"$f":"Lillinonah!K28","v":0},{"$f":"$P39","v":"X"},{"$f":"'CT River'!J16","v":4.43},{"$f":"'CT River'!K16","v":"SMB"},"X",{"$f":"Bashan!J29","v":0},{"$f":"Bashan!K29","v":0}]
[{"$f":"$P40","v":"X"},{"$f":"Moodus!J6","v":5.84},{"$f":"Moodus!K8","v":0},{"$f":"$P40","v":"X"},{"$f":"Bantam!J11","v":5.73},{"$f":"Bantam!K11","v":"LMB"},null,{"$f":"Gardner!J17","v":3.85},{"$f":"Gardner!K17","v":"LMB"},{"$f":"J101","v":"X"},{"$f":"Candlewood!J12","v":4.03},{"$f":"Candlewood!K12","v":"LMB"},{"$f":"$P40","v":"X"},{"$f":"'Twin Lakes'!J23","v":4.55},{"$f":"'Twin Lakes'!K22","v":0},{"$f":"$P40","v":"X"},{"$f":"Lillinonah!J14","v":4.3},{"$f":"Lillinonah!K13","v":0},{"$f":"$P40","v":"X"},{"$f":"'CT River'!J16","v":4.43},{"$f":"'CT River'!K6","v":0},{"$f":"$P40","v":"X"},{"$f":"Bashan!J21","v":2.59},{"$f":"Bashan!K21","v":"LMB"}]
[{"$f":"A102","v":"X"},5.84,0,"X",5.73,"LMB",0,3.85,"LMB",{"$f":"J87","v":"Mike M"},{"$f":"K102","v":4.03},{"$f":"L102","v":"LMB"},{"$f":"M96","v":"Tom "},{"$f":"N102","v":4.55},{"$f":"O96","v":"LMB"},{"$f":"P87","v":"Morrie"},{"$f":"Q102","v":4.3},{"$f":"R87","v":"SMB"},"Rich B",{"$f":"T102","v":4.43},"SMB",{"$f":"V94","v":"Steve D"},{"$f":"W102","v":2.59},{"$f":"X102","v":"LMB"}]

{"sheet":"Report","index":10,"n_rows":34,"n_cols":12,"rows_kept":34,"cut":false,"hidden":false,"merged":[[48,0,48,2],[2,10,2,11],[2,4,2,8],[2,0,2,2],[27,5,27,6],[30,5,30,6],[25,5,25,6],[25,7,25,8],[26,5,26,6],[28,5,28,6],[29,5,29,6],[30,7,30,8],[0,0,0,11],[26,7,26,8],[28,7,28,8],[29,7,29,8],[27,7,27,8],[31,7,31,8],[31,5,31,6],[32,5,32,6],[33,5,33,6],[32,7,32,8],[33,7,33,8]]}
["MVBC 2017 Year-To-Date Report"]
[]
["Individual Standings",null,null,null,"Lunkers",null,null,null,null,null,"Individual Adj'd Total Weight"]
["Name","Position","Points",null,"Lake / River","Name","Weight","Species","Trophy",null,"Name","Adj'd Weight"]
[{"$f":"YTD!E15","v":"Steve D"},{"$f":"YTD!F15","v":1},{"$f":"YTD!G15","v":12},null,{"$f":"YTD!L15","v":"Moodus"},"Dean",{"$f":"YTD!B103","v":5.84},"LMB",{"$f":"IF((H5=\"LMB\")*AND(G5>=6),\"Yes\",IF((H5=\"SMB\")*AND(G5>=4),\"Yes\",\"No\"))","v":"No"},null,{"$f":"YTD!S64","v":"Steve D"},{"$f":"YTD!T64","v":62.120000000000005}]
[{"$f":"YTD!E16","v":"Rich T"},{"$f":"YTD!F16","v":2},{"$f":"YTD!G16","v":21},null,{"$f":"YTD!L16","v":"Bantam"},"Kevin",{"$f":"YTD!E103","v":5.73},{"$f":"IF(YTD!F103=0,\"N/A\",YTD!F103)","v":"LMB"},{"$f":"IF((H6=\"LMB\")*AND(G6>=6),\"Yes\",IF((H6=\"SMB\")*AND(G6>=4),\"Yes\",\"No\"))","v":"No"},null,{"$f":"YTD!S54","v":"Kevin"},{"$f":"YTD!T54","v":53.05}]
[{"$f":"YTD!E17","v":"Kevin"},{"$f":"YTD!F17","v":3},{"$f":"YTD!G17","v":23},null,{"$f":"YTD!L17","v":"Gardner"},"Rich T",{"$f":"YTD!H103","v":3.85},{"$f":"IF(YTD!I103=0,\"N/A\",YTD!I103)","v":"LMB"},"No",null,{"$f":"YTD!S60","v":"Rich T"},{"$f":"YTD!T60","v":48.59}]
[{"$f":"YTD!E18","v":"Dean"},{"$f":"YTD!F18","v":4},{"$f":"YTD!G18","v":29},null,{"$f":"YTD!L18","v":"Candlewood"},{"$f":"IF(YTD!J103=\"X\",\"N/A\",YTD!J103)","v":"Mike M"},{"$f":"YTD!K103","v":4.03},{"$f":"IF(YTD!L103=0,\"N/A\",YTD!L103)","v":"LMB"},"No",null,{"$f":"YTD!S49","v":"Dean"},{"$f":"YTD!T49","v":47.749999999999993}]
[{"$f":"YTD!E19","v":"Rich B"},{"$f":"YTD!F19","v":5},{"$f":"YTD!G19","v":40},null,{"$f":"YTD!L19","v":"Twin Lakes"},{"$f":"IF(YTD!M103=\"X\",\"N/A\",YTD!M103)","v":"Tom "},{"$f":"YTD!N103","v":4.55},{"$f":"IF(YTD!O103=0,\"N/A\",YTD!O103)","v":"LMB"},{"$f":"IF((H9=\"LMB\")*AND(G9>=6),\"Yes\",IF((H9=\"SMB\")*AND(G9>=4),\"Yes\",\"No\"))","v":"No"},null,{"$f":"YTD!S59","v":"Rich B"},{"$f":"YTD!T59","v":46.22}]
[{"$f":"YTD!E20","v":"Ryan"},{"$f":"YTD!F20","v":6},{"$f":"YTD!G20","v":45},null,{"$f":"YTD!L20","v":"Lillinonah"},{"$f":"IF(YTD!P103=\"X\",\"N/A\",YTD!P103)","v":"Morrie"},{"$f":"YTD!Q103","v":4.3},{"$f":"IF(YTD!R103=0,\"N/A\",YTD!R103)","v":"SMB"},{"$f":"IF((H10=\"LMB\")*AND(G10>=6),\"Yes\",IF((H10=\"SMB\")*AND(G10>=4),\"Yes\",\"No\"))","v":"Yes"},null,{"$f":"YTD!S51","v":"Jason"},{"$f":"YTD!T51","v":36.119999999999997}]
[{"$f":"YTD!E21","v":"Peter"},{"$f":"YTD!F21","v":7},{"$f":"YTD!G21","v":46},null,{"$f":"YTD!L21","v":"CT River"},{"$f":"IF(YTD!S103=\"X\",\"N/A\",YTD!S103)","v":"Rich B"},{"$f":"YTD!T103","v":4.43},{"$f":"IF(YTD!U103=0,\"N/A\",YTD!U103)","v":"SMB"},"Yes",null,{"$f":"YTD!S63","v":"Scott"},{"$f":"YTD!T63","v":32.15}]
[{"$f":"YTD!E22","v":"Jason"},{"$f":"YTD!F22","v":8},{"$f":"YTD!G22","v":49},null,{"$f":"YTD!L22","v":"Bashan"},{"$f":"IF(YTD!V103=\"X\",\"N/A\",YTD!V103)","v":"Steve D"},{"$f":"YTD!W103","v":2.59},{"$f":"IF(YTD!X103=0,\"N/A\",YTD!X103)","v":"LMB"},{"$f":"IF((H12=\"LMB\")*AND(G12>=6),\"Yes\",IF((H12=\"SMB\")*AND(G12>=4),\"Yes\",\"No\"))","v":"No"},null,{"$f":"YTD!S62","v":"Ryan"},{"$f":"YTD!T62","v":31.950000000000003}]
[{"$f":"YTD!E23","v":"Scott"},{"$f":"YTD!F23","v":9},{"$f":"YTD!G23","v":54},null,null,null,null,null,null,null,{"$f":"YTD!S58","v":"Peter"},{"$f":"YTD!T58","v":30}]
[{"$f":"YTD!E24","v":"Anthony"},{"$f":"YTD!F24","v":10},{"$f":"YTD!G24","v":55},null,"Statistics",null,null,null,null,null,{"$f":"YTD!S47","v":"Anthony"},{"$f":"YTD!T47","v":28.56}]
[{"$f":"YTD!E25","v":"Tom "},{"$f":"YTD!F25","v":11},{"$f":"YTD!G25","v":60},null,"Lake / River","Anglers","Fish","Total Wt","Avg Wt",null,{"$f":"YTD!S65","v":"Steve S"},{"$f":"YTD!T65","v":22.369999999999997}]
[{"$f":"YTD!E26","v":"Steve S"},{"$f":"YTD!F26","v":12},{"$f":"YTD!G26","v":61},null,{"$f":"YTD!L15","v":"Moodus"},{"$f":"Moodus!E30","v":20},{"$f":"Moodus!M30","v":38},{"$f":"Moodus!L30","v":43.21},{"$f":"IF(G16=0,0,H16/G16)","v":1.1371052631578948},null,{"$f":"YTD!S48","v":"Armand"},{"$f":"YTD!T48","v":22.299999999999997}]
[{"$f":"YTD!E27","v":"Mike M"},{"$f":"YTD!F27","v":13},{"$f":"YTD!G27","v":63},null,{"$f":"YTD!L16","v":"Bantam"},{"$f":"Bantam!E30","v":17},{"$f":"Bantam!M30","v":34},{"$f":"Bantam!L30","v":71.240000000000009},2.0952941176470592,null,{"$f":"YTD!S66","v":"Tom "},{"$f":"YTD!T66","v":21.530000000000005}]
[{"$f":"YTD!E28","v":"Jack"},{"$f":"YTD!F28","v":14},{"$f":"YTD!G28","v":68},null,{"$f":"YTD!L17","v":"Gardner"},{"$f":"Gardner!E30","v":17},{"$f":"Gardner!M30","v":73},{"$f":"Gardner!L30","v":109.87999999999998},1.5052054794520546,null,{"$f":"YTD!S55","v":"Mike M"},{"$f":"YTD!T55","v":20.46}]
[{"$f":"YTD!E29","v":"Morrie"},{"$f":"YTD!F29","v":15},{"$f":"YTD!G29","v":77},null,{"$f":"YTD!L18","v":"Candlewood"},{"$f":"Candlewood!E30","v":17},{"$f":"Candlewood!M30","v":32},{"$f":"Candlewood!L30","v":57.199999999999996},1.7874999999999999,null,{"$f":"YTD!S61","v":"Ron"},{"$f":"YTD!T61","v":20.039999999999996}]
[{"$f":"YTD!E30","v":"Ron"},{"$f":"YTD!F30","v":16},{"$f":"YTD!G30","v":78},null,{"$f":"YTD!L19","v":"Twin Lakes"},{"$f":"'Twin Lakes'!E30","v":19},{"$f":"'Twin Lakes'!M30","v":66},{"$f":"'Twin Lakes'!L30","v":109.78999999999998},1.6634848484848481,null,{"$f":"YTD!S50","v":"Jack"},{"$f":"YTD!T50","v":18.93}]
[{"$f":"YTD!E31","v":"Armand"},{"$f":"YTD!F31","v":17},{"$f":"YTD!G31","v":88},null,{"$f":"YTD!L20","v":"Lillinonah"},{"$f":"Lillinonah!E30","v":18},{"$f":"Lillinonah!M30","v":56},{"$f":"Lillinonah!L30","v":86.49},1.5444642857142856,null,{"$f":"YTD!S56","v":"Mike G"},{"$f":"YTD!T56","v":17.950000000000003}]
[{"$f":"YTD!E32","v":"Mike G"},{"$f":"YTD!F32","v":18},{"$f":"YTD!G32","v":90},null,{"$f":"YTD!L21","v":"CT River"},{"$f":"'CT River'!E30","v":16},{"$f":"'CT River'!M30","v":27},{"$f":"'CT River'!L30","v":46.47},1.721111111111111,null,{"$f":"YTD!S57","v":"Morrie"},{"$f":"YTD!T57","v":16.329999999999998}]
[{"$f":"YTD!E33","v":"Jim B"},{"$f":"YTD!F33","v":19},{"$f":"YTD!G33","v":106},null,{"$f":"YTD!L22","v":"Bashan"},{"$f":"Bashan!E30","v":15},{"$f":"Bashan!M30","v":55},{"$f":"Bashan!L30","v":82.06},1.492,null,{"$f":"YTD!S52","v":"Jim B"},{"$f":"YTD!T52","v":15.82}]
[{"$f":"YTD!E34","v":"Kam"},{"$f":"YTD!F34","v":20},{"$f":"YTD!G34","v":127},null,null,null,null,null,null,null,{"$f":"YTD!S53","v":"Kam"},{"$f":"YTD!T53","v":11.3}]
[{"$f":"YTD!E35","v":"X"},{"$f":"YTD!F35","v":21},{"$f":"YTD!G35","v":210},null,"Winning Teams",null,null,null,null,null,{"$f":"YTD!S67","v":"X"},{"$f":"YTD!T67","v":0}]
[{"$f":"YTD!E36","v":"X"},{"$f":"YTD!F36","v":21},{"$f":"YTD!G36","v":210},null,"Lake / River","Team Number",null,"Total Weight",null,null,{"$f":"YTD!S68","v":"X"},{"$f":"YTD!T68","v":0}]
[{"$f":"YTD!E37","v":"X"},{"$f":"YTD!F37","v":21},{"$f":"YTD!G37","v":210},null,{"$f":"YTD!L15","v":"Moodus"},{"$f":"IF(Teams!N4=20,\"N/A\",Teams!N4)","v":2},null,{"$f":"Teams!O4","v":9.4700000000000006},null,null,{"$f":"YTD!S69","v":"X"},{"$f":"YTD!T69","v":0}]
[{"$f":"YTD!E38","v":"X"},{"$f":"YTD!F38","v":21},{"$f":"YTD!G38","v":210},null,{"$f":"YTD!L16","v":"Bantam"},{"$f":"IF(Teams!N34=20,\"N/A\",Teams!N34)","v":2},null,{"$f":"Teams!O34","v":16.649999999999999},null,null,{"$f":"YTD!S70","v":"X"},{"$f":"YTD!T70","v":0}]
[{"$f":"YTD!E39","v":"X"},{"$f":"YTD!F39","v":21},{"$f":"YTD!G39","v":210},null,{"$f":"YTD!L17","v":"Gardner"},{"$f":"IF(Teams!N64=20,\"N/A\",Teams!N64)","v":5},null,{"$f":"Teams!O64","v":15.99},null,null,{"$f":"YTD!S71","v":"X"},{"$f":"YTD!T71","v":0}]
[{"$f":"YTD!E40","v":"X"},{"$f":"YTD!F40","v":21},{"$f":"YTD!G40","v":210},null,{"$f":"YTD!L18","v":"Candlewood"},{"$f":"IF(Teams!N94=20,\"N/A\",Teams!N94)","v":3},null,{"$f":"Teams!O94","v":9.4},null,null,{"$f":"YTD!S72","v":"X"},{"$f":"YTD!T72","v":0}]
[null,null,null,null,{"$f":"YTD!L19","v":"Twin Lakes"},{"$f":"IF(Teams!AD4=20,\"N/A\",Teams!AD4)","v":4},null,{"$f":"Teams!AE4","v":19.829999999999998}]
[null,null,null,null,{"$f":"YTD!L20","v":"Lillinonah"},{"$f":"IF(Teams!AD34=20,\"N/A\",Teams!AD34)","v":8},null,{"$f":"Teams!AE34","v":14.990000000000002}]
[null,null,null,null,{"$f":"YTD!L21","v":"CT River"},{"$f":"IF(Teams!AD64=20,\"N/A\",Teams!AD64)","v":2},null,{"$f":"Teams!AE64","v":15.72}]
[null,null,null,null,{"$f":"YTD!L22","v":"Bashan"},{"$f":"IF(Teams!AD94=20,\"N/A\",Teams!AD94)","v":5},null,{"$f":"Teams!AE94","v":16.84}]

{"sheet":"Sheet1","index":11,"n_rows":26,"n_cols":8,"rows_kept":26,"cut":false,"hidden":false,"merged":[]}
[]
[]
[]
[]
[]
[null,null,null,null,null,null,null,{"$f":"P15","v":0}]
[null,null,null,null,null,null,null,0]
[null,null,null,null,null,null,null,0]
[null,null,null,null,null,null,null,0]
[null,null,null,null,null,null,null,0]
[null,null,null,null,null,null,null,0]
[null,null,null,null,null,null,null,0]
[null,null,null,null,null,null,null,0]
[null,null,null,null,null,null,null,0]
[null,null,null,null,null,null,null,0]
[null,null,null,null,null,null,null,0]
[null,null,null,null,null,null,null,0]
[null,null,null,null,null,null,null,0]
[null,null,null,null,null,null,null,0]
[null,null,null,null,null,null,null,0]
[null,null,null,null,null,null,null,0]
[null,null,null,null,null,null,null,0]
[null,null,null,null,null,null,null,0]
[null,null,null,null,null,null,null,0]
[null,null,null,null,null,null,null,0]
[null,null,null,null,null,null,null,0]