{"text_format":"1","workbook":"xlsx","n_sheets":13,"sheets":["Bantam","McDonough","Quaddick","Candlewood","Lillinonah","CT River","West Hill","Moodus","Teams","Report","YTD","Sheet1","Sheet2"],"not_rendered":{"charts":0,"images":0,"macros":1,"external_links":0,"defined_names":16,"comments":0,"pivot_tables":0},"unopened":[],"bounds":{"document_bytes":16777216,"sheet_cells":100000,"rows_first":2000,"rows_last":500,"rows_between":2000,"halvings":0,"cell_chars":16384,"cell_head_chars":4096},"cells_cut":0,"cells_raw":0,"read":"whole","date_system":"1900"}

{"sheet":"Bantam","index":0,"n_rows":34,"n_cols":17,"rows_kept":34,"cut":false,"hidden":false,"merged":[[1,0,2,0],[0,0,0,16],[30,6,30,7],[30,3,30,5],[30,13,30,14],[30,10,30,12],[31,13,31,14],[32,13,32,14],[33,13,33,14],[33,6,33,7],[31,6,31,7],[32,6,32,7]]}
[{"$f":"YTD!L15","v":"Bantam"}]
[null,"Team","Fish","Member","Show","Non","Number","Number","Number","Lunker","Species","Gross","Total","Net","Points","Non Boater","# Non-"]
[null,"Number","Alone?","Name","Up?","Boater?","of LMB","of SMB","Dead","Weight","LMB/SMB","Weight","Caught","Weight","Awarded","Weight","Boaters"]
[1,1,"N",{"$f":"YTD!P15","v":"Anthony"},"Y","Y",null,1,null,null,null,0.73,{"$f":"G4+H4","v":1},{"$f":"L4-(I4*0.2)","v":0.73},{"$f":"IF($E4=\"N\",35,IF($M4=0,30,RANK($N4,$N$4:$N$29,0)))","v":14},{"$f":"IF(F4=\"Y\",N4,0)","v":0.73},{"$f":"IF(E4=\"N\",0,(IF(F4=\"N\",0,1)))","v":1}]
[2,5,"N",{"$f":"YTD!P16","v":"Armand"},"Y","N",1,4,null,4.05,"SMB",10.57,5,10.57,{"$f":"IF($E5=\"N\",35,IF($M5=0,30,RANK($N5,$N$4:$N$29,0)))","v":1},0,{"$f":"IF(E5=\"N\",0,(IF(F5=\"N\",0,1)))","v":0}]
[3,2,"N",{"$f":"YTD!P17","v":"Dean"},"Y","N",4,1,null,null,null,10.28,{"$f":"G6+H6","v":5},{"$f":"L6-(I6*0.2)","v":10.28},2,{"$f":"IF(F6=\"Y\",N6,0)","v":0},0]
[4,8,"N",{"$f":"YTD!P18","v":"Jack"},"Y","N",3,2,null,null,null,7.41,5,7.41,5,0,0]
[5,3,"N",{"$f":"YTD!P19","v":"Jason"},"Y","N",1,2,null,null,null,7.62,{"$f":"G8+H8","v":3},{"$f":"L8-(I8*0.2)","v":7.62},4,{"$f":"IF(F8=\"Y\",N8,0)","v":0},0]
[6,6,"N",{"$f":"YTD!P20","v":"Jim B"},"Y","Y",1,null,null,3.7,"LMB",3.7,1,3.7,8,3.7,1]
[7,null,"N",{"$f":"YTD!P21","v":"Kam"},"N","Y",null,null,null,null,null,null,0,0,35,0,0]
[8,4,"N",{"$f":"YTD!P22","v":"Kevin"},"Y","N",5,null,null,null,null,7.8,{"$f":"G11+H11","v":5},{"$f":"L11-(I11*0.2)","v":7.8},3,{"$f":"IF(F11=\"Y\",N11,0)","v":0},0]
[9,3,"N",{"$f":"YTD!P23","v":"Mike G"},"Y","Y",null,null,null,null,null,null,0,0,30,0,1]
[10,null,"N",{"$f":"YTD!P24","v":"Morrie"},"N","N",null,null,null,null,null,null,0,0,35,0,0]
[11,4,"N",{"$f":"YTD!P25","v":"Oz"},"Y","Y",1,null,null,null,null,1.42,1,1.42,12,1.42,1]
[12,5,"N",{"$f":"YTD!P26","v":"Pete"},"Y","Y",null,4,null,null,null,5.17,4,5.17,6,5.17,1]
[13,1,"N",{"$f":"YTD!P27","v":"Rich B"},"Y","N",2,null,null,null,null,2.75,2,2.75,9,0,0]
[14,null,"N",{"$f":"YTD!P28","v":"Rich M"},"N","Y",null,null,null,null,null,null,0,0,35,0,0]
[15,2,"N",{"$f":"YTD!P29","v":"Rich T"},"Y","Y",null,null,null,null,null,null,{"$f":"G18+H18","v":0},{"$f":"L18-(I18*0.2)","v":0},30,0,1]
[16,8,"N",{"$f":"YTD!P30","v":"Ryan"},"Y","Y",1,2,null,null,null,3.91,3,3.91,7,3.91,1]
[17,7,"Y",{"$f":"YTD!P31","v":"Scott"},"Y","N",1,null,null,null,null,0.92,{"$f":"G20+H20","v":1},{"$f":"L20-(I20*0.2)","v":0.92},13,{"$f":"IF(F20=\"Y\",N20,0)","v":0},0]
[18,9,"N",{"$f":"YTD!P32","v":"Steve D"},"Y","N",null,1,null,null,null,2.06,1,2.06,10,0,0]
[19,6,"N",{"$f":"YTD!P33","v":"Steve S"},"Y","N",1,null,null,null,null,2.0499999999999998,1,2.0499999999999998,11,0,0]
[20,9,"N",{"$f":"YTD!P34","v":"Tom"},"Y","Y",null,null,null,null,null,null,{"$f":"G23+H23","v":0},{"$f":"L23-(I23*0.2)","v":0},30,0,1]
[21,null,"N",{"$f":"YTD!P35","v":"X"},"N",{"$f":"YTD!Q35","v":0},null,null,null,null,null,null,0,0,35,0,0]
[22,null,"N",{"$f":"YTD!P36","v":"X"},"N",{"$f":"YTD!Q36","v":0},null,null,null,null,null,null,0,0,35,0,0]
[23,null,"N",{"$f":"YTD!P37","v":"X"},"N",{"$f":"YTD!Q37","v":0},null,null,null,null,null,null,0,0,35,0,0]
[24,null,"N",{"$f":"YTD!P38","v":"X"},"N",{"$f":"YTD!Q38","v":0},null,null,null,null,null,null,0,0,35,0,0]
[25,null,"N",{"$f":"YTD!P39","v":"X"},"N",{"$f":"YTD!Q39","v":0},null,null,null,null,null,null,{"$f":"G28+H28","v":0},{"$f":"L28-(I28*0.2)","v":0},35,{"$f":"IF(F28=\"Y\",N28,0)","v":0},{"$f":"IF(E28=\"N\",0,(IF(F28=\"N\",0,1)))","v":0}]
[26,null,"N",{"$f":"YTD!P40","v":"X"},"N",{"$f":"YTD!Q40","v":0},null,null,null,null,null,null,{"$f":"G29+H29","v":0},{"$f":"L29-(I29*0.2)","v":0},35,{"$f":"IF(F29=\"Y\",N29,0)","v":0},{"$f":"IF(E29=\"N\",0,(IF(F29=\"N\",0,1)))","v":0}]
[null,null,null,"Totals",{"$f":"COUNTIF(E4:E29,\"Y\")","v":17},null,{"$f":"SUM(G4:G29)","v":21},{"$f":"SUM(H4:H29)","v":17},{"$f":"SUM(I4:I29)","v":0},{"$f":"MAX(J4:J29)","v":4.05},null,{"$f":"SUM(L4:L29)","v":66.39},{"$f":"SUM(M4:M29)","v":38},{"$f":"SUM(N4:N29)","v":66.39},null,{"$f":"SUM(P4:P29)","v":14.93},{"$f":"SUM(Q4:Q29)","v":8}]
[null,"Place","Team #","Partners",null,null,"Total Weight",null,"Place","Team #","Partners",null,null,"Total Weight",null,"NB Avg",{"$f":"IF(Q30=0,\"No Data\",P30/Q30)","v":1.86625}]
[null,"1st",{"$f":"Teams!N4","v":5},{"$f":"VLOOKUP($C32,$B$4:$D$29,3,0)","v":"Armand"},"&",{"$f":"IF($B$4:$B$29=20,\"#N/A\",IF(COUNTIF($B$4:$B$29,$C32)=1,\"Alone\",LOOKUP(2,1/($B$4:$B$29=$C32),$D$4:$D$29)))","v":"Pete"},{"$f":"Teams!O4","v":15.74},null,"4th",{"$f":"Teams!N7","v":4},{"$f":"VLOOKUP($J32,$B$4:$D$29,3,0)","v":"Kevin"},"&",{"$f":"IF($B$4:$B$29=20,\"#N/A\",IF(COUNTIF($B$4:$B$29,$J32)=1,\"Alone\",LOOKUP(2,1/($B$4:$B$29=$J32),$D$4:$D$29)))","v":"Oz"},{"$f":"Teams!O7","v":9.2199999999999989}]
[null,"2nd",{"$f":"Teams!N5","v":8},{"$f":"VLOOKUP($C33,$B$4:$D$29,3,0)","v":"Jack"},"&",{"$f":"IF($B$4:$B$29=20,\"#N/A\",IF(COUNTIF($B$4:$B$29,$C33)=1,\"Alone\",LOOKUP(2,1/($B$4:$B$29=$C33),$D$4:$D$29)))","v":"Ryan"},{"$f":"Teams!O5","v":11.32},null,"5th",{"$f":"Teams!N8","v":3},{"$f":"VLOOKUP($J33,$B$4:$D$29,3,0)","v":"Jason"},"&",{"$f":"IF($B$4:$B$29=20,\"#N/A\",IF(COUNTIF($B$4:$B$29,$J33)=1,\"Alone\",LOOKUP(2,1/($B$4:$B$29=$J33),$D$4:$D$29)))","v":"Mike G"},{"$f":"Teams!O8","v":7.62}]
[null,"3rd",{"$f":"Teams!N6","v":2},{"$f":"VLOOKUP($C34,$B$4:$D$29,3,0)","v":"Dean"},"&",{"$f":"IF($B$4:$B$29=20,\"#N/A\",IF(COUNTIF($B$4:$B$29,$C34)=1,\"Alone\",LOOKUP(2,1/($B$4:$B$29=$C34),$D$4:$D$29)))","v":"Rich T"},{"$f":"Teams!O6","v":10.28},null,"6th",{"$f":"Teams!N9","v":6},{"$f":"VLOOKUP($J34,$B$4:$D$29,3,0)","v":"Jim B"},"&",{"$f":"IF($B$4:$B$29=20,\"#N/A\",IF(COUNTIF($B$4:$B$29,$J34)=1,\"Alone\",LOOKUP(2,1/($B$4:$B$29=$J34),$D$4:$D$29)))","v":"Steve S"},{"$f":"Teams!O9","v":5.75}]

{"sheet":"McDonough","index":1,"n_rows":34,"n_cols":17,"rows_kept":34,"cut":false,"hidden":false,"merged":[[33,6,33,7],[33,13,33,14],[1,0,2,0],[0,0,0,16],[32,6,32,7],[32,13,32,14],[30,6,30,7],[31,6,31,7],[30,13,30,14],[31,13,31,14],[30,3,30,5],[30,10,30,12]]}
[{"$f":"YTD!L16","v":"McDonough"}]
[null,"Team","Fish","Member","Show","Non","Number","Number","Number","Lunker","Species","Gross","Total","Net","Points","Non Boater","# Non-"]
[null,"Number","Alone?","Name","Up?","Boater?","of LMB","of SMB","Dead","Weight","LMB/SMB","Weight","Caught","Weight","Awarded","Weight","Boaters"]
[1,8,"N",{"$f":"YTD!P15","v":"Anthony"},"Y",{"$f":"YTD!Q15","v":"Y"},1,1,null,null,null,2.39,{"$f":"G4+H4","v":2},{"$f":"L4-(I4*0.2)","v":2.39},{"$f":"IF($E4=\"N\",35,IF($M4=0,30,RANK($N4,$N$4:$N$29,0)))","v":15},{"$f":"IF(F4=\"Y\",N4,0)","v":2.39},{"$f":"IF(E4=\"N\",0,(IF(F4=\"N\",0,1)))","v":1}]
[2,7,"N",{"$f":"YTD!P16","v":"Armand"},"Y",{"$f":"YTD!Q16","v":"N"},5,null,null,null,null,9.42,5,9.42,{"$f":"IF($E5=\"N\",35,IF($M5=0,30,RANK($N5,$N$4:$N$29,0)))","v":3},0,{"$f":"IF(E5=\"N\",0,(IF(F5=\"N\",0,1)))","v":0}]
[3,3,"Y",{"$f":"YTD!P17","v":"Dean"},"Y",{"$f":"YTD!Q17","v":"N"},4,1,null,null,null,9.16,{"$f":"G6+H6","v":5},{"$f":"L6-(I6*0.2)","v":9.16},4,{"$f":"IF(F6=\"Y\",N6,0)","v":0},0]
[4,9,"N",{"$f":"YTD!P18","v":"Jack"},"Y",{"$f":"YTD!Q18","v":"N"},3,2,null,null,null,6.33,5,6.33,12,0,0]
[5,5,"N",{"$f":"YTD!P19","v":"Jason"},"Y",{"$f":"YTD!Q19","v":"N"},5,null,null,null,null,9.7100000000000009,{"$f":"G8+H8","v":5},{"$f":"L8-(I8*0.2)","v":9.7100000000000009},2,{"$f":"IF(F8=\"Y\",N8,0)","v":0},0]
[6,6,"N",{"$f":"YTD!P20","v":"Jim B"},"Y",{"$f":"YTD!Q20","v":"Y"},5,null,null,null,null,7.43,5,7.43,10,7.43,1]
[7,null,"N",{"$f":"YTD!P21","v":"Kam"},"N",{"$f":"YTD!Q21","v":"Y"},null,null,null,null,null,null,0,0,35,0,0]
[8,8,"N",{"$f":"YTD!P22","v":"Kevin"},"Y",{"$f":"YTD!Q22","v":"N"},3,2,null,null,null,7.67,{"$f":"G11+H11","v":5},{"$f":"L11-(I11*0.2)","v":7.67},9,{"$f":"IF(F11=\"Y\",N11,0)","v":0},0]
[9,null,"N",{"$f":"YTD!P23","v":"Mike G"},"N",{"$f":"YTD!Q23","v":"Y"},null,null,null,null,null,null,0,0,35,0,0]
[10,null,"N",{"$f":"YTD!P24","v":"Morrie"},"N",{"$f":"YTD!Q24","v":"N"},null,null,null,null,null,null,0,0,35,0,0]
[11,5,"N",{"$f":"YTD!P25","v":"Oz"},"Y",{"$f":"YTD!Q25","v":"Y"},null,1,null,null,null,1.02,1,1.02,16,1.02,1]
[12,9,"N",{"$f":"YTD!P26","v":"Pete"},"Y",{"$f":"YTD!Q26","v":"Y"},3,2,null,null,null,7.98,5,7.98,7,7.98,1]
[13,1,"Y",{"$f":"YTD!P27","v":"Rich B"},"Y",{"$f":"YTD!Q27","v":"N"},2,1,null,null,null,4.76,3,4.76,14,0,0]
[14,null,"N",{"$f":"YTD!P28","v":"Rich M"},"N",{"$f":"YTD!Q28","v":"Y"},null,null,null,null,null,null,0,0,35,0,0]
[15,4,"N",{"$f":"YTD!P29","v":"Rich T"},"Y",{"$f":"YTD!Q29","v":"Y"},4,1,null,null,null,7.98,{"$f":"G18+H18","v":5},{"$f":"L18-(I18*0.2)","v":7.98},7,7.98,1]
[16,2,"N",{"$f":"YTD!P30","v":"Ryan"},"Y",{"$f":"YTD!Q30","v":"Y"},4,1,null,3.97,"LMB",10.46,5,10.46,1,10.46,1]
[17,2,"N",{"$f":"YTD!P31","v":"Scott"},"Y",{"$f":"YTD!Q31","v":"N"},5,null,null,null,null,8.27,{"$f":"G20+H20","v":5},{"$f":"L20-(I20*0.2)","v":8.27},5,{"$f":"IF(F20=\"Y\",N20,0)","v":0},0]
[18,4,"N",{"$f":"YTD!P32","v":"Steve D"},"Y","N",5,null,null,null,null,8.23,5,8.23,6,0,0]
[19,7,"N",{"$f":"YTD!P33","v":"Steve S"},"Y","Y",5,null,null,null,null,6.7,5,6.7,11,6.7,1]
[20,6,"N",{"$f":"YTD!P34","v":"Tom"},"Y",{"$f":"YTD!Q34","v":"N"},4,1,1,null,null,6.26,{"$f":"G23+H23","v":5},{"$f":"L23-(I23*0.2)","v":6.06},13,0,0]
[21,null,"N",{"$f":"YTD!P35","v":"X"},"N",{"$f":"YTD!Q35","v":0},null,null,null,null,null,null,0,0,35,0,0]
[22,null,"N",{"$f":"YTD!P36","v":"X"},"N",{"$f":"YTD!Q36","v":0},null,null,null,null,null,null,0,0,35,0,0]
[23,null,"N",{"$f":"YTD!P37","v":"X"},"N",{"$f":"YTD!Q37","v":0},null,null,null,null,null,null,0,0,35,0,0]
[24,null,"N",{"$f":"YTD!P38","v":"X"},"N",{"$f":"YTD!Q38","v":0},null,null,null,null,null,null,0,0,35,0,0]
[25,null,"N",{"$f":"YTD!P39","v":"X"},"N",{"$f":"YTD!Q39","v":0},null,null,null,null,null,null,{"$f":"G28+H28","v":0},{"$f":"L28-(I28*0.2)","v":0},35,{"$f":"IF(F28=\"Y\",N28,0)","v":0},{"$f":"IF(E28=\"N\",0,(IF(F28=\"N\",0,1)))","v":0}]
[26,null,"N",{"$f":"YTD!P40","v":"X"},"N",{"$f":"YTD!Q40","v":0},null,null,null,null,null,null,{"$f":"G29+H29","v":0},{"$f":"L29-(I29*0.2)","v":0},35,{"$f":"IF(F29=\"Y\",N29,0)","v":0},{"$f":"IF(E29=\"N\",0,(IF(F29=\"N\",0,1)))","v":0}]
[null,null,null,"Totals",{"$f":"COUNTIF(E4:E29,\"Y\")","v":16},null,{"$f":"SUM(G4:G29)","v":58},{"$f":"SUM(H4:H29)","v":13},{"$f":"SUM(I4:I29)","v":1},{"$f":"MAX(J4:J29)","v":3.97},null,{"$f":"SUM(L4:L29)","v":113.77000000000001},{"$f":"SUM(M4:M29)","v":71},{"$f":"SUM(N4:N29)","v":113.57000000000001},null,{"$f":"SUM(P4:P29)","v":43.960000000000008},{"$f":"SUM(Q4:Q29)","v":7}]
[null,"Place","Team #","Partners",null,null,"Total Weight",null,"Place","Team #","Partners",null,null,"Total Weight",null,"NB Avg",{"$f":"IF(Q30=0,\"No Data\",P30/Q30)","v":6.2800000000000011}]
[null,"1st",{"$f":"Teams!N34","v":2},{"$f":"VLOOKUP($C32,$B$4:$D$29,3,0)","v":"Ryan"},"&",{"$f":"IF($B$4:$B$29=20,\"#N/A\",IF(COUNTIF($B$4:$B$29,$C32)=1,\"Alone\",LOOKUP(2,1/($B$4:$B$29=$C32),$D$4:$D$29)))","v":"Scott"},{"$f":"Teams!O34","v":18.73},null,"4th",{"$f":"Teams!N37","v":3},{"$f":"VLOOKUP($J32,$B$4:$D$29,3,0)","v":"Dean"},"&",{"$f":"IF($B$4:$B$29=20,\"#N/A\",IF(COUNTIF($B$4:$B$29,$J32)=1,\"Alone\",LOOKUP(2,1/($B$4:$B$29=$J32),$D$4:$D$29)))","v":"Alone"},{"$f":"Teams!O37","v":15.440000000000001}]
[null,"2nd",{"$f":"Teams!N35","v":4},{"$f":"VLOOKUP($C33,$B$4:$D$29,3,0)","v":"Rich T"},"&",{"$f":"IF($B$4:$B$29=20,\"#N/A\",IF(COUNTIF($B$4:$B$29,$C33)=1,\"Alone\",LOOKUP(2,1/($B$4:$B$29=$C33),$D$4:$D$29)))","v":"Steve D"},{"$f":"Teams!O35","v":16.21},null,"5th",{"$f":"Teams!N38","v":9},{"$f":"VLOOKUP($J33,$B$4:$D$29,3,0)","v":"Jack"},"&",{"$f":"IF($B$4:$B$29=20,\"#N/A\",IF(COUNTIF($B$4:$B$29,$J33)=1,\"Alone\",LOOKUP(2,1/($B$4:$B$29=$J33),$D$4:$D$29)))","v":"Pete"},{"$f":"Teams!O38","v":14.31}]
[null,"3rd",{"$f":"Teams!N36","v":7},{"$f":"VLOOKUP($C34,$B$4:$D$29,3,0)","v":"Armand"},"&",{"$f":"IF($B$4:$B$29=20,\"#N/A\",IF(COUNTIF($B$4:$B$29,$C34)=1,\"Alone\",LOOKUP(2,1/($B$4:$B$29=$C34),$D$4:$D$29)))","v":"Steve S"},{"$f":"Teams!O36","v":16.12},null,"6th",{"$f":"Teams!N39","v":6},{"$f":"VLOOKUP($J34,$B$4:$D$29,3,0)","v":"Jim B"},"&",{"$f":"IF($B$4:$B$29=20,\"#N/A\",IF(COUNTIF($B$4:$B$29,$J34)=1,\"Alone\",LOOKUP(2,1/($B$4:$B$29=$J34),$D$4:$D$29)))","v":"Tom"},{"$f":"Teams!O39","v":13.489999999999998}]

{"sheet":"Quaddick","index":2,"n_rows":34,"n_cols":17,"rows_kept":34,"cut":false,"hidden":false,"merged":[[0,0,0,16],[30,3,30,5],[30,6,30,7],[30,10,30,12],[1,0,2,0],[33,6,33,7],[33,13,33,14],[30,13,30,14],[31,6,31,7],[31,13,31,14],[32,6,32,7],[32,13,32,14]]}
[{"$f":"YTD!L17","v":"Quaddick"}]
[null,"Team","Fish","Member","Show","Non","Number","Number","Number","Lunker","Species","Gross","Total","Net","Points","Non Boater","# Non-"]
[null,"Number","Alone?","Name","Up?","Boater?","of LMB","of SMB","Dead","Weight","LMB/SMB","Weight","Caught","Weight","Awarded","Weight","Boaters"]
[1,3,"N",{"$f":"YTD!P15","v":"Anthony"},"Y","Y",null,null,null,null,null,null,{"$f":"G4+H4","v":0},{"$f":"L4-(I4*0.2)","v":0},{"$f":"IF($E4=\"N\",35,IF($M4=0,30,RANK($N4,$N$4:$N$29,0)))","v":30},{"$f":"IF(F4=\"Y\",N4,0)","v":0},{"$f":"IF(E4=\"N\",0,(IF(F4=\"N\",0,1)))","v":1}]
[2,9,"N",{"$f":"YTD!P16","v":"Armand"},"Y","N",5,null,null,null,null,8.56,5,8.56,{"$f":"IF($E5=\"N\",35,IF($M5=0,30,RANK($N5,$N$4:$N$29,0)))","v":5},0,{"$f":"IF(E5=\"N\",0,(IF(F5=\"N\",0,1)))","v":0}]
[3,5,"N",{"$f":"YTD!P17","v":"Dean"},"Y","N",5,null,1,null,null,8.6300000000000008,{"$f":"G6+H6","v":5},{"$f":"L6-(I6*0.2)","v":8.4300000000000015},6,{"$f":"IF(F6=\"Y\",N6,0)","v":0},0]
[4,6,"N",{"$f":"YTD!P18","v":"Jack"},"Y","N",5,null,null,null,null,6.43,5,6.43,9,0,0]
[5,3,"N",{"$f":"YTD!P19","v":"Jason"},"Y","N",3,null,null,null,null,4.18,{"$f":"G8+H8","v":3},{"$f":"L8-(I8*0.2)","v":4.18},14,{"$f":"IF(F8=\"Y\",N8,0)","v":0},0]
[6,7,"N",{"$f":"YTD!P20","v":"Jim B"},"Y","Y",2,null,null,null,null,4.79,2,4.79,11,4.79,1]
[7,null,"N",{"$f":"YTD!P21","v":"Kam"},"N","Y",null,null,null,null,null,null,0,0,35,0,0]
[8,8,"N",{"$f":"YTD!P22","v":"Kevin"},"Y","Y",5,null,1,null,null,9.27,{"$f":"G11+H11","v":5},{"$f":"L11-(I11*0.2)","v":9.07},4,{"$f":"IF(F11=\"Y\",N11,0)","v":9.07},1]
[9,1,"N",{"$f":"YTD!P23","v":"Mike G"},"Y","Y",3,null,null,null,null,4.75,3,4.75,12,4.75,1]
[10,8,"N",{"$f":"YTD!P24","v":"Morrie"},"Y","N",3,null,null,null,null,3.72,3,3.72,15,0,0]
[11,5,"N",{"$f":"YTD!P25","v":"Oz"},"Y","Y",1,null,null,null,null,1.87,1,1.87,17,1.87,1]
[12,2,"N",{"$f":"YTD!P26","v":"Pete"},"Y","Y",3,null,null,null,null,4.29,3,4.29,13,4.29,1]
[13,null,"N",{"$f":"YTD!P27","v":"Rich B"},"N","N",null,null,null,null,null,null,0,0,35,0,0]
[14,6,"N",{"$f":"YTD!P28","v":"Rich M"},"Y","Y",2,null,null,null,null,3.47,2,3.47,16,3.47,1]
[15,4,"N",{"$f":"YTD!P29","v":"Rich T"},"Y","Y",5,null,null,null,null,8.41,{"$f":"G18+H18","v":5},{"$f":"L18-(I18*0.2)","v":8.41},7,8.41,1]
[16,9,"N",{"$f":"YTD!P30","v":"Ryan"},"Y","Y",2,null,null,null,null,5.79,2,5.79,10,5.79,1]
[17,2,"N",{"$f":"YTD!P31","v":"Scott"},"Y","N",5,null,null,null,null,9.85,{"$f":"G20+H20","v":5},{"$f":"L20-(I20*0.2)","v":9.85},2,{"$f":"IF(F20=\"Y\",N20,0)","v":0},0]
[18,1,"N",{"$f":"YTD!P32","v":"Steve D"},"Y","N",5,null,null,null,null,9.86,5,9.86,1,0,0]
[19,4,"N",{"$f":"YTD!P33","v":"Steve S"},"Y","N",5,null,null,null,null,9.1300000000000008,5,9.1300000000000008,3,0,0]
[20,7,"N",{"$f":"YTD!P34","v":"Tom"},"Y","N",2,null,null,5.36,"lmb",7.21,{"$f":"G23+H23","v":2},{"$f":"L23-(I23*0.2)","v":7.21},8,0,0]
[21,null,"N",{"$f":"YTD!P35","v":"X"},"N","N",null,null,null,null,null,null,0,0,35,0,0]
[22,null,"N",{"$f":"YTD!P36","v":"X"},"N","N",null,null,null,null,null,null,0,0,35,0,0]
[23,null,"N",{"$f":"YTD!P37","v":"X"},"N","N",null,null,null,null,null,null,0,0,35,0,0]
[24,null,"N",{"$f":"YTD!P38","v":"X"},"N","N",null,null,null,null,null,null,0,0,35,0,0]
[25,null,"N",{"$f":"YTD!P39","v":"X"},"N","N",null,null,null,null,null,null,{"$f":"G28+H28","v":0},{"$f":"L28-(I28*0.2)","v":0},35,{"$f":"IF(F28=\"Y\",N28,0)","v":0},{"$f":"IF(E28=\"N\",0,(IF(F28=\"N\",0,1)))","v":0}]
[26,null,"N",{"$f":"YTD!P40","v":"X"},"N","N",null,null,null,null,null,null,{"$f":"G29+H29","v":0},{"$f":"L29-(I29*0.2)","v":0},35,{"$f":"IF(F29=\"Y\",N29,0)","v":0},{"$f":"IF(E29=\"N\",0,(IF(F29=\"N\",0,1)))","v":0}]
[null,null,null,"Totals",{"$f":"COUNTIF(E4:E29,\"Y\")","v":18},null,{"$f":"SUM(G4:G29)","v":61},{"$f":"SUM(H4:H29)","v":0},{"$f":"SUM(I4:I29)","v":2},{"$f":"MAX(J4:J29)","v":5.36},null,{"$f":"SUM(L4:L29)","v":110.20999999999998},{"$f":"SUM(M4:M29)","v":61},{"$f":"SUM(N4:N29)","v":109.80999999999999},null,{"$f":"SUM(P4:P29)","v":42.44},{"$f":"SUM(Q4:Q29)","v":9}]
[null,"Place","Team #","Partners",null,null,"Total Weight",null,"Place","Team #","Partners",null,null,"Total Weight",null,"NB Avg",{"$f":"IF(Q30=0,\"No Data\",P30/Q30)","v":4.7155555555555555}]
[null,"1st",{"$f":"Teams!N64","v":4},{"$f":"VLOOKUP($C32,$B$4:$D$29,3,0)","v":"Rich T"},"&",{"$f":"IF($B$4:$B$29=20,\"#N/A\",IF(COUNTIF($B$4:$B$29,$C32)=1,\"Alone\",LOOKUP(2,1/($B$4:$B$29=$C32),$D$4:$D$29)))","v":"Steve S"},{"$f":"Teams!O64","v":17.54},null,"4th",{"$f":"Teams!N67","v":2},{"$f":"VLOOKUP($J32,$B$4:$D$29,3,0)","v":"Pete"},"&",{"$f":"IF($B$4:$B$29=20,\"#N/A\",IF(COUNTIF($B$4:$B$29,$J32)=1,\"Alone\",LOOKUP(2,1/($B$4:$B$29=$J32),$D$4:$D$29)))","v":"Scott"},{"$f":"Teams!O67","v":14.14}]
[null,"2nd",{"$f":"Teams!N65","v":1},{"$f":"VLOOKUP($C33,$B$4:$D$29,3,0)","v":"Mike G"},"&",{"$f":"IF($B$4:$B$29=20,\"#N/A\",IF(COUNTIF($B$4:$B$29,$C33)=1,\"Alone\",LOOKUP(2,1/($B$4:$B$29=$C33),$D$4:$D$29)))","v":"Steve D"},{"$f":"Teams!O65","v":14.61},null,"5th",{"$f":"Teams!N68","v":8},{"$f":"VLOOKUP($J33,$B$4:$D$29,3,0)","v":"Kevin"},"&",{"$f":"IF($B$4:$B$29=20,\"#N/A\",IF(COUNTIF($B$4:$B$29,$J33)=1,\"Alone\",LOOKUP(2,1/($B$4:$B$29=$J33),$D$4:$D$29)))","v":"Morrie"},{"$f":"Teams!O68","v":12.790000000000001}]
[null,"3rd",{"$f":"Teams!N66","v":9},{"$f":"VLOOKUP($C34,$B$4:$D$29,3,0)","v":"Armand"},"&",{"$f":"IF($B$4:$B$29=20,\"#N/A\",IF(COUNTIF($B$4:$B$29,$C34)=1,\"Alone\",LOOKUP(2,1/($B$4:$B$29=$C34),$D$4:$D$29)))","v":"Ryan"},{"$f":"Teams!O66","v":14.350000000000001},null,"6th",{"$f":"Teams!N69","v":7},{"$f":"VLOOKUP($J34,$B$4:$D$29,3,0)","v":"Jim B"},"&",{"$f":"IF($B$4:$B$29=20,\"#N/A\",IF(COUNTIF($B$4:$B$29,$J34)=1,\"Alone\",LOOKUP(2,1/($B$4:$B$29=$J34),$D$4:$D$29)))","v":"Tom"},{"$f":"Teams!O69","v":12}]

{"sheet":"Candlewood","index":3,"n_rows":34,"n_cols":17,"rows_kept":34,"cut":false,"hidden":false,"merged":[[0,0,0,16],[30,3,30,5],[30,6,30,7],[30,10,30,12],[1,0,2,0],[33,6,33,7],[33,13,33,14],[30,13,30,14],[31,6,31,7],[31,13,31,14],[32,6,32,7],[32,13,32,14]]}
[{"$f":"YTD!L18","v":"Candlewood"}]
[null,"Team","Fish","Member","Show","Non","Number","Number","Number","Lunker","Species","Gross","Total","Net","Points","Non Boater","# Non-"]
[null,"Number","Alone?","Name","Up?","Boater?","of LMB","of SMB","Dead","Weight","LMB/SMB","Weight","Caught","Weight","Awarded","Weight","Boaters"]
[1,5,"N",{"$f":"YTD!P15","v":"Anthony"},"Y",{"$f":"YTD!Q15","v":"Y"},1,null,null,null,null,1.83,{"$f":"G4+H4","v":1},{"$f":"L4-(I4*0.2)","v":1.83},{"$f":"IF($E4=\"N\",35,IF($M4=0,30,RANK($N4,$N$4:$N$29,0)))","v":16},{"$f":"IF(F4=\"Y\",N4,0)","v":1.83},{"$f":"IF(E4=\"N\",0,(IF(F4=\"N\",0,1)))","v":1}]
[2,null,"N",{"$f":"YTD!P16","v":"Armand"},"N",{"$f":"YTD!Q16","v":"N"},null,null,null,null,null,null,0,0,{"$f":"IF($E5=\"N\",35,IF($M5=0,30,RANK($N5,$N$4:$N$29,0)))","v":35},0,{"$f":"IF(E5=\"N\",0,(IF(F5=\"N\",0,1)))","v":0}]
[3,5,"N",{"$f":"YTD!P17","v":"Dean"},"Y",{"$f":"YTD!Q17","v":"N"},5,null,null,3.91,"LMB ",14.7,{"$f":"G6+H6","v":5},{"$f":"L6-(I6*0.2)","v":14.7},1,{"$f":"IF(F6=\"Y\",N6,0)","v":0},0]
[4,1,"N",{"$f":"YTD!P18","v":"Jack"},"Y",{"$f":"YTD!Q18","v":"N"},2,3,null,null,null,9.3699999999999992,5,9.3699999999999992,7,0,0]
[5,6,"N",{"$f":"YTD!P19","v":"Jason"},"Y",{"$f":"YTD!Q19","v":"N"},1,1,null,null,null,3.54,{"$f":"G8+H8","v":2},{"$f":"L8-(I8*0.2)","v":3.54},15,{"$f":"IF(F8=\"Y\",N8,0)","v":0},0]
[6,null,"N",{"$f":"YTD!P20","v":"Jim B"},"N",{"$f":"YTD!Q20","v":"Y"},null,null,null,null,null,null,0,0,35,0,0]
[7,null,"N",{"$f":"YTD!P21","v":"Kam"},"N",{"$f":"YTD!Q21","v":"Y"},null,null,null,null,null,null,0,0,35,0,0]
[8,9,"N",{"$f":"YTD!P22","v":"Kevin"},"Y",{"$f":"YTD!Q22","v":"N"},4,1,null,null,null,9.52,{"$f":"G11+H11","v":5},{"$f":"L11-(I11*0.2)","v":9.52},6,{"$f":"IF(F11=\"Y\",N11,0)","v":0},0]
[9,2,"N",{"$f":"YTD!P23","v":"Mike G"},"Y",{"$f":"YTD!Q23","v":"Y"},3,null,null,null,null,5.4,3,5.4,13,5.4,1]
[10,null,"N",{"$f":"YTD!P24","v":"Morrie"},"N",{"$f":"YTD!Q24","v":"N"},null,null,null,null,null,null,0,0,35,0,0]
[11,8,"N",{"$f":"YTD!P25","v":"Oz"},"Y",{"$f":"YTD!Q25","v":"Y"},2,1,null,3.28,"LMB ",8.09,3,8.09,9,8.09,1]
[12,4,"N",{"$f":"YTD!P26","v":"Pete"},"Y",{"$f":"YTD!Q26","v":"Y"},4,1,null,null,null,9.16,5,9.16,8,9.16,1]
[13,4,"N",{"$f":"YTD!P27","v":"Rich B"},"Y",{"$f":"YTD!Q27","v":"N"},2,1,null,null,null,6.34,3,6.34,12,0,0]
[14,6,"N",{"$f":"YTD!P28","v":"Rich M"},"Y",{"$f":"YTD!Q28","v":"Y"},3,1,null,null,null,6.93,4,6.93,10,6.93,1]
[15,1,"N",{"$f":"YTD!P29","v":"Rich T"},"Y",{"$f":"YTD!Q29","v":"Y"},2,3,null,3.3,"LMB",12.64,{"$f":"G18+H18","v":5},{"$f":"L18-(I18*0.2)","v":12.64},3,12.64,1]
[16,9,"N",{"$f":"YTD!P30","v":"Ryan"},"Y",{"$f":"YTD!Q30","v":"Y"},5,null,1,3.37,"LMB ",10.97,5,10.770000000000001,4,10.770000000000001,1]
[17,3,"Y",{"$f":"YTD!P31","v":"Scott"},"Y",{"$f":"YTD!Q31","v":"N"},4,null,null,null,null,6.72,{"$f":"G20+H20","v":4},{"$f":"L20-(I20*0.2)","v":6.72},11,{"$f":"IF(F20=\"Y\",N20,0)","v":0},0]
[18,8,"N",{"$f":"YTD!P32","v":"Steve D"},"Y",{"$f":"YTD!Q32","v":"N"},3,2,null,null,null,13.27,5,13.27,2,0,0]
[19,2,"N",{"$f":"YTD!P33","v":"Steve S"},"Y",{"$f":"YTD!Q33","v":"N"},3,null,null,null,null,4.57,3,4.57,14,0,0]
[20,7,"Y",{"$f":"YTD!P34","v":"Tom"},"Y",{"$f":"YTD!Q34","v":"N"},3,2,1,null,null,9.75,{"$f":"G23+H23","v":5},{"$f":"L23-(I23*0.2)","v":9.5500000000000007},5,0,0]
[21,null,"N",{"$f":"YTD!P35","v":"X"},"N",null,null,null,null,null,null,null,0,0,35,0,0]
[22,null,"N",{"$f":"YTD!P36","v":"X"},"N",null,null,null,null,null,null,null,0,0,35,0,0]
[23,null,"N",{"$f":"YTD!P37","v":"X"},"N",null,null,null,null,null,null,null,0,0,35,0,0]
[24,null,"N",{"$f":"YTD!P38","v":"X"},"N",null,null,null,null,null,null,null,0,0,35,0,0]
[25,null,"N",{"$f":"YTD!P39","v":"X"},"N",null,null,null,null,null,null,null,{"$f":"G28+H28","v":0},{"$f":"L28-(I28*0.2)","v":0},35,{"$f":"IF(F28=\"Y\",N28,0)","v":0},{"$f":"IF(E28=\"N\",0,(IF(F28=\"N\",0,1)))","v":0}]
[26,null,"N",{"$f":"YTD!P40","v":"X"},"N",null,null,null,null,null,null,null,{"$f":"G29+H29","v":0},{"$f":"L29-(I29*0.2)","v":0},35,{"$f":"IF(F29=\"Y\",N29,0)","v":0},{"$f":"IF(E29=\"N\",0,(IF(F29=\"N\",0,1)))","v":0}]
[null,null,null,"Totals",{"$f":"COUNTIF(E4:E29,\"Y\")","v":16},null,{"$f":"SUM(G4:G29)","v":47},{"$f":"SUM(H4:H29)","v":16},{"$f":"SUM(I4:I29)","v":2},{"$f":"MAX(J4:J29)","v":3.91},null,{"$f":"SUM(L4:L29)","v":132.79999999999998},{"$f":"SUM(M4:M29)","v":63},{"$f":"SUM(N4:N29)","v":132.4},null,{"$f":"SUM(P4:P29)","v":54.82},{"$f":"SUM(Q4:Q29)","v":7}]
[null,"Place","Team #","Partners",null,null,"Total Weight",null,"Place","Team #","Partners",null,null,"Total Weight",null,"NB Avg",{"$f":"IF(Q30=0,\"No Data\",P30/Q30)","v":7.8314285714285718}]
[null,"1st",{"$f":"Teams!$N94","v":1},{"$f":"VLOOKUP($C32,$B$4:$D$29,3,0)","v":"Jack"},"&",{"$f":"IF($B$4:$B$29=20,\"#N/A\",IF(COUNTIF($B$4:$B$29,$C32)=1,\"Alone\",LOOKUP(2,1/($B$4:$B$29=$C32),$D$4:$D$29)))","v":"Rich T"},{"$f":"Teams!O94","v":22.009999999999998},null,"4th",{"$f":"Teams!$N97","v":7},{"$f":"VLOOKUP($J32,$B$4:$D$29,3,0)","v":"Tom"},"&",{"$f":"IF($B$4:$B$29=20,\"#N/A\",IF(COUNTIF($B$4:$B$29,$J32)=1,\"Alone\",LOOKUP(2,1/($B$4:$B$29=$J32),$D$4:$D$29)))","v":"Alone"},{"$f":"Teams!O97","v":17.381428571428572}]
[null,"2nd",{"$f":"Teams!$N95","v":8},{"$f":"VLOOKUP($C33,$B$4:$D$29,3,0)","v":"Oz"},"&",{"$f":"IF($B$4:$B$29=20,\"#N/A\",IF(COUNTIF($B$4:$B$29,$C33)=1,\"Alone\",LOOKUP(2,1/($B$4:$B$29=$C33),$D$4:$D$29)))","v":"Steve D"},{"$f":"Teams!O95","v":21.36},null,"5th",{"$f":"Teams!$N98","v":5},{"$f":"VLOOKUP($J33,$B$4:$D$29,3,0)","v":"Anthony"},"&",{"$f":"IF($B$4:$B$29=20,\"#N/A\",IF(COUNTIF($B$4:$B$29,$J33)=1,\"Alone\",LOOKUP(2,1/($B$4:$B$29=$J33),$D$4:$D$29)))","v":"Dean"},{"$f":"Teams!O98","v":16.53}]
[null,"3rd",{"$f":"Teams!$N96","v":9},{"$f":"VLOOKUP($C34,$B$4:$D$29,3,0)","v":"Kevin"},"&",{"$f":"IF($B$4:$B$29=20,\"#N/A\",IF(COUNTIF($B$4:$B$29,$C34)=1,\"Alone\",LOOKUP(2,1/($B$4:$B$29=$C34),$D$4:$D$29)))","v":"Ryan"},{"$f":"Teams!O96","v":20.29},null,"6th",{"$f":"Teams!$N99","v":4},{"$f":"VLOOKUP($J34,$B$4:$D$29,3,0)","v":"Pete"},"&",{"$f":"IF($B$4:$B$29=20,\"#N/A\",IF(COUNTIF($B$4:$B$29,$J34)=1,\"Alone\",LOOKUP(2,1/($B$4:$B$29=$J34),$D$4:$D$29)))","v":"Rich B"},{"$f":"Teams!O99","v":15.5}]

{"sheet":"Lillinonah","index":4,"n_rows":34,"n_cols":17,"rows_kept":34,"cut":false,"hidden":false,"merged":[[0,0,0,16],[30,3,30,5],[30,6,30,7],[30,10,30,12],[1,0,2,0],[33,6,33,7],[33,13,33,14],[30,13,30,14],[31,6,31,7],[31,13,31,14],[32,6,32,7],[32,13,32,14]]}
[{"$f":"YTD!L19","v":"Lillinonah"}]
[null,"Team","Fish","Member","Show","Non","Number","Number","Number","Lunker","Species","Gross","Total","Net","Points","Non Boater","# Non-"]
[null,"Number","Alone?","Name","Up?","Boater?","of LMB","of SMB","Dead","Weight","LMB/SMB","Weight","Caught","Weight","Awarded","Weight","Boaters"]
[1,null,"N",{"$f":"YTD!P15","v":"Anthony"},"N",{"$f":"YTD!Q15","v":"Y"},null,null,null,null,null,null,{"$f":"G4+H4","v":0},{"$f":"L4-(I4*0.2)","v":0},{"$f":"IF($E4=\"N\",35,IF($M4=0,30,RANK($N4,$N$4:$N$29,0)))","v":35},{"$f":"IF(F4=\"Y\",N4,0)","v":0},{"$f":"IF(E4=\"N\",0,(IF(F4=\"N\",0,1)))","v":0}]
[2,1,"N",{"$f":"YTD!P16","v":"Armand"},"Y","Y",3,2,2,null,null,6.9,5,6.5,{"$f":"IF($E5=\"N\",35,IF($M5=0,30,RANK($N5,$N$4:$N$29,0)))","v":6},6.5,{"$f":"IF(E5=\"N\",0,(IF(F5=\"N\",0,1)))","v":1}]
[3,7,"N",{"$f":"YTD!P17","v":"Dean"},"Y",{"$f":"YTD!Q17","v":"N"},2,1,1,3.94,"LMB",6.11,{"$f":"G6+H6","v":3},{"$f":"L6-(I6*0.2)","v":5.91},7,{"$f":"IF(F6=\"Y\",N6,0)","v":0},0]
[4,6,"N",{"$f":"YTD!P18","v":"Jack"},"Y",{"$f":"YTD!Q18","v":"N"},2,2,null,null,null,4.41,4,4.41,11,0,0]
[5,null,"N",{"$f":"YTD!P19","v":"Jason"},"N",{"$f":"YTD!Q19","v":"N"},null,null,null,null,null,null,{"$f":"G8+H8","v":0},{"$f":"L8-(I8*0.2)","v":0},35,{"$f":"IF(F8=\"Y\",N8,0)","v":0},0]
[6,null,"N",{"$f":"YTD!P20","v":"Jim B"},"N",{"$f":"YTD!Q20","v":"Y"},null,null,null,null,null,null,0,0,35,0,0]
[7,null,"N",{"$f":"YTD!P21","v":"Kam"},"n",{"$f":"YTD!Q21","v":"Y"},null,null,null,null,null,null,0,0,35,0,0]
[8,8,"N",{"$f":"YTD!P22","v":"Kevin"},"Y",{"$f":"YTD!Q22","v":"N"},1,4,null,3.22,"smb",11.41,{"$f":"G11+H11","v":5},{"$f":"L11-(I11*0.2)","v":11.41},1,{"$f":"IF(F11=\"Y\",N11,0)","v":0},0]
[9,3,"N",{"$f":"YTD!P23","v":"Mike G"},"Y",{"$f":"YTD!Q23","v":"Y"},null,2,null,null,null,2.94,2,2.94,14,2.94,1]
[10,3,"N",{"$f":"YTD!P24","v":"Morrie"},"Y",{"$f":"YTD!Q24","v":"N"},null,3,null,null,null,4.47,3,4.47,10,0,0]
[11,null,"N",{"$f":"YTD!P25","v":"Oz"},"N",{"$f":"YTD!Q25","v":"Y"},null,null,null,null,null,null,0,0,35,0,0]
[12,8,"N",{"$f":"YTD!P26","v":"Pete"},"Y",{"$f":"YTD!Q26","v":"Y"},null,5,null,null,null,7.96,5,7.96,5,7.96,1]
[13,1,"N",{"$f":"YTD!P27","v":"Rich B"},"Y",{"$f":"YTD!Q27","v":"N"},3,2,null,3.09,"lmb",8.82,5,8.82,2,0,0]
[14,7,"N",{"$f":"YTD!P28","v":"Rich M"},"Y",{"$f":"YTD!Q28","v":"Y"},1,2,null,null,null,4.92,3,4.92,9,4.92,1]
[15,4,"N",{"$f":"YTD!P29","v":"Rich T"},"Y",{"$f":"YTD!Q29","v":"Y"},null,1,null,null,null,0.95,{"$f":"G18+H18","v":1},{"$f":"L18-(I18*0.2)","v":0.95},15,0.95,1]
[16,6,"N",{"$f":"YTD!P30","v":"Ryan"},"Y",{"$f":"YTD!Q30","v":"Y"},null,3,null,null,null,3.22,3,3.22,13,3.22,1]
[17,9,"y",{"$f":"YTD!P31","v":"Scott"},"Y",{"$f":"YTD!Q31","v":"N"},5,null,null,null,null,8.52,{"$f":"G20+H20","v":5},{"$f":"L20-(I20*0.2)","v":8.52},3,{"$f":"IF(F20=\"Y\",N20,0)","v":0},0]
[18,2,"N",{"$f":"YTD!P32","v":"Steve D"},"Y",{"$f":"YTD!Q32","v":"N"},1,4,null,null,null,5.69,5,5.69,8,0,0]
[19,2,"N",{"$f":"YTD!P33","v":"Steve S"},"Y","Y",4,1,null,2.85,"LMB ",8.18,5,8.18,4,8.18,1]
[20,4,"N",{"$f":"YTD!P34","v":"Tom"},"Y",{"$f":"YTD!Q34","v":"N"},4,null,null,null,null,3.65,{"$f":"G23+H23","v":4},{"$f":"L23-(I23*0.2)","v":3.65},12,0,0]
[21,null,"N",{"$f":"YTD!P35","v":"X"},"N",{"$f":"YTD!Q35","v":0},null,null,null,null,null,null,0,0,35,0,0]
[22,null,"N",{"$f":"YTD!P36","v":"X"},"N",{"$f":"YTD!Q36","v":0},null,null,null,null,null,null,0,0,35,0,0]
[23,null,"N",{"$f":"YTD!P37","v":"X"},"N",{"$f":"YTD!Q37","v":0},null,null,null,null,null,null,0,0,35,0,0]
[24,null,"N",{"$f":"YTD!P38","v":"X"},"N",{"$f":"YTD!Q38","v":0},null,null,null,null,null,null,0,0,35,0,0]
[25,null,"N",{"$f":"YTD!P39","v":"X"},"N",{"$f":"YTD!Q39","v":0},null,null,null,null,null,null,{"$f":"G28+H28","v":0},{"$f":"L28-(I28*0.2)","v":0},35,{"$f":"IF(F28=\"Y\",N28,0)","v":0},{"$f":"IF(E28=\"N\",0,(IF(F28=\"N\",0,1)))","v":0}]
[26,null,"N",{"$f":"YTD!P40","v":"X"},"N",{"$f":"YTD!Q40","v":0},null,null,null,null,null,null,{"$f":"G29+H29","v":0},{"$f":"L29-(I29*0.2)","v":0},35,{"$f":"IF(F29=\"Y\",N29,0)","v":0},{"$f":"IF(E29=\"N\",0,(IF(F29=\"N\",0,1)))","v":0}]
[null,null,null,"Totals",{"$f":"COUNTIF(E4:E29,\"Y\")","v":15},null,{"$f":"SUM(G4:G29)","v":26},{"$f":"SUM(H4:H29)","v":32},{"$f":"SUM(I4:I29)","v":3},{"$f":"MAX(J4:J29)","v":3.94},null,{"$f":"SUM(L4:L29)","v":88.15},{"$f":"SUM(M4:M29)","v":58},{"$f":"SUM(N4:N29)","v":87.550000000000011},null,{"$f":"SUM(P4:P29)","v":34.67},{"$f":"SUM(Q4:Q29)","v":7}]
[null,"Place","Team #","Partners",null,null,"Total Weight",null,"Place","Team #","Partners",null,null,"Total Weight",null,"NB Avg",{"$f":"IF(Q30=0,\"No Data\",P30/Q30)","v":4.9528571428571428}]
[null,"1st",{"$f":"Teams!$AD4","v":8},{"$f":"VLOOKUP($C32,$B$4:$D$29,3,0)","v":"Kevin"},"&",{"$f":"IF($B$4:$B$29=20,\"#N/A\",IF(COUNTIF($B$4:$B$29,$C32)=1,\"Alone\",LOOKUP(2,1/($B$4:$B$29=$C32),$D$4:$D$29)))","v":"Pete"},{"$f":"Teams!AE4","v":19.37},null,"4th",{"$f":"Teams!$AD7","v":9},{"$f":"VLOOKUP($J32,$B$4:$D$29,3,0)","v":"Scott"},"&",{"$f":"IF($B$4:$B$29=20,\"#N/A\",IF(COUNTIF($B$4:$B$29,$J32)=1,\"Alone\",LOOKUP(2,1/($B$4:$B$29=$J32),$D$4:$D$29)))","v":"Alone"},{"$f":"Teams!AE7","v":13.472857142857142}]
[null,"2nd",{"$f":"Teams!$AD5","v":1},{"$f":"VLOOKUP($C33,$B$4:$D$29,3,0)","v":"Armand"},"&",{"$f":"IF($B$4:$B$29=20,\"#N/A\",IF(COUNTIF($B$4:$B$29,$C33)=1,\"Alone\",LOOKUP(2,1/($B$4:$B$29=$C33),$D$4:$D$29)))","v":"Rich B"},{"$f":"Teams!AE5","v":15.32},null,"5th",{"$f":"Teams!$AD8","v":7},{"$f":"VLOOKUP($J33,$B$4:$D$29,3,0)","v":"Dean"},"&",{"$f":"IF($B$4:$B$29=20,\"#N/A\",IF(COUNTIF($B$4:$B$29,$J33)=1,\"Alone\",LOOKUP(2,1/($B$4:$B$29=$J33),$D$4:$D$29)))","v":"Rich M"},{"$f":"Teams!AE8","v":10.83}]
[null,"3rd",{"$f":"Teams!$AD6","v":2},{"$f":"VLOOKUP($C34,$B$4:$D$29,3,0)","v":"Steve D"},"&",{"$f":"IF($B$4:$B$29=20,\"#N/A\",IF(COUNTIF($B$4:$B$29,$C34)=1,\"Alone\",LOOKUP(2,1/($B$4:$B$29=$C34),$D$4:$D$29)))","v":"Steve S"},{"$f":"Teams!AE6","v":13.870000000000001},null,"6th",{"$f":"Teams!$AD9","v":6},{"$f":"VLOOKUP($J34,$B$4:$D$29,3,0)","v":"Jack"},"&",{"$f":"IF($B$4:$B$29=20,\"#N/A\",IF(COUNTIF($B$4:$B$29,$J34)=1,\"Alone\",LOOKUP(2,1/($B$4:$B$29=$J34),$D$4:$D$29)))","v":"Ryan"},{"$f":"Teams!AE9","v":7.6300000000000008}]

{"sheet":"CT River","index":5,"n_rows":34,"n_cols":17,"rows_kept":34,"cut":false,"hidden":false,"merged":[[0,0,0,16],[30,3,30,5],[30,6,30,7],[30,10,30,12],[1,0,2,0],[33,6,33,7],[33,13,33,14],[30,13,30,14],[31,6,31,7],[31,13,31,14],[32,6,32,7],[32,13,32,14]]}
[{"$f":"YTD!L20","v":"CT River"}]
[null,"Team","Fish","Member","Show","Non","Number","Number","Number","Lunker","Species","Gross","Total","Net","Points","Non Boater","# Non-"]
[null,"Number","Alone?","Name","Up?","Boater?","of LMB","of SMB","Dead","Weight","LMB/SMB","Weight","Caught","Weight","Awarded","Weight","Boaters"]
[null,null,"N",{"$f":"YTD!P15","v":"Anthony"},"N",{"$f":"YTD!Q15","v":"Y"},null,null,null,null,null,null,{"$f":"G4+H4","v":0},{"$f":"L4-(I4*0.2)","v":0},{"$f":"IF($E4=\"N\",35,IF($M4=0,30,RANK($N4,$N$4:$N$29,0)))","v":35},{"$f":"IF(F4=\"Y\",N4,0)","v":0},{"$f":"IF(E4=\"N\",0,(IF(F4=\"N\",0,1)))","v":0}]
[null,8,"N",{"$f":"YTD!P16","v":"Armand"},"Y",{"$f":"YTD!Q16","v":"N"},null,1,null,null,null,1.1000000000000001,1,1.1000000000000001,{"$f":"IF($E5=\"N\",35,IF($M5=0,30,RANK($N5,$N$4:$N$29,0)))","v":13},0,{"$f":"IF(E5=\"N\",0,(IF(F5=\"N\",0,1)))","v":0}]
[null,3,"N",{"$f":"YTD!P17","v":"Dean"},"Y",{"$f":"YTD!Q17","v":"N"},3,null,null,2.3199999999999998,"LMB",5.05,{"$f":"G6+H6","v":3},{"$f":"L6-(I6*0.2)","v":5.05},4,{"$f":"IF(F6=\"Y\",N6,0)","v":0},0]
[null,7,"N",{"$f":"YTD!P18","v":"Jack"},"Y","Y",2,2,null,3.58,"LMB",8,4,8,1,8,1]
[null,null,"N",{"$f":"YTD!P19","v":"Jason"},"N",{"$f":"YTD!Q19","v":"N"},null,null,null,null,null,null,{"$f":"G8+H8","v":0},{"$f":"L8-(I8*0.2)","v":0},35,{"$f":"IF(F8=\"Y\",N8,0)","v":0},0]
[null,null,"N",{"$f":"YTD!P20","v":"Jim B"},"N",{"$f":"YTD!Q20","v":"Y"},null,null,null,null,null,null,0,0,35,0,0]
[null,2,"N",{"$f":"YTD!P21","v":"Kam"},"y",{"$f":"YTD!Q21","v":"Y"},1,3,null,null,null,4.91,4,4.91,5,4.91,1]
[null,7,"N",{"$f":"YTD!P22","v":"Kevin"},"Y",{"$f":"YTD!Q22","v":"N"},null,1,null,null,null,1.88,{"$f":"G11+H11","v":1},{"$f":"L11-(I11*0.2)","v":1.88},12,{"$f":"IF(F11=\"Y\",N11,0)","v":0},0]
[null,6,"N",{"$f":"YTD!P23","v":"Mike G"},"Y",{"$f":"YTD!Q23","v":"Y"},null,1,null,null,null,0.86,1,0.86,14,0.86,1]
[null,5,"N",{"$f":"YTD!P24","v":"Morrie"},"Y",{"$f":"YTD!Q24","v":"N"},1,3,null,null,null,4.57,4,4.57,6,0,0]
[null,5,"N",{"$f":"YTD!P25","v":"Oz"},"Y",{"$f":"YTD!Q25","v":"Y"},null,null,null,null,null,null,0,0,30,0,1]
[null,1,"N",{"$f":"YTD!P26","v":"Pete"},"Y",{"$f":"YTD!Q26","v":"Y"},null,3,null,null,null,3.32,3,3.32,10,3.32,1]
[null,2,"N",{"$f":"YTD!P27","v":"Rich B"},"Y",{"$f":"YTD!Q27","v":"N"},null,null,null,null,null,null,0,0,30,0,0]
[null,4,"N",{"$f":"YTD!P28","v":"Rich M"},"Y",{"$f":"YTD!Q28","v":"Y"},null,3,1,null,null,3.92,3,3.7199999999999998,9,3.7199999999999998,1]
[null,8,"N",{"$f":"YTD!P29","v":"Rich T"},"Y",{"$f":"YTD!Q29","v":"Y"},1,1,null,null,null,3.72,{"$f":"G18+H18","v":2},{"$f":"L18-(I18*0.2)","v":3.72},8,3.72,1]
[null,3,"N",{"$f":"YTD!P30","v":"Ryan"},"Y",{"$f":"YTD!Q30","v":"Y"},4,null,null,2.2999999999999998,"LMB",7.26,4,7.26,3,7.26,1]
[null,6,"N",{"$f":"YTD!P31","v":"Scott"},"Y",{"$f":"YTD!Q31","v":"N"},2,null,null,null,null,2.4700000000000002,{"$f":"G20+H20","v":2},{"$f":"L20-(I20*0.2)","v":2.4700000000000002},11,{"$f":"IF(F20=\"Y\",N20,0)","v":0},0]
[null,4,"N",{"$f":"YTD!P32","v":"Steve D"},"Y",{"$f":"YTD!Q32","v":"N"},1,4,3,2.0499999999999998,"LMB",7.94,5,7.34,2,0,0]
[null,1,"N",{"$f":"YTD!P33","v":"Steve S"},"Y",{"$f":"YTD!Q33","v":"N"},2,1,null,null,null,4.1500000000000004,3,4.1500000000000004,7,0,0]
[null,null,"N",{"$f":"YTD!P34","v":"Tom"},"N",{"$f":"YTD!Q34","v":"N"},null,null,null,null,null,null,{"$f":"G23+H23","v":0},{"$f":"L23-(I23*0.2)","v":0},35,0,0]
[null,null,"N",{"$f":"YTD!P35","v":"X"},"N","N",null,null,null,null,null,null,0,0,35,0,0]
[null,null,"N",{"$f":"YTD!P36","v":"X"},"N","N",null,null,null,null,null,null,0,0,35,0,0]
[null,null,"N",{"$f":"YTD!P37","v":"X"},"N","N",null,null,null,null,null,null,0,0,35,0,0]
[null,null,"N",{"$f":"YTD!P38","v":"X"},"N","N",null,null,null,null,null,null,0,0,35,0,0]
[null,null,"N",{"$f":"YTD!P39","v":"X"},"N","N",null,null,null,null,null,null,{"$f":"G28+H28","v":0},{"$f":"L28-(I28*0.2)","v":0},35,{"$f":"IF(F28=\"Y\",N28,0)","v":0},{"$f":"IF(E28=\"N\",0,(IF(F28=\"N\",0,1)))","v":0}]
[null,null,"N",{"$f":"YTD!P40","v":"X"},"N","N",null,null,null,null,null,null,{"$f":"G29+H29","v":0},{"$f":"L29-(I29*0.2)","v":0},35,{"$f":"IF(F29=\"Y\",N29,0)","v":0},{"$f":"IF(E29=\"N\",0,(IF(F29=\"N\",0,1)))","v":0}]
[null,null,null,"Totals",{"$f":"COUNTIF(E4:E29,\"Y\")","v":16},null,{"$f":"SUM(G4:G29)","v":17},{"$f":"SUM(H4:H29)","v":23},{"$f":"SUM(I4:I29)","v":4},{"$f":"MAX(J4:J29)","v":3.58},null,{"$f":"SUM(L4:L29)","v":59.149999999999991},{"$f":"SUM(M4:M29)","v":40},{"$f":"SUM(N4:N29)","v":58.35},null,{"$f":"SUM(P4:P29)","v":31.79},{"$f":"SUM(Q4:Q29)","v":8}]
[null,"Place","Team #","Partners",null,null,"Total Weight",null,"Place","Team #","Partners",null,null,"Total Weight",null,"NB Avg",{"$f":"IF(Q30=0,\"No Data\",P30/Q30)","v":3.9737499999999999}]
[null,"1st",{"$f":"Teams!$AD34","v":3},{"$f":"VLOOKUP($C32,$B$4:$D$29,3,0)","v":"Dean"},"&",{"$f":"IF($B$4:$B$29=20,\"#N/A\",IF(COUNTIF($B$4:$B$29,$C32)=1,\"Alone\",LOOKUP(2,1/($B$4:$B$29=$C32),$D$4:$D$29)))","v":"Ryan"},{"$f":"Teams!AE34","v":12.309999999999999},null,"4th",{"$f":"Teams!$AD37","v":1},{"$f":"VLOOKUP($J32,$B$4:$D$29,3,0)","v":"Pete"},"&",{"$f":"IF($B$4:$B$29=20,\"#N/A\",IF(COUNTIF($B$4:$B$29,$J32)=1,\"Alone\",LOOKUP(2,1/($B$4:$B$29=$J32),$D$4:$D$29)))","v":"Steve S"},{"$f":"Teams!AE37","v":7.4700000000000006}]
[null,"2nd",{"$f":"Teams!$AD35","v":4},{"$f":"VLOOKUP($C33,$B$4:$D$29,3,0)","v":"Rich M"},"&",{"$f":"IF($B$4:$B$29=20,\"#N/A\",IF(COUNTIF($B$4:$B$29,$C33)=1,\"Alone\",LOOKUP(2,1/($B$4:$B$29=$C33),$D$4:$D$29)))","v":"Steve D"},{"$f":"Teams!AE35","v":11.059999999999999},null,"5th",{"$f":"Teams!$AD38","v":2},{"$f":"VLOOKUP($J33,$B$4:$D$29,3,0)","v":"Kam"},"&",{"$f":"IF($B$4:$B$29=20,\"#N/A\",IF(COUNTIF($B$4:$B$29,$J33)=1,\"Alone\",LOOKUP(2,1/($B$4:$B$29=$J33),$D$4:$D$29)))","v":"Rich B"},{"$f":"Teams!AE38","v":4.91}]
[null,"3rd",{"$f":"Teams!$AD36","v":7},{"$f":"VLOOKUP($C34,$B$4:$D$29,3,0)","v":"Jack"},"&",{"$f":"IF($B$4:$B$29=20,\"#N/A\",IF(COUNTIF($B$4:$B$29,$C34)=1,\"Alone\",LOOKUP(2,1/($B$4:$B$29=$C34),$D$4:$D$29)))","v":"Kevin"},{"$f":"Teams!AE36","v":9.879999999999999},null,"6th",{"$f":"Teams!$AD39","v":5},{"$f":"VLOOKUP($J34,$B$4:$D$29,3,0)","v":"Morrie"},"&",{"$f":"IF($B$4:$B$29=20,\"#N/A\",IF(COUNTIF($B$4:$B$29,$J34)=1,\"Alone\",LOOKUP(2,1/($B$4:$B$29=$J34),$D$4:$D$29)))","v":"Oz"},{"$f":"Teams!AE39","v":4.57}]

{"sheet":"West Hill","index":6,"n_rows":34,"n_cols":17,"rows_kept":34,"cut":false,"hidden":false,"merged":[[0,0,0,16],[30,3,30,5],[30,6,30,7],[30,10,30,12],[1,0,2,0],[33,6,33,7],[33,13,33,14],[30,13,30,14],[31,6,31,7],[31,13,31,14],[32,6,32,7],[32,13,32,14]]}
[{"$f":"YTD!L21","v":"West Hill"}]
[null,"Team","Fish","Member","Show","Non","Number","Number","Number","Lunker","Species","Gross","Total","Net","Points","Non Boater","# Non-"]
[null,"Number","Alone?","Name","Up?","Boater?","of LMB","of SMB","Dead","Weight","LMB/SMB","Weight","Caught","Weight","Awarded","Weight","Boaters"]
[1,null,"N",{"$f":"YTD!P15","v":"Anthony"},"n",{"$f":"YTD!Q15","v":"Y"},null,null,null,null,null,null,{"$f":"G4+H4","v":0},{"$f":"L4-(I4*0.2)","v":0},{"$f":"IF($E4=\"N\",35,IF($M4=0,30,RANK($N4,$N$4:$N$29,0)))","v":35},{"$f":"IF(F4=\"Y\",N4,0)","v":0},{"$f":"IF(E4=\"N\",0,(IF(F4=\"N\",0,1)))","v":0}]
[2,7,"N",{"$f":"YTD!P16","v":"Armand"},"Y",{"$f":"YTD!Q16","v":"N"},1,null,null,3.21,"LMB",3.21,1,3.21,{"$f":"IF($E5=\"N\",35,IF($M5=0,30,RANK($N5,$N$4:$N$29,0)))","v":3},0,{"$f":"IF(E5=\"N\",0,(IF(F5=\"N\",0,1)))","v":0}]
[3,1,"N",{"$f":"YTD!P17","v":"Dean"},"Y",{"$f":"YTD!Q17","v":"N"},2,null,null,null,null,3.21,{"$f":"G6+H6","v":2},{"$f":"L6-(I6*0.2)","v":3.21},3,{"$f":"IF(F6=\"Y\",N6,0)","v":0},0]
[4,2,"N",{"$f":"YTD!P18","v":"Jack"},"Y",{"$f":"YTD!Q18","v":"N"},5,null,null,null,null,4.7699999999999996,5,4.7699999999999996,1,0,0]
[5,null,"N",{"$f":"YTD!P19","v":"Jason"},"n",{"$f":"YTD!Q19","v":"N"},null,null,null,null,null,null,{"$f":"G8+H8","v":0},{"$f":"L8-(I8*0.2)","v":0},35,{"$f":"IF(F8=\"Y\",N8,0)","v":0},0]
[6,3,"N",{"$f":"YTD!P20","v":"Jim B"},"Y",{"$f":"YTD!Q20","v":"Y"},null,null,null,null,null,null,0,0,30,0,1]
[7,9,"N",{"$f":"YTD!P21","v":"Kam"},"Y",{"$f":"YTD!Q21","v":"Y"},1,null,null,null,null,1.3,1,1.3,9,1.3,1]
[8,9,"N",{"$f":"YTD!P22","v":"Kevin"},"Y",{"$f":"YTD!Q22","v":"N"},1,null,null,null,null,1.92,{"$f":"G11+H11","v":1},{"$f":"L11-(I11*0.2)","v":1.92},6,{"$f":"IF(F11=\"Y\",N11,0)","v":0},0]
[9,7,"N",{"$f":"YTD!P23","v":"Mike G"},"Y",{"$f":"YTD!Q23","v":"Y"},1,null,null,null,null,1.17,1,1.17,10,1.17,1]
[10,8,"N",{"$f":"YTD!P24","v":"Morrie"},"Y",{"$f":"YTD!Q24","v":"N"},1,null,null,null,null,0.75,1,0.75,14,0,0]
[11,8,"N",{"$f":"YTD!P25","v":"Oz"},"Y",{"$f":"YTD!Q25","v":"Y"},1,null,null,null,null,0.81,1,0.81,12,0.81,1]
[12,1,"N",{"$f":"YTD!P26","v":"Pete"},"Y",{"$f":"YTD!Q26","v":"Y"},1,null,null,null,null,0.87,1,0.87,11,0.87,1]
[13,3,"N",{"$f":"YTD!P27","v":"Rich B"},"Y",{"$f":"YTD!Q27","v":"N"},2,null,null,null,null,2.02,2,2.02,5,0,0]
[14,5,"N",{"$f":"YTD!P28","v":"Rich M"},"Y",{"$f":"YTD!Q28","v":"Y"},null,null,null,null,null,null,0,0,30,0,1]
[15,2,"N",{"$f":"YTD!P29","v":"Rich T"},"Y",{"$f":"YTD!Q29","v":"Y"},4,null,null,null,null,4.17,{"$f":"G18+H18","v":4},{"$f":"L18-(I18*0.2)","v":4.17},2,4.17,1]
[16,4,"N",{"$f":"YTD!P30","v":"Ryan"},"Y",{"$f":"YTD!Q30","v":"Y"},2,null,null,null,null,1.54,2,1.54,8,1.54,1]
[17,6,"y",{"$f":"YTD!P31","v":"Scott"},"Y",{"$f":"YTD!Q31","v":"N"},1,null,null,null,null,0.78,{"$f":"G20+H20","v":1},{"$f":"L20-(I20*0.2)","v":0.78},13,{"$f":"IF(F20=\"Y\",N20,0)","v":0},0]
[18,4,"N",{"$f":"YTD!P32","v":"Steve D"},"Y",{"$f":"YTD!Q32","v":"N"},2,null,null,null,null,1.6,2,1.6,7,0,0]
[19,5,"N",{"$f":"YTD!P33","v":"Steve S"},"Y",{"$f":"YTD!Q33","v":"N"},1,null,null,null,null,0.74,1,0.74,15,0,0]
[20,null,"N",{"$f":"YTD!P34","v":"Tom"},"n",{"$f":"YTD!Q34","v":"N"},null,null,null,null,null,null,{"$f":"G23+H23","v":0},{"$f":"L23-(I23*0.2)","v":0},35,0,0]
[21,null,"N",{"$f":"YTD!P35","v":"X"},"N",{"$f":"YTD!Q35","v":0},null,null,null,null,null,null,0,0,35,0,0]
[22,null,"N",{"$f":"YTD!P36","v":"X"},"N",{"$f":"YTD!Q36","v":0},null,null,null,null,null,null,0,0,35,0,0]
[23,null,"N",{"$f":"YTD!P37","v":"X"},"N",{"$f":"YTD!Q37","v":0},null,null,null,null,null,null,0,0,35,0,0]
[24,null,"N",{"$f":"YTD!P38","v":"X"},"N",{"$f":"YTD!Q38","v":0},null,null,null,null,null,null,0,0,35,0,0]
[25,null,"N",{"$f":"YTD!P39","v":"X"},"N",{"$f":"YTD!Q39","v":0},null,null,null,null,null,null,{"$f":"G28+H28","v":0},{"$f":"L28-(I28*0.2)","v":0},35,{"$f":"IF(F28=\"Y\",N28,0)","v":0},{"$f":"IF(E28=\"N\",0,(IF(F28=\"N\",0,1)))","v":0}]
[26,null,"N",{"$f":"YTD!P40","v":"X"},"N",{"$f":"YTD!Q40","v":0},null,null,null,null,null,null,{"$f":"G29+H29","v":0},{"$f":"L29-(I29*0.2)","v":0},35,{"$f":"IF(F29=\"Y\",N29,0)","v":0},{"$f":"IF(E29=\"N\",0,(IF(F29=\"N\",0,1)))","v":0}]
[null,null,null,"Totals",{"$f":"COUNTIF(E4:E29,\"Y\")","v":17},null,{"$f":"SUM(G4:G29)","v":26},{"$f":"SUM(H4:H29)","v":0},{"$f":"SUM(I4:I29)","v":0},{"$f":"MAX(J4:J29)","v":3.21},null,{"$f":"SUM(L4:L29)","v":28.859999999999996},{"$f":"SUM(M4:M29)","v":26},{"$f":"SUM(N4:N29)","v":28.859999999999996},null,{"$f":"SUM(P4:P29)","v":9.86},{"$f":"SUM(Q4:Q29)","v":8}]
[null,"Place","Team #","Partners",null,null,"Total Weight",null,"Place","Team #","Partners",null,null,"Total Weight",null,"NB Avg",{"$f":"IF(Q30=0,\"No Data\",P30/Q30)","v":1.2324999999999999}]
[null,"1st",{"$f":"Teams!$AD64","v":2},{"$f":"VLOOKUP($C32,$B$4:$D$29,3,0)","v":"Jack"},"&",{"$f":"IF($B$4:$B$29=20,\"#N/A\",IF(COUNTIF($B$4:$B$29,$C32)=1,\"Alone\",LOOKUP(2,1/($B$4:$B$29=$C32),$D$4:$D$29)))","v":"Rich T"},{"$f":"Teams!AE64","v":8.94},null,"4th",{"$f":"Teams!$AD67","v":9},{"$f":"VLOOKUP($J32,$B$4:$D$29,3,0)","v":"Kam"},"&",{"$f":"IF($B$4:$B$29=20,\"#N/A\",IF(COUNTIF($B$4:$B$29,$J32)=1,\"Alone\",LOOKUP(2,1/($B$4:$B$29=$J32),$D$4:$D$29)))","v":"Kevin"},{"$f":"Teams!AE67","v":3.2199999999999998}]
[null,"2nd",{"$f":"Teams!$AD65","v":7},{"$f":"VLOOKUP($C33,$B$4:$D$29,3,0)","v":"Armand"},"&",{"$f":"IF($B$4:$B$29=20,\"#N/A\",IF(COUNTIF($B$4:$B$29,$C33)=1,\"Alone\",LOOKUP(2,1/($B$4:$B$29=$C33),$D$4:$D$29)))","v":"Mike G"},{"$f":"Teams!AE65","v":4.38},null,"5th",{"$f":"Teams!$AD68","v":4},{"$f":"VLOOKUP($J33,$B$4:$D$29,3,0)","v":"Ryan"},"&",{"$f":"IF($B$4:$B$29=20,\"#N/A\",IF(COUNTIF($B$4:$B$29,$J33)=1,\"Alone\",LOOKUP(2,1/($B$4:$B$29=$J33),$D$4:$D$29)))","v":"Steve D"},{"$f":"Teams!AE68","v":3.14}]
[null,"3rd",{"$f":"Teams!$AD66","v":1},{"$f":"VLOOKUP($C34,$B$4:$D$29,3,0)","v":"Dean"},"&",{"$f":"IF($B$4:$B$29=20,\"#N/A\",IF(COUNTIF($B$4:$B$29,$C34)=1,\"Alone\",LOOKUP(2,1/($B$4:$B$29=$C34),$D$4:$D$29)))","v":"Pete"},{"$f":"Teams!AE66","v":4.08},null,"6th",{"$f":"Teams!$AD69","v":3},{"$f":"VLOOKUP($J34,$B$4:$D$29,3,0)","v":"Jim B"},"&",{"$f":"IF($B$4:$B$29=20,\"#N/A\",IF(COUNTIF($B$4:$B$29,$J34)=1,\"Alone\",LOOKUP(2,1/($B$4:$B$29=$J34),$D$4:$D$29)))","v":"Rich B"},{"$f":"Teams!AE69","v":2.02}]

{"sheet":"Moodus","index":7,"n_rows":34,"n_cols":17,"rows_kept":34,"cut":false,"hidden":false,"merged":[[0,0,0,16],[30,3,30,5],[30,6,30,7],[30,10,30,12],[1,0,2,0],[33,6,33,7],[33,13,33,14],[30,13,30,14],[31,6,31,7],[31,13,31,14],[32,6,32,7],[32,13,32,14]]}
[{"$f":"YTD!L22","v":"Moodus"}]
[null,"Team","Fish","Member","Show","Non","Number","Number","Number","Lunker","Species","Gross","Total","Net","Points","Non Boater","# Non-"]
[null,"Number","Alone?","Name","Up?","Boater?","of LMB","of SMB","Dead","Weight","LMB/SMB","Weight","Caught","Weight","Awarded","Weight","Boaters"]
[1,null,"N",{"$f":"YTD!P15","v":"Anthony"},"n",{"$f":"YTD!Q15","v":"Y"},null,null,null,null,null,null,{"$f":"G4+H4","v":0},{"$f":"L4-(I4*0.2)","v":0},{"$f":"IF($E4=\"N\",35,IF($M4=0,30,RANK($N4,$N$4:$N$29,0)))","v":35},{"$f":"IF(F4=\"Y\",N4,0)","v":0},{"$f":"IF(E4=\"N\",0,(IF(F4=\"N\",0,1)))","v":0}]
[2,3,"N",{"$f":"YTD!P16","v":"Armand"},"Y",{"$f":"YTD!Q16","v":"N"},4,null,null,null,null,3.28,4,3.28,{"$f":"IF($E5=\"N\",35,IF($M5=0,30,RANK($N5,$N$4:$N$29,0)))","v":4},0,{"$f":"IF(E5=\"N\",0,(IF(F5=\"N\",0,1)))","v":0}]
[3,8,"y",{"$f":"YTD!P17","v":"Dean"},"Y",{"$f":"YTD!Q17","v":"N"},2,null,null,null,null,2.2799999999999998,{"$f":"G6+H6","v":2},{"$f":"L6-(I6*0.2)","v":2.2799999999999998},7,{"$f":"IF(F6=\"Y\",N6,0)","v":0},0]
[4,5,"N",{"$f":"YTD!P18","v":"Jack"},"Y",{"$f":"YTD!Q18","v":"N"},3,null,null,null,null,3.84,3,3.84,2,0,0]
[5,null,"N",{"$f":"YTD!P19","v":"Jason"},"n",{"$f":"YTD!Q19","v":"N"},null,null,null,null,null,null,{"$f":"G8+H8","v":0},{"$f":"L8-(I8*0.2)","v":0},35,{"$f":"IF(F8=\"Y\",N8,0)","v":0},0]
[6,1,"N",{"$f":"YTD!P20","v":"Jim B"},"Y",{"$f":"YTD!Q20","v":"Y"},1,null,null,null,null,0.77,1,0.77,12,0.77,1]
[7,5,"N",{"$f":"YTD!P21","v":"Kam"},"Y",{"$f":"YTD!Q21","v":"Y"},1,null,null,null,null,0.85,1,0.85,11,0.85,1]
[8,1,"N",{"$f":"YTD!P22","v":"Kevin"},"Y",{"$f":"YTD!Q22","v":"N"},2,null,null,null,null,2.2200000000000002,{"$f":"G11+H11","v":2},{"$f":"L11-(I11*0.2)","v":2.2200000000000002},8,{"$f":"IF(F11=\"Y\",N11,0)","v":0},0]
[9,null,"N",{"$f":"YTD!P23","v":"Mike G"},"n",{"$f":"YTD!Q23","v":"Y"},null,null,null,null,null,null,0,0,35,0,0]
[10,2,"N",{"$f":"YTD!P24","v":"Morrie"},"Y",{"$f":"YTD!Q24","v":"N"},null,null,null,null,null,null,0,0,30,0,0]
[11,3,"N",{"$f":"YTD!P25","v":"Oz"},"Y",{"$f":"YTD!Q25","v":"Y"},1,null,null,null,null,0.76,1,0.76,13,0.76,1]
[12,6,"N",{"$f":"YTD!P26","v":"Pete"},"Y",{"$f":"YTD!Q26","v":"Y"},1,null,null,null,null,1.53,1,1.53,10,1.53,1]
[13,4,"N",{"$f":"YTD!P27","v":"Rich B"},"Y","y",2,null,null,null,null,1.65,2,1.65,9,1.65,1]
[14,2,"N",{"$f":"YTD!P28","v":"Rich M"},"Y",{"$f":"YTD!Q28","v":"Y"},3,null,null,null,null,3.3,3,3.3,3,3.3,1]
[15,null,"N",{"$f":"YTD!P29","v":"Rich T"},"n",{"$f":"YTD!Q29","v":"Y"},null,null,null,null,null,null,{"$f":"G18+H18","v":0},{"$f":"L18-(I18*0.2)","v":0},35,0,0]
[16,7,"N",{"$f":"YTD!P30","v":"Ryan"},"Y",{"$f":"YTD!Q30","v":"Y"},3,null,null,null,null,2.73,3,2.73,6,2.73,1]
[17,4,"N",{"$f":"YTD!P31","v":"Scott"},"Y",{"$f":"YTD!Q31","v":"N"},3,null,null,6.84,"LMB",10.58,{"$f":"G20+H20","v":3},{"$f":"L20-(I20*0.2)","v":10.58},1,{"$f":"IF(F20=\"Y\",N20,0)","v":0},0]
[18,6,"N",{"$f":"YTD!P32","v":"Steve D"},"Y",{"$f":"YTD!Q32","v":"N"},4,null,null,null,null,3.27,4,3.27,5,0,0]
[19,7,"N",{"$f":"YTD!P33","v":"Steve S"},"Y",{"$f":"YTD!Q33","v":"N"},null,null,null,null,null,null,0,0,30,0,0]
[20,null,"N",{"$f":"YTD!P34","v":"Tom"},"n",{"$f":"YTD!Q34","v":"N"},null,null,null,null,null,null,{"$f":"G23+H23","v":0},{"$f":"L23-(I23*0.2)","v":0},35,0,0]
[21,null,"N",{"$f":"YTD!P35","v":"X"},"N",{"$f":"YTD!Q35","v":0},null,null,null,null,null,null,0,0,35,0,0]
[22,null,"N",{"$f":"YTD!P36","v":"X"},"N",{"$f":"YTD!Q36","v":0},null,null,null,null,null,null,0,0,35,0,0]
[23,null,"N",{"$f":"YTD!P37","v":"X"},"N",{"$f":"YTD!Q37","v":0},null,null,null,null,null,null,0,0,35,0,0]
[24,null,"N",{"$f":"YTD!P38","v":"X"},"N",{"$f":"YTD!Q38","v":0},null,null,null,null,null,null,0,0,35,0,0]
[25,null,"N",{"$f":"YTD!P39","v":"X"},"N",{"$f":"YTD!Q39","v":0},null,null,null,null,null,null,{"$f":"G28+H28","v":0},{"$f":"L28-(I28*0.2)","v":0},35,{"$f":"IF(F28=\"Y\",N28,0)","v":0},{"$f":"IF(E28=\"N\",0,(IF(F28=\"N\",0,1)))","v":0}]
[26,null,"N",{"$f":"YTD!P40","v":"X"},"N",{"$f":"YTD!Q40","v":0},null,null,null,null,null,null,{"$f":"G29+H29","v":0},{"$f":"L29-(I29*0.2)","v":0},35,{"$f":"IF(F29=\"Y\",N29,0)","v":0},{"$f":"IF(E29=\"N\",0,(IF(F29=\"N\",0,1)))","v":0}]
[null,null,null,"Totals",{"$f":"COUNTIF(E4:E29,\"Y\")","v":15},null,{"$f":"SUM(G4:G29)","v":30},{"$f":"SUM(H4:H29)","v":0},{"$f":"SUM(I4:I29)","v":0},{"$f":"MAX(J4:J29)","v":6.84},null,{"$f":"SUM(L4:L29)","v":37.06},{"$f":"SUM(M4:M29)","v":30},{"$f":"SUM(N4:N29)","v":37.06},null,{"$f":"SUM(P4:P29)","v":11.59},{"$f":"SUM(Q4:Q29)","v":7}]
[null,"Place","Team #","Partners",null,null,"Total Weight",null,"Place","Team #","Partners",null,null,"Total Weight",null,"NB Avg",{"$f":"IF(Q30=0,\"No Data\",P30/Q30)","v":1.6557142857142857}]
[null,"1st",{"$f":"Teams!$AD94","v":4},{"$f":"VLOOKUP($C32,$B$4:$D$29,3,0)","v":"Rich B"},"&",{"$f":"IF($B$4:$B$29=20,\"#N/A\",IF(COUNTIF($B$4:$B$29,$C32)=1,\"Alone\",LOOKUP(2,1/($B$4:$B$29=$C32),$D$4:$D$29)))","v":"Scott"},{"$f":"Teams!AE94","v":12.23},null,"4th",{"$f":"Teams!$AD97","v":3},{"$f":"VLOOKUP($J32,$B$4:$D$29,3,0)","v":"Armand"},"&",{"$f":"IF($B$4:$B$29=20,\"#N/A\",IF(COUNTIF($B$4:$B$29,$J32)=1,\"Alone\",LOOKUP(2,1/($B$4:$B$29=$J32),$D$4:$D$29)))","v":"Oz"},{"$f":"Teams!AE97","v":4.04}]
[null,"2nd",{"$f":"Teams!$AD95","v":6},{"$f":"VLOOKUP($C33,$B$4:$D$29,3,0)","v":"Pete"},"&",{"$f":"IF($B$4:$B$29=20,\"#N/A\",IF(COUNTIF($B$4:$B$29,$C33)=1,\"Alone\",LOOKUP(2,1/($B$4:$B$29=$C33),$D$4:$D$29)))","v":"Steve D"},{"$f":"Teams!AE95","v":4.8},null,"5th",{"$f":"Teams!$AD98","v":8},{"$f":"VLOOKUP($J33,$B$4:$D$29,3,0)","v":"Dean"},"&",{"$f":"IF($B$4:$B$29=20,\"#N/A\",IF(COUNTIF($B$4:$B$29,$J33)=1,\"Alone\",LOOKUP(2,1/($B$4:$B$29=$J33),$D$4:$D$29)))","v":"Alone"},{"$f":"Teams!AE98","v":3.9357142857142855}]
[null,"3rd",{"$f":"Teams!$AD96","v":5},{"$f":"VLOOKUP($C34,$B$4:$D$29,3,0)","v":"Jack"},"&",{"$f":"IF($B$4:$B$29=20,\"#N/A\",IF(COUNTIF($B$4:$B$29,$C34)=1,\"Alone\",LOOKUP(2,1/($B$4:$B$29=$C34),$D$4:$D$29)))","v":"Kam"},{"$f":"Teams!AE96","v":4.6899999999999995},null,"6th",{"$f":"Teams!$AD99","v":2},{"$f":"VLOOKUP($J34,$B$4:$D$29,3,0)","v":"Morrie"},"&",{"$f":"IF($B$4:$B$29=20,\"#N/A\",IF(COUNTIF($B$4:$B$29,$J34)=1,\"Alone\",LOOKUP(2,1/($B$4:$B$29=$J34),$D$4:$D$29)))","v":"Rich M"},{"$f":"Teams!AE99","v":3.3}]

{"sheet":"Teams","index":8,"n_rows":120,"n_cols":31,"rows_kept":120,"cut":false,"hidden":false,"merged":[[31,16,31,27],[1,16,1,27],[61,16,61,27],[91,16,91,27],[1,0,1,11],[31,0,31,11],[61,0,61,11],[91,0,91,11]]}
[]
[{"$f":"YTD!L15","v":"Bantam"},null,null,null,null,null,null,null,null,null,null,null,"Sort","Copy","Sort",null,{"$f":"YTD!L19","v":"Lillinonah"},null,null,null,null,null,null,null,null,null,null,null,"Sort","Copy","Sort"]
["Team #","Alone?","Name","Net Wt",null,"Team #","Alone?","Name","Net Wt",null,"Totals","Rank","Rank","Team #","Tot Wt",null,"Team #","Alone?","Name","Net Wt",null,"Team #","Alone?","Name","Net Wt",null,"Totals","Rank","Rank","Team #","Tot Wt"]
[{"$f":"Bantam!B4","v":1},{"$f":"Bantam!C4","v":"N"},{"$f":"Bantam!D4","v":"Anthony"},{"$f":"Bantam!N4","v":0.73},null,0,"N","Kam",0,null,{"$f":"IF(F4=20,0,IF(F4=F5,I4+I5,IF(G4=\"Y\",I4+I$30,0)))","v":0},{"$f":"IF(K4>0,RANK(K4,K$4:K$29,0),\"\")","v":""},1,5,15.74,null,{"$f":"Lillinonah!B4","v":0},{"$f":"Lillinonah!C4","v":"N"},{"$f":"Lillinonah!D4","v":"Anthony"},{"$f":"Lillinonah!N4","v":0},null,0,"N","Anthony",0,null,{"$f":"IF(V4=20,0,IF(V4=V5,Y4+Y5,IF(W4=\"Y\",Y4+Y$30,0)))","v":0},{"$f":"IF(AA4>0,RANK(AA4,AA$4:AA$29,0),\"\")","v":""},1,8,19.37]
[{"$f":"Bantam!B5","v":5},{"$f":"Bantam!C5","v":"N"},{"$f":"Bantam!D5","v":"Armand"},{"$f":"Bantam!N5","v":10.57},null,0,"N","Morrie",0,null,{"$f":"IF(F5=20,0,IF(F5=F6,I5+I6,IF(G5=\"Y\",I5+I$30,0)))","v":0},{"$f":"IF(K5>0,RANK(K5,K$4:K$29,0),\"\")","v":""},2,8,11.32,null,{"$f":"Lillinonah!B5","v":1},{"$f":"Lillinonah!C5","v":"N"},{"$f":"Lillinonah!D5","v":"Armand"},{"$f":"Lillinonah!N5","v":6.5},null,0,"N","Jason",0,null,{"$f":"IF(V5=20,0,IF(V5=V6,Y5+Y6,IF(W5=\"Y\",Y5+Y$30,0)))","v":0},{"$f":"IF(AA5>0,RANK(AA5,AA$4:AA$29,0),\"\")","v":""},2,1,15.32]
[{"$f":"Bantam!B6","v":2},{"$f":"Bantam!C6","v":"N"},{"$f":"Bantam!D6","v":"Dean"},{"$f":"Bantam!N6","v":10.28},null,0,"N","Rich M",0,null,0,"",3,2,10.28,null,{"$f":"Lillinonah!B6","v":7},{"$f":"Lillinonah!C6","v":"N"},{"$f":"Lillinonah!D6","v":"Dean"},{"$f":"Lillinonah!N6","v":5.91},null,0,"N","Jim B",0,null,0,"",3,2,13.870000000000001]
[{"$f":"Bantam!B7","v":8},{"$f":"Bantam!C7","v":"N"},{"$f":"Bantam!D7","v":"Jack"},{"$f":"Bantam!N7","v":7.41},null,0,"N","X",0,null,0,"",4,4,9.2199999999999989,null,{"$f":"Lillinonah!B7","v":6},{"$f":"Lillinonah!C7","v":"N"},{"$f":"Lillinonah!D7","v":"Jack"},{"$f":"Lillinonah!N7","v":4.41},null,0,"N","Kam",0,null,0,"",4,9,13.472857142857142]
[{"$f":"Bantam!B8","v":3},{"$f":"Bantam!C8","v":"N"},{"$f":"Bantam!D8","v":"Jason"},{"$f":"Bantam!N8","v":7.62},null,0,"N","X",0,null,0,"",5,3,7.62,null,{"$f":"Lillinonah!B8","v":0},{"$f":"Lillinonah!C8","v":"N"},{"$f":"Lillinonah!D8","v":"Jason"},{"$f":"Lillinonah!N8","v":0},null,0,"N","Oz",0,null,0,"",5,7,10.83]
[{"$f":"Bantam!B9","v":6},{"$f":"Bantam!C9","v":"N"},{"$f":"Bantam!D9","v":"Jim B"},{"$f":"Bantam!N9","v":3.7},null,0,"N","X",0,null,0,"",6,6,5.75,null,{"$f":"Lillinonah!B9","v":0},{"$f":"Lillinonah!C9","v":"N"},{"$f":"Lillinonah!D9","v":"Jim B"},{"$f":"Lillinonah!N9","v":0},null,0,"N","X",0,null,0,"",6,6,7.6300000000000008]
[{"$f":"Bantam!B10","v":0},{"$f":"Bantam!C10","v":"N"},{"$f":"Bantam!D10","v":"Kam"},{"$f":"Bantam!N10","v":0},null,0,"N","X",0,null,0,"",7,1,3.48,null,{"$f":"Lillinonah!B10","v":0},{"$f":"Lillinonah!C10","v":"N"},{"$f":"Lillinonah!D10","v":"Kam"},{"$f":"Lillinonah!N10","v":0},null,0,"N","X",0,null,0,"",7,3,7.41]
[{"$f":"Bantam!B11","v":4},{"$f":"Bantam!C11","v":"N"},{"$f":"Bantam!D11","v":"Kevin"},{"$f":"Bantam!N11","v":7.8},null,0,"N","X",0,null,0,"",8,9,2.06,null,{"$f":"Lillinonah!B11","v":8},{"$f":"Lillinonah!C11","v":"N"},{"$f":"Lillinonah!D11","v":"Kevin"},{"$f":"Lillinonah!N11","v":11.41},null,0,"N","X",0,null,0,"",8,4,4.5999999999999996]
[{"$f":"Bantam!B12","v":3},{"$f":"Bantam!C12","v":"N"},{"$f":"Bantam!D12","v":"Mike G"},{"$f":"Bantam!N12","v":0},null,0,"N","X",0,null,0,"","",0,0,null,{"$f":"Lillinonah!B12","v":3},{"$f":"Lillinonah!C12","v":"N"},{"$f":"Lillinonah!D12","v":"Mike G"},{"$f":"Lillinonah!N12","v":2.94},null,0,"N","X",0,null,0,"","",0,0]
[{"$f":"Bantam!B13","v":0},{"$f":"Bantam!C13","v":"N"},{"$f":"Bantam!D13","v":"Morrie"},{"$f":"Bantam!N13","v":0},null,1,"N","Anthony",0.73,null,3.48,7,"",0,0,null,{"$f":"Lillinonah!B13","v":3},{"$f":"Lillinonah!C13","v":"N"},{"$f":"Lillinonah!D13","v":"Morrie"},{"$f":"Lillinonah!N13","v":4.47},null,0,"N","X",0,null,0,"","",0,0]
[{"$f":"Bantam!B14","v":4},{"$f":"Bantam!C14","v":"N"},{"$f":"Bantam!D14","v":"Oz"},{"$f":"Bantam!N14","v":1.42},null,1,"N","Rich B",2.75,null,0,"","",0,0,null,{"$f":"Lillinonah!B14","v":0},{"$f":"Lillinonah!C14","v":"N"},{"$f":"Lillinonah!D14","v":"Oz"},{"$f":"Lillinonah!N14","v":0},null,0,"N","X",0,null,0,"","",0,0]
[{"$f":"Bantam!B15","v":5},{"$f":"Bantam!C15","v":"N"},{"$f":"Bantam!D15","v":"Pete"},{"$f":"Bantam!N15","v":5.17},null,2,"N","Dean",10.28,null,10.28,3,"",0,0,null,{"$f":"Lillinonah!B15","v":8},{"$f":"Lillinonah!C15","v":"N"},{"$f":"Lillinonah!D15","v":"Pete"},{"$f":"Lillinonah!N15","v":7.96},null,1,"N","Armand",6.5,null,15.32,2,"",0,0]
[{"$f":"Bantam!B16","v":1},{"$f":"Bantam!C16","v":"N"},{"$f":"Bantam!D16","v":"Rich B"},{"$f":"Bantam!N16","v":2.75},null,2,"N","Rich T",0,null,0,"","",0,0,null,{"$f":"Lillinonah!B16","v":1},{"$f":"Lillinonah!C16","v":"N"},{"$f":"Lillinonah!D16","v":"Rich B"},{"$f":"Lillinonah!N16","v":8.82},null,1,"N","Rich B",8.82,null,0,"","",0,0]
[{"$f":"Bantam!B17","v":0},{"$f":"Bantam!C17","v":"N"},{"$f":"Bantam!D17","v":"Rich M"},{"$f":"Bantam!N17","v":0},null,3,"N","Jason",7.62,null,7.62,5,"",0,0,null,{"$f":"Lillinonah!B17","v":7},{"$f":"Lillinonah!C17","v":"N"},{"$f":"Lillinonah!D17","v":"Rich M"},{"$f":"Lillinonah!N17","v":4.92},null,2,"N","Steve D",5.69,null,13.870000000000001,3,"",0,0]
[{"$f":"Bantam!B18","v":2},{"$f":"Bantam!C18","v":"N"},{"$f":"Bantam!D18","v":"Rich T"},{"$f":"Bantam!N18","v":0},null,3,"N","Mike G",0,null,0,"","",0,0,null,{"$f":"Lillinonah!B18","v":4},{"$f":"Lillinonah!C18","v":"N"},{"$f":"Lillinonah!D18","v":"Rich T"},{"$f":"Lillinonah!N18","v":0.95},null,2,"N","Steve S",8.18,null,0,"","",0,0]
[{"$f":"Bantam!B19","v":8},{"$f":"Bantam!C19","v":"N"},{"$f":"Bantam!D19","v":"Ryan"},{"$f":"Bantam!N19","v":3.91},null,4,"N","Kevin",7.8,null,9.2199999999999989,4,"",0,0,null,{"$f":"Lillinonah!B19","v":6},{"$f":"Lillinonah!C19","v":"N"},{"$f":"Lillinonah!D19","v":"Ryan"},{"$f":"Lillinonah!N19","v":3.22},null,3,"N","Mike G",2.94,null,7.41,7,"",0,0]
[{"$f":"Bantam!B20","v":7},{"$f":"Bantam!C20","v":"Y"},{"$f":"Bantam!D20","v":"Scott"},{"$f":"Bantam!N20","v":0.92},null,4,"N","Oz",1.42,null,0,"","",0,0,null,{"$f":"Lillinonah!B20","v":9},{"$f":"Lillinonah!C20","v":"y"},{"$f":"Lillinonah!D20","v":"Scott"},{"$f":"Lillinonah!N20","v":8.52},null,3,"N","Morrie",4.47,null,0,"","",0,0]
[{"$f":"Bantam!B21","v":9},{"$f":"Bantam!C21","v":"N"},{"$f":"Bantam!D21","v":"Steve D"},{"$f":"Bantam!N21","v":2.06},null,5,"N","Armand",10.57,null,15.74,1,"",1,0,null,{"$f":"Lillinonah!B21","v":2},{"$f":"Lillinonah!C21","v":"N"},{"$f":"Lillinonah!D21","v":"Steve D"},{"$f":"Lillinonah!N21","v":5.69},null,4,"N","Rich T",0.95,null,4.5999999999999996,8,"",0,0]
[{"$f":"Bantam!B22","v":6},{"$f":"Bantam!C22","v":"N"},{"$f":"Bantam!D22","v":"Steve S"},{"$f":"Bantam!N22","v":2.0499999999999998},null,5,"N","Pete",5.17,null,0,"","",2,0,null,{"$f":"Lillinonah!B22","v":2},{"$f":"Lillinonah!C22","v":"N"},{"$f":"Lillinonah!D22","v":"Steve S"},{"$f":"Lillinonah!N22","v":8.18},null,4,"N","Tom",3.65,null,0,"","",0,0]
[{"$f":"Bantam!B23","v":9},{"$f":"Bantam!C23","v":"N"},{"$f":"Bantam!D23","v":"Tom"},{"$f":"Bantam!N23","v":0},null,6,"N","Jim B",3.7,null,5.75,6,"",3,0,null,{"$f":"Lillinonah!B23","v":4},{"$f":"Lillinonah!C23","v":"N"},{"$f":"Lillinonah!D23","v":"Tom"},{"$f":"Lillinonah!N23","v":3.65},null,6,"N","Jack",4.41,null,7.6300000000000008,6,"",1,0]
[{"$f":"Bantam!B24","v":0},{"$f":"Bantam!C24","v":"N"},{"$f":"Bantam!D24","v":"X"},{"$f":"Bantam!N24","v":0},null,6,"N","Steve S",2.0499999999999998,null,0,"","",4,0,null,{"$f":"Lillinonah!B24","v":0},{"$f":"Lillinonah!C24","v":"N"},{"$f":"Lillinonah!D24","v":"X"},{"$f":"Lillinonah!N24","v":0},null,6,"N","Ryan",3.22,null,0,"","",2,0]
[{"$f":"Bantam!B25","v":0},{"$f":"Bantam!C25","v":"N"},{"$f":"Bantam!D25","v":"X"},{"$f":"Bantam!N25","v":0},null,7,"N","Scott",0.92,null,0,"","",5,0,null,{"$f":"Lillinonah!B25","v":0},{"$f":"Lillinonah!C25","v":"N"},{"$f":"Lillinonah!D25","v":"X"},{"$f":"Lillinonah!N25","v":0},null,7,"N","Dean",5.91,null,10.83,5,"",3,0]
[{"$f":"Bantam!B26","v":0},{"$f":"Bantam!C26","v":"N"},{"$f":"Bantam!D26","v":"X"},{"$f":"Bantam!N26","v":0},null,8,"N","Jack",7.41,null,11.32,2,"",6,0,null,{"$f":"Lillinonah!B26","v":0},{"$f":"Lillinonah!C26","v":"N"},{"$f":"Lillinonah!D26","v":"X"},{"$f":"Lillinonah!N26","v":0},null,7,"N","Rich M",4.92,null,0,"","",4,0]
[{"$f":"Bantam!B27","v":0},{"$f":"Bantam!C27","v":"N"},{"$f":"Bantam!D27","v":"X"},{"$f":"Bantam!N27","v":0},null,8,"N","Ryan",3.91,null,0,"","",7,0,null,{"$f":"Lillinonah!B27","v":0},{"$f":"Lillinonah!C27","v":"N"},{"$f":"Lillinonah!D27","v":"X"},{"$f":"Lillinonah!N27","v":0},null,8,"N","Kevin",11.41,null,19.37,1,"",6,0]
[{"$f":"Bantam!B28","v":0},{"$f":"Bantam!C28","v":"N"},{"$f":"Bantam!D28","v":"X"},{"$f":"Bantam!N28","v":0},null,9,"N","Steve D",2.06,null,2.06,8,"",8,0,null,{"$f":"Lillinonah!B28","v":0},{"$f":"Lillinonah!C28","v":"N"},{"$f":"Lillinonah!D28","v":"X"},{"$f":"Lillinonah!N28","v":0},null,8,"N","Pete",7.96,null,0,"","",7,0]
[{"$f":"Bantam!B29","v":0},{"$f":"Bantam!C29","v":"N"},{"$f":"Bantam!D29","v":"X"},{"$f":"Bantam!N29","v":0},null,9,"N","Tom",0,null,0,"","",9,0,null,{"$f":"Lillinonah!B29","v":0},{"$f":"Lillinonah!C29","v":"N"},{"$f":"Lillinonah!D29","v":"X"},{"$f":"Lillinonah!N29","v":0},null,9,"y","Scott",8.52,null,13.472857142857142,4,"",8,0]
[null,"Macro","CTL+M","Teams",1,null,null,"NB Avg",{"$f":"Bantam!Q31","v":1.86625},null,null,null,null,null,null,null,null,"Macro","CTL+Y","Teams",5,null,null,"NB Avg",{"$f":"Lillinonah!Q31","v":4.9528571428571428}]
[]
[{"$f":"YTD!L16","v":"McDonough"},null,null,null,null,null,null,null,null,null,null,null,"Sort","Copy","Sort",null,{"$f":"YTD!L20","v":"CT River"},null,null,null,null,null,null,null,null,null,null,null,"Sort","Copy","Sort"]
["Team #","Alone?","Name","Net Wt",null,"Team #","Alone?","Name","Net Wt",null,"Totals","Rank","Rank","Team #","Tot Wt",null,"Team #","Alone?","Name","Net Wt",null,"Team #","Alone?","Name","Net Wt",null,"Totals","Rank","Rank","Team #","Tot Wt"]
[{"$f":"McDonough!B4","v":8},{"$f":"McDonough!C4","v":"N"},{"$f":"McDonough!D4","v":"Anthony"},{"$f":"McDonough!N4","v":2.39},null,0,"N","Kam",0,null,{"$f":"IF(F34=20,0,IF(F34=F35,I34+I35,IF(G34=\"Y\",I34+I$60,0)))","v":0},{"$f":"IF(K34>0,RANK(K34,K$34:K$59,0),\"\")","v":""},1,2,18.73,null,{"$f":"'CT River'!B4","v":0},{"$f":"'CT River'!C4","v":"N"},{"$f":"'CT River'!D4","v":"Anthony"},{"$f":"'CT River'!N4","v":0},null,0,"N","Anthony",0,null,{"$f":"IF(V34=20,0,IF(V34=V35,Y34+Y35,IF(W34=\"Y\",Y34+Y$60,0)))","v":0},{"$f":"IF(AA34>0,RANK(AA34,AA$34:AA$59,0),\"\")","v":""},1,3,12.309999999999999]
[{"$f":"McDonough!B5","v":7},{"$f":"McDonough!C5","v":"N"},{"$f":"McDonough!D5","v":"Armand"},{"$f":"McDonough!N5","v":9.42},null,0,"N","Mike G",0,null,{"$f":"IF(F35=20,0,IF(F35=F36,I35+I36,IF(G35=\"Y\",I35+I$60,0)))","v":0},{"$f":"IF(K35>0,RANK(K35,K$34:K$59,0),\"\")","v":""},2,4,16.21,null,{"$f":"'CT River'!B5","v":8},{"$f":"'CT River'!C5","v":"N"},{"$f":"'CT River'!D5","v":"Armand"},{"$f":"'CT River'!N5","v":1.1000000000000001},null,0,"N","Jason",0,null,{"$f":"IF(V35=20,0,IF(V35=V36,Y35+Y36,IF(W35=\"Y\",Y35+$Y$60,0)))","v":0},{"$f":"IF(AA35>0,RANK(AA35,AA$34:AA$59,0),\"\")","v":""},2,4,11.059999999999999]
[{"$f":"McDonough!B6","v":3},{"$f":"McDonough!C6","v":"Y"},{"$f":"McDonough!D6","v":"Dean"},{"$f":"McDonough!N6","v":9.16},null,0,"N","Morrie",0,null,0,"",3,7,16.12,null,{"$f":"'CT River'!B6","v":3},{"$f":"'CT River'!C6","v":"N"},{"$f":"'CT River'!D6","v":"Dean"},{"$f":"'CT River'!N6","v":5.05},null,0,"N","Jim B",0,null,0,"",3,7,9.879999999999999]
[{"$f":"McDonough!B7","v":9},{"$f":"McDonough!C7","v":"N"},{"$f":"McDonough!D7","v":"Jack"},{"$f":"McDonough!N7","v":6.33},null,0,"N","Rich M",0,null,0,"",4,3,15.440000000000001,null,{"$f":"'CT River'!B7","v":7},{"$f":"'CT River'!C7","v":"N"},{"$f":"'CT River'!D7","v":"Jack"},{"$f":"'CT River'!N7","v":8},null,0,"N","Tom",0,null,0,"",4,1,7.4700000000000006]
[{"$f":"McDonough!B8","v":5},{"$f":"McDonough!C8","v":"N"},{"$f":"McDonough!D8","v":"Jason"},{"$f":"McDonough!N8","v":9.7100000000000009},null,0,"N","X",0,null,0,"",5,9,14.31,null,{"$f":"'CT River'!B8","v":0},{"$f":"'CT River'!C8","v":"N"},{"$f":"'CT River'!D8","v":"Jason"},{"$f":"'CT River'!N8","v":0},null,0,"N","X",0,null,0,"",5,2,4.91]
[{"$f":"McDonough!B9","v":6},{"$f":"McDonough!C9","v":"N"},{"$f":"McDonough!D9","v":"Jim B"},{"$f":"McDonough!N9","v":7.43},null,0,"N","X",0,null,0,"",6,6,13.489999999999998,null,{"$f":"'CT River'!B9","v":0},{"$f":"'CT River'!C9","v":"N"},{"$f":"'CT River'!D9","v":"Jim B"},{"$f":"'CT River'!N9","v":0},null,0,"N","X",0,null,0,"",6,5,4.57]
[{"$f":"McDonough!B10","v":0},{"$f":"McDonough!C10","v":"N"},{"$f":"McDonough!D10","v":"Kam"},{"$f":"McDonough!N10","v":0},null,0,"N","X",0,null,0,"",7,1,11.040000000000001,null,{"$f":"'CT River'!B10","v":2},{"$f":"'CT River'!C10","v":"N"},{"$f":"'CT River'!D10","v":"Kam"},{"$f":"'CT River'!N10","v":4.91},null,0,"N","X",0,null,0,"",7,8,3.72]
[{"$f":"McDonough!B11","v":8},{"$f":"McDonough!C11","v":"N"},{"$f":"McDonough!D11","v":"Kevin"},{"$f":"McDonough!N11","v":7.67},null,0,"N","X",0,null,0,"",8,5,10.73,null,{"$f":"'CT River'!B11","v":7},{"$f":"'CT River'!C11","v":"N"},{"$f":"'CT River'!D11","v":"Kevin"},{"$f":"'CT River'!N11","v":1.88},null,0,"N","X",0,null,0,"",8,6,3.33]
[{"$f":"McDonough!B12","v":0},{"$f":"McDonough!C12","v":"N"},{"$f":"McDonough!D12","v":"Mike G"},{"$f":"McDonough!N12","v":0},null,0,"N","X",0,null,0,"",9,8,10.06,null,{"$f":"'CT River'!B12","v":6},{"$f":"'CT River'!C12","v":"N"},{"$f":"'CT River'!D12","v":"Mike G"},{"$f":"'CT River'!N12","v":0.86},null,0,"N","X",0,null,0,"","",0,0]
[{"$f":"McDonough!B13","v":0},{"$f":"McDonough!C13","v":"N"},{"$f":"McDonough!D13","v":"Morrie"},{"$f":"McDonough!N13","v":0},null,0,"N","X",0,null,0,"","",0,0,null,{"$f":"'CT River'!B13","v":5},{"$f":"'CT River'!C13","v":"N"},{"$f":"'CT River'!D13","v":"Morrie"},{"$f":"'CT River'!N13","v":4.57},null,0,"N","X",0,null,0,"","",0,0]
[{"$f":"McDonough!B14","v":5},{"$f":"McDonough!C14","v":"N"},{"$f":"McDonough!D14","v":"Oz"},{"$f":"McDonough!N14","v":1.02},null,1,"Y","Rich B",4.76,null,11.040000000000001,7,"",0,0,null,{"$f":"'CT River'!B14","v":5},{"$f":"'CT River'!C14","v":"N"},{"$f":"'CT River'!D14","v":"Oz"},{"$f":"'CT River'!N14","v":0},null,1,"N","Pete",3.32,null,7.4700000000000006,4,"",0,0]
[{"$f":"McDonough!B15","v":9},{"$f":"McDonough!C15","v":"N"},{"$f":"McDonough!D15","v":"Pete"},{"$f":"McDonough!N15","v":7.98},null,2,"N","Ryan",10.46,null,18.73,1,"",0,0,null,{"$f":"'CT River'!B15","v":1},{"$f":"'CT River'!C15","v":"N"},{"$f":"'CT River'!D15","v":"Pete"},{"$f":"'CT River'!N15","v":3.32},null,1,"N","Steve S",4.1500000000000004,null,0,"","",0,0]
[{"$f":"McDonough!B16","v":1},{"$f":"McDonough!C16","v":"Y"},{"$f":"McDonough!D16","v":"Rich B"},{"$f":"McDonough!N16","v":4.76},null,2,"N","Scott",8.27,null,0,"","",0,0,null,{"$f":"'CT River'!B16","v":2},{"$f":"'CT River'!C16","v":"N"},{"$f":"'CT River'!D16","v":"Rich B"},{"$f":"'CT River'!N16","v":0},null,2,"N","Kam",4.91,null,4.91,5,"",0,0]
[{"$f":"McDonough!B17","v":0},{"$f":"McDonough!C17","v":"N"},{"$f":"McDonough!D17","v":"Rich M"},{"$f":"McDonough!N17","v":0},null,3,"Y","Dean",9.16,null,15.440000000000001,4,"",0,0,null,{"$f":"'CT River'!B17","v":4},{"$f":"'CT River'!C17","v":"N"},{"$f":"'CT River'!D17","v":"Rich M"},{"$f":"'CT River'!N17","v":3.7199999999999998},null,2,"N","Rich B",0,null,0,"","",0,0]
[{"$f":"McDonough!B18","v":4},{"$f":"McDonough!C18","v":"N"},{"$f":"McDonough!D18","v":"Rich T"},{"$f":"McDonough!N18","v":7.98},null,4,"N","Rich T",7.98,null,16.21,2,"",0,0,null,{"$f":"'CT River'!B18","v":8},{"$f":"'CT River'!C18","v":"N"},{"$f":"'CT River'!D18","v":"Rich T"},{"$f":"'CT River'!N18","v":3.72},null,3,"N","Dean",5.05,null,12.309999999999999,1,"",0,0]
[{"$f":"McDonough!B19","v":2},{"$f":"McDonough!C19","v":"N"},{"$f":"McDonough!D19","v":"Ryan"},{"$f":"McDonough!N19","v":10.46},null,4,"N","Steve D",8.23,null,0,"","",0,0,null,{"$f":"'CT River'!B19","v":3},{"$f":"'CT River'!C19","v":"N"},{"$f":"'CT River'!D19","v":"Ryan"},{"$f":"'CT River'!N19","v":7.26},null,3,"N","Ryan",7.26,null,0,"","",0,0]
[{"$f":"McDonough!B20","v":2},{"$f":"McDonough!C20","v":"N"},{"$f":"McDonough!D20","v":"Scott"},{"$f":"McDonough!N20","v":8.27},null,5,"N","Jason",9.7100000000000009,null,10.73,8,"",0,0,null,{"$f":"'CT River'!B20","v":6},{"$f":"'CT River'!C20","v":"N"},{"$f":"'CT River'!D20","v":"Scott"},{"$f":"'CT River'!N20","v":2.4700000000000002},null,4,"N","Rich M",3.7199999999999998,null,11.059999999999999,2,"",0,0]
[{"$f":"McDonough!B21","v":4},{"$f":"McDonough!C21","v":"N"},{"$f":"McDonough!D21","v":"Steve D"},{"$f":"McDonough!N21","v":8.23},null,5,"N","Oz",1.02,null,0,"","",0,0,null,{"$f":"'CT River'!B21","v":4},{"$f":"'CT River'!C21","v":"N"},{"$f":"'CT River'!D21","v":"Steve D"},{"$f":"'CT River'!N21","v":7.34},null,4,"N","Steve D",7.34,null,0,"","",0,0]
[{"$f":"McDonough!B22","v":7},{"$f":"McDonough!C22","v":"N"},{"$f":"McDonough!D22","v":"Steve S"},{"$f":"McDonough!N22","v":6.7},null,6,"N","Jim B",7.43,null,13.489999999999998,6,"",0,0,null,{"$f":"'CT River'!B22","v":1},{"$f":"'CT River'!C22","v":"N"},{"$f":"'CT River'!D22","v":"Steve S"},{"$f":"'CT River'!N22","v":4.1500000000000004},null,5,"N","Morrie",4.57,null,4.57,6,"",1,0]
[{"$f":"McDonough!B23","v":6},{"$f":"McDonough!C23","v":"N"},{"$f":"McDonough!D23","v":"Tom"},{"$f":"McDonough!N23","v":6.06},null,6,"N","Tom",6.06,null,0,"","",2,0,null,{"$f":"'CT River'!B23","v":0},{"$f":"'CT River'!C23","v":"N"},{"$f":"'CT River'!D23","v":"Tom"},{"$f":"'CT River'!N23","v":0},null,5,"N","Oz",0,null,0,"","",2,0]
[{"$f":"McDonough!B24","v":0},{"$f":"McDonough!C24","v":"N"},{"$f":"McDonough!D24","v":"X"},{"$f":"McDonough!N24","v":0},null,7,"N","Armand",9.42,null,16.12,3,"",4,0,null,{"$f":"'CT River'!B24","v":0},{"$f":"'CT River'!C24","v":"N"},{"$f":"'CT River'!D24","v":"X"},{"$f":"'CT River'!N24","v":0},null,6,"N","Mike G",0.86,null,3.33,8,"",3,0]
[{"$f":"McDonough!B25","v":0},{"$f":"McDonough!C25","v":"N"},{"$f":"McDonough!D25","v":"X"},{"$f":"McDonough!N25","v":0},null,7,"N","Steve S",6.7,null,0,"","",5,0,null,{"$f":"'CT River'!B25","v":0},{"$f":"'CT River'!C25","v":"N"},{"$f":"'CT River'!D25","v":"X"},{"$f":"'CT River'!N25","v":0},null,6,"N","Scott",2.4700000000000002,null,0,"","",4,0]
[{"$f":"McDonough!B26","v":0},{"$f":"McDonough!C26","v":"N"},{"$f":"McDonough!D26","v":"X"},{"$f":"McDonough!N26","v":0},null,8,"N","Anthony",2.39,null,10.06,9,"",6,0,null,{"$f":"'CT River'!B26","v":0},{"$f":"'CT River'!C26","v":"N"},{"$f":"'CT River'!D26","v":"X"},{"$f":"'CT River'!N26","v":0},null,7,"N","Jack",8,null,9.879999999999999,3,"",5,0]
[{"$f":"McDonough!B27","v":0},{"$f":"McDonough!C27","v":"N"},{"$f":"McDonough!D27","v":"X"},{"$f":"McDonough!N27","v":0},null,8,"N","Kevin",7.67,null,0,"","",7,0,null,{"$f":"'CT River'!B27","v":0},{"$f":"'CT River'!C27","v":"N"},{"$f":"'CT River'!D27","v":"X"},{"$f":"'CT River'!N27","v":0},null,7,"N","Kevin",1.88,null,0,"","",6,0]
[{"$f":"McDonough!B28","v":0},{"$f":"McDonough!C28","v":"N"},{"$f":"McDonough!D28","v":"X"},{"$f":"McDonough!N28","v":0},null,9,"N","Jack",6.33,null,14.31,5,"",8,0,null,{"$f":"'CT River'!B28","v":0},{"$f":"'CT River'!C28","v":"N"},{"$f":"'CT River'!D28","v":"X"},{"$f":"'CT River'!N28","v":0},null,8,"N","Armand",0,null,3.72,7,"",7,0]
[{"$f":"McDonough!B29","v":0},{"$f":"McDonough!C29","v":"N"},{"$f":"McDonough!D29","v":"X"},{"$f":"McDonough!N29","v":0},null,9,"N","Pete",7.98,null,0,"","",9,0,null,{"$f":"'CT River'!B29","v":0},{"$f":"'CT River'!C29","v":"N"},{"$f":"'CT River'!D29","v":"X"},{"$f":"'CT River'!N29","v":0},null,8,"N","Rich T",3.72,null,0,"","",8,0]
[null,"Macro","CTL+D","Teams",2,null,null,"NB Avg",{"$f":"McDonough!Q31","v":6.2800000000000011},null,null,null,null,null,null,null,null,"Macro","CTL+T","Teams",6,null,null,"NB Avg",{"$f":"'CT River'!Q31","v":3.9737499999999999}]
[]
[{"$f":"YTD!L17","v":"Quaddick"},null,null,null,null,null,null,null,null,null,null,null,"Sort","Copy","Sort",null,{"$f":"YTD!L21","v":"West Hill"},null,null,null,null,null,null,null,null,null,null,null,"Sort","Copy","Sort"]
["Team #","Alone?","Name","Net Wt",null,"Team #","Alone?","Name","Net Wt",null,"Totals","Rank","Rank","Team #","Tot Wt",null,"Team #","Alone?","Name","Net Wt",null,"Team #","Alone?","Name","Net Wt",null,"Totals","Rank","Rank","Team #","Tot Wt"]
[{"$f":"Quaddick!B4","v":3},{"$f":"Quaddick!C4","v":"N"},{"$f":"Quaddick!D4","v":"Anthony"},{"$f":"Quaddick!N4","v":0},null,0,"N","Kam",0,null,{"$f":"IF(F64=20,0,IF(F64=F65,I64+I65,IF(G64=\"Y\",I64+I$90,0)))","v":0},{"$f":"IF(K64>0,RANK(K64,K$64:K$89,0),\"\")","v":""},1,4,17.54,null,{"$f":"'West Hill'!B4","v":0},{"$f":"'West Hill'!C4","v":"N"},{"$f":"'West Hill'!D4","v":"Anthony"},{"$f":"'West Hill'!N4","v":0},null,0,"N","Anthony",0,null,{"$f":"IF(V64=20,0,IF(V64=V65,Y64+Y65,IF(W64=\"Y\",Y64+Y$90,0)))","v":0},{"$f":"IF(AA64>0,RANK(AA64,AA$64:AA$89,0),\"\")","v":""},1,2,8.94]
[{"$f":"Quaddick!B5","v":9},{"$f":"Quaddick!C5","v":"N"},{"$f":"Quaddick!D5","v":"Armand"},{"$f":"Quaddick!N5","v":8.56},null,0,"N","Rich B",0,null,{"$f":"IF(F65=20,0,IF(F65=F66,I65+I66,IF(G65=\"Y\",I65+I$90,0)))","v":0},{"$f":"IF(K65>0,RANK(K65,K$64:K$89,0),\"\")","v":""},2,1,14.61,null,{"$f":"'West Hill'!B5","v":7},{"$f":"'West Hill'!C5","v":"N"},{"$f":"'West Hill'!D5","v":"Armand"},{"$f":"'West Hill'!N5","v":3.21},null,0,"N","Jason",0,null,{"$f":"IF(V65=20,0,IF(V65=V66,Y65+Y66,IF(W65=\"Y\",Y65+Y$90,0)))","v":0},{"$f":"IF(AA65>0,RANK(AA65,AA$64:AA$89,0),\"\")","v":""},2,7,4.38]
[{"$f":"Quaddick!B6","v":5},{"$f":"Quaddick!C6","v":"N"},{"$f":"Quaddick!D6","v":"Dean"},{"$f":"Quaddick!N6","v":8.4300000000000015},null,0,"N","X",0,null,0,"",3,9,14.350000000000001,null,{"$f":"'West Hill'!B6","v":1},{"$f":"'West Hill'!C6","v":"N"},{"$f":"'West Hill'!D6","v":"Dean"},{"$f":"'West Hill'!N6","v":3.21},null,0,"N","Tom",0,null,0,"",3,1,4.08]
[{"$f":"Quaddick!B7","v":6},{"$f":"Quaddick!C7","v":"N"},{"$f":"Quaddick!D7","v":"Jack"},{"$f":"Quaddick!N7","v":6.43},null,0,"N","X",0,null,0,"",4,2,14.14,null,{"$f":"'West Hill'!B7","v":2},{"$f":"'West Hill'!C7","v":"N"},{"$f":"'West Hill'!D7","v":"Jack"},{"$f":"'West Hill'!N7","v":4.7699999999999996},null,0,"N","X",0,null,0,"",4,9,3.2199999999999998]
[{"$f":"Quaddick!B8","v":3},{"$f":"Quaddick!C8","v":"N"},{"$f":"Quaddick!D8","v":"Jason"},{"$f":"Quaddick!N8","v":4.18},null,0,"N","X",0,null,0,"",5,8,12.790000000000001,null,{"$f":"'West Hill'!B8","v":0},{"$f":"'West Hill'!C8","v":"N"},{"$f":"'West Hill'!D8","v":"Jason"},{"$f":"'West Hill'!N8","v":0},null,0,"N","X",0,null,0,"",5,4,3.14]
[{"$f":"Quaddick!B9","v":7},{"$f":"Quaddick!C9","v":"N"},{"$f":"Quaddick!D9","v":"Jim B"},{"$f":"Quaddick!N9","v":4.79},null,0,"N","X",0,null,0,"",6,7,12,null,{"$f":"'West Hill'!B9","v":3},{"$f":"'West Hill'!C9","v":"N"},{"$f":"'West Hill'!D9","v":"Jim B"},{"$f":"'West Hill'!N9","v":0},null,0,"N","X",0,null,0,"",6,3,2.02]
[{"$f":"Quaddick!B10","v":0},{"$f":"Quaddick!C10","v":"N"},{"$f":"Quaddick!D10","v":"Kam"},{"$f":"Quaddick!N10","v":0},null,0,"N","X",0,null,0,"",7,5,10.3,null,{"$f":"'West Hill'!B10","v":9},{"$f":"'West Hill'!C10","v":"N"},{"$f":"'West Hill'!D10","v":"Kam"},{"$f":"'West Hill'!N10","v":1.3},null,0,"N","X",0,null,0,"",7,6,2.0125000000000002]
[{"$f":"Quaddick!B11","v":8},{"$f":"Quaddick!C11","v":"N"},{"$f":"Quaddick!D11","v":"Kevin"},{"$f":"Quaddick!N11","v":9.07},null,0,"N","X",0,null,0,"",8,6,9.9,null,{"$f":"'West Hill'!B11","v":9},{"$f":"'West Hill'!C11","v":"N"},{"$f":"'West Hill'!D11","v":"Kevin"},{"$f":"'West Hill'!N11","v":1.92},null,0,"N","X",0,null,0,"",8,8,1.56]
[{"$f":"Quaddick!B12","v":1},{"$f":"Quaddick!C12","v":"N"},{"$f":"Quaddick!D12","v":"Mike G"},{"$f":"Quaddick!N12","v":4.75},null,1,"N","Mike G",4.75,null,14.61,2,9,3,4.18,null,{"$f":"'West Hill'!B12","v":7},{"$f":"'West Hill'!C12","v":"N"},{"$f":"'West Hill'!D12","v":"Mike G"},{"$f":"'West Hill'!N12","v":1.17},null,0,"N","X",0,null,0,"",9,5,0.74]
[{"$f":"Quaddick!B13","v":8},{"$f":"Quaddick!C13","v":"N"},{"$f":"Quaddick!D13","v":"Morrie"},{"$f":"Quaddick!N13","v":3.72},null,1,"N","Steve D",9.86,null,0,"","",0,0,null,{"$f":"'West Hill'!B13","v":8},{"$f":"'West Hill'!C13","v":"N"},{"$f":"'West Hill'!D13","v":"Morrie"},{"$f":"'West Hill'!N13","v":0.75},null,1,"N","Dean",3.21,null,4.08,3,"",0,0]
[{"$f":"Quaddick!B14","v":5},{"$f":"Quaddick!C14","v":"N"},{"$f":"Quaddick!D14","v":"Oz"},{"$f":"Quaddick!N14","v":1.87},null,2,"N","Pete",4.29,null,14.14,4,"",0,0,null,{"$f":"'West Hill'!B14","v":8},{"$f":"'West Hill'!C14","v":"N"},{"$f":"'West Hill'!D14","v":"Oz"},{"$f":"'West Hill'!N14","v":0.81},null,1,"N","Pete",0.87,null,0,"","",0,0]
[{"$f":"Quaddick!B15","v":2},{"$f":"Quaddick!C15","v":"N"},{"$f":"Quaddick!D15","v":"Pete"},{"$f":"Quaddick!N15","v":4.29},null,2,"N","Scott",9.85,null,0,"","",0,0,null,{"$f":"'West Hill'!B15","v":1},{"$f":"'West Hill'!C15","v":"N"},{"$f":"'West Hill'!D15","v":"Pete"},{"$f":"'West Hill'!N15","v":0.87},null,2,"N","Jack",4.7699999999999996,null,8.94,1,"",0,0]
[{"$f":"Quaddick!B16","v":0},{"$f":"Quaddick!C16","v":"N"},{"$f":"Quaddick!D16","v":"Rich B"},{"$f":"Quaddick!N16","v":0},null,3,"N","Anthony",0,null,4.18,9,"",0,0,null,{"$f":"'West Hill'!B16","v":3},{"$f":"'West Hill'!C16","v":"N"},{"$f":"'West Hill'!D16","v":"Rich B"},{"$f":"'West Hill'!N16","v":2.02},null,2,"N","Rich T",4.17,null,0,"","",0,0]
[{"$f":"Quaddick!B17","v":6},{"$f":"Quaddick!C17","v":"N"},{"$f":"Quaddick!D17","v":"Rich M"},{"$f":"Quaddick!N17","v":3.47},null,3,"N","Jason",4.18,null,0,"","",0,0,null,{"$f":"'West Hill'!B17","v":5},{"$f":"'West Hill'!C17","v":"N"},{"$f":"'West Hill'!D17","v":"Rich M"},{"$f":"'West Hill'!N17","v":0},null,3,"N","Jim B",0,null,2.02,6,"",0,0]
[{"$f":"Quaddick!B18","v":4},{"$f":"Quaddick!C18","v":"N"},{"$f":"Quaddick!D18","v":"Rich T"},{"$f":"Quaddick!N18","v":8.41},null,4,"N","Rich T",8.41,null,17.54,1,"",0,0,null,{"$f":"'West Hill'!B18","v":2},{"$f":"'West Hill'!C18","v":"N"},{"$f":"'West Hill'!D18","v":"Rich T"},{"$f":"'West Hill'!N18","v":4.17},null,3,"N","Rich B",2.02,null,0,"","",0,0]
[{"$f":"Quaddick!B19","v":9},{"$f":"Quaddick!C19","v":"N"},{"$f":"Quaddick!D19","v":"Ryan"},{"$f":"Quaddick!N19","v":5.79},null,4,"N","Steve S",9.1300000000000008,null,0,"","",0,0,null,{"$f":"'West Hill'!B19","v":4},{"$f":"'West Hill'!C19","v":"N"},{"$f":"'West Hill'!D19","v":"Ryan"},{"$f":"'West Hill'!N19","v":1.54},null,4,"N","Ryan",1.54,null,3.14,5,"",0,0]
[{"$f":"Quaddick!B20","v":2},{"$f":"Quaddick!C20","v":"N"},{"$f":"Quaddick!D20","v":"Scott"},{"$f":"Quaddick!N20","v":9.85},null,5,"N","Dean",8.4300000000000015,null,10.3,7,"",0,0,null,{"$f":"'West Hill'!B20","v":6},{"$f":"'West Hill'!C20","v":"y"},{"$f":"'West Hill'!D20","v":"Scott"},{"$f":"'West Hill'!N20","v":0.78},null,4,"N","Steve D",1.6,null,0,"","",0,0]
[{"$f":"Quaddick!B21","v":1},{"$f":"Quaddick!C21","v":"N"},{"$f":"Quaddick!D21","v":"Steve D"},{"$f":"Quaddick!N21","v":9.86},null,5,"N","Oz",1.87,null,0,"","",1,0,null,{"$f":"'West Hill'!B21","v":4},{"$f":"'West Hill'!C21","v":"N"},{"$f":"'West Hill'!D21","v":"Steve D"},{"$f":"'West Hill'!N21","v":1.6},null,5,"N","Rich M",0,null,0.74,9,"",0,0]
[{"$f":"Quaddick!B22","v":4},{"$f":"Quaddick!C22","v":"N"},{"$f":"Quaddick!D22","v":"Steve S"},{"$f":"Quaddick!N22","v":9.1300000000000008},null,6,"N","Jack",6.43,null,9.9,8,"",2,0,null,{"$f":"'West Hill'!B22","v":5},{"$f":"'West Hill'!C22","v":"N"},{"$f":"'West Hill'!D22","v":"Steve S"},{"$f":"'West Hill'!N22","v":0.74},null,5,"N","Steve S",0.74,null,0,"","",1,0]
[{"$f":"Quaddick!B23","v":7},{"$f":"Quaddick!C23","v":"N"},{"$f":"Quaddick!D23","v":"Tom"},{"$f":"Quaddick!N23","v":7.21},null,6,"N","Rich M",3.47,null,0,"","",3,0,null,{"$f":"'West Hill'!B23","v":0},{"$f":"'West Hill'!C23","v":"N"},{"$f":"'West Hill'!D23","v":"Tom"},{"$f":"'West Hill'!N23","v":0},null,6,"y","Scott",0.78,null,2.0125000000000002,7,"",2,0]
[{"$f":"Quaddick!B24","v":0},{"$f":"Quaddick!C24","v":"N"},{"$f":"Quaddick!D24","v":"X"},{"$f":"Quaddick!N24","v":0},null,7,"N","Jim B",4.79,null,12,6,"",4,0,null,{"$f":"'West Hill'!B24","v":0},{"$f":"'West Hill'!C24","v":"N"},{"$f":"'West Hill'!D24","v":"X"},{"$f":"'West Hill'!N24","v":0},null,7,"N","Armand",3.21,null,4.38,2,"",3,0]
[{"$f":"Quaddick!B25","v":0},{"$f":"Quaddick!C25","v":"N"},{"$f":"Quaddick!D25","v":"X"},{"$f":"Quaddick!N25","v":0},null,7,"N","Tom",7.21,null,0,"","",5,0,null,{"$f":"'West Hill'!B25","v":0},{"$f":"'West Hill'!C25","v":"N"},{"$f":"'West Hill'!D25","v":"X"},{"$f":"'West Hill'!N25","v":0},null,7,"N","Mike G",1.17,null,0,"","",4,0]
[{"$f":"Quaddick!B26","v":0},{"$f":"Quaddick!C26","v":"N"},{"$f":"Quaddick!D26","v":"X"},{"$f":"Quaddick!N26","v":0},null,8,"N","Kevin",9.07,null,12.790000000000001,5,"",6,0,null,{"$f":"'West Hill'!B26","v":0},{"$f":"'West Hill'!C26","v":"N"},{"$f":"'West Hill'!D26","v":"X"},{"$f":"'West Hill'!N26","v":0},null,8,"N","Morrie",0.75,null,1.56,8,"",5,0]
[{"$f":"Quaddick!B27","v":0},{"$f":"Quaddick!C27","v":"N"},{"$f":"Quaddick!D27","v":"X"},{"$f":"Quaddick!N27","v":0},null,8,"N","Morrie",3.72,null,0,"","",7,0,null,{"$f":"'West Hill'!B27","v":0},{"$f":"'West Hill'!C27","v":"N"},{"$f":"'West Hill'!D27","v":"X"},{"$f":"'West Hill'!N27","v":0},null,8,"N","Oz",0.81,null,0,"","",7,0]
[{"$f":"Quaddick!B28","v":0},{"$f":"Quaddick!C28","v":"N"},{"$f":"Quaddick!D28","v":"X"},{"$f":"Quaddick!N28","v":0},null,9,"N","Armand",8.56,null,14.350000000000001,3,"",8,0,null,{"$f":"'West Hill'!B28","v":0},{"$f":"'West Hill'!C28","v":"N"},{"$f":"'West Hill'!D28","v":"X"},{"$f":"'West Hill'!N28","v":0},null,9,"N","Kam",1.3,null,3.2199999999999998,4,"",8,0]
[{"$f":"Quaddick!B29","v":0},{"$f":"Quaddick!C29","v":"N"},{"$f":"Quaddick!D29","v":"X"},{"$f":"Quaddick!N29","v":0},null,9,"N","Ryan",5.79,null,0,"","",9,0,null,{"$f":"'West Hill'!B29","v":0},{"$f":"'West Hill'!C29","v":"N"},{"$f":"'West Hill'!D29","v":"X"},{"$f":"'West Hill'!N29","v":0},null,9,"N","Kevin",1.92,null,0,"","",9,0]
[null,"Macro","CTL+H","Teams",3,null,null,"NB Avg",{"$f":"Quaddick!Q31","v":4.7155555555555555},null,null,null,null,null,null,null,null,"Macro","CTL+E","Teams",7,null,null,"NB Avg",{"$f":"'West Hill'!Q31","v":1.2324999999999999}]
[]
[{"$f":"YTD!L18","v":"Candlewood"},null,null,null,null,null,null,null,null,null,null,null,"Sort","Copy","Sort",null,{"$f":"YTD!L22","v":"Moodus"},null,null,null,null,null,null,null,null,null,null,null,"Sort","Copy","Sort"]
["Team #","Alone?","Name","Net Wt",null,"Team #","Alone?","Name","Net Wt",null,"Totals","Rank","Rank","Team #","Tot Wt",null,"Team #","Alone?","Name","Net Wt",null,"Team #","Alone?","Name","Net Wt",null,"Totals","Rank","Rank","Team #","Tot Wt"]
[{"$f":"Candlewood!B4","v":5},{"$f":"Candlewood!C4","v":"N"},{"$f":"Candlewood!D4","v":"Anthony"},{"$f":"Candlewood!N4","v":1.83},null,0,"N","Armand",0,null,{"$f":"IF(F94=20,0,IF(F94=F95,I94+I95,IF(G94=\"Y\",I94+I$120,0)))","v":0},{"$f":"IF(K94>0,RANK(K94,K$94:K$119,0),\"\")","v":""},1,1,22.009999999999998,null,{"$f":"Moodus!B4","v":0},{"$f":"Moodus!C4","v":"N"},{"$f":"Moodus!D4","v":"Anthony"},{"$f":"Moodus!N4","v":0},null,0,"N","Anthony",0,null,{"$f":"IF(V94=20,0,IF(V94=V95,Y94+Y95,IF(W94=\"Y\",Y94+Y$120,0)))","v":0},{"$f":"IF(AA94>0,RANK(AA94,AA$94:AA$119,0),\"\")","v":""},1,4,12.23]
[{"$f":"Candlewood!B5","v":0},{"$f":"Candlewood!C5","v":"N"},{"$f":"Candlewood!D5","v":"Armand"},{"$f":"Candlewood!N5","v":0},null,0,"N","Jim B",0,null,{"$f":"IF(F95=20,0,IF(F95=F96,I95+I96,IF(G95=\"Y\",I95+I$120,0)))","v":0},{"$f":"IF(K95>0,RANK(K95,K$94:K$119,0),\"\")","v":""},2,8,21.36,null,{"$f":"Moodus!B5","v":3},{"$f":"Moodus!C5","v":"N"},{"$f":"Moodus!D5","v":"Armand"},{"$f":"Moodus!N5","v":3.28},null,0,"N","Jason",0,null,{"$f":"IF(V95=20,0,IF(V95=V96,Y95+Y96,IF(W95=\"Y\",Y95+Y$120,0)))","v":0},{"$f":"IF(AA95>0,RANK(AA95,AA$94:AA$119,0),\"\")","v":""},2,6,4.8]
[{"$f":"Candlewood!B6","v":5},{"$f":"Candlewood!C6","v":"N"},{"$f":"Candlewood!D6","v":"Dean"},{"$f":"Candlewood!N6","v":14.7},null,0,"N","Kam",0,null,0,"",3,9,20.29,null,{"$f":"Moodus!B6","v":8},{"$f":"Moodus!C6","v":"y"},{"$f":"Moodus!D6","v":"Dean"},{"$f":"Moodus!N6","v":2.2799999999999998},null,0,"N","Mike G",0,null,0,"",3,5,4.6899999999999995]
[{"$f":"Candlewood!B7","v":1},{"$f":"Candlewood!C7","v":"N"},{"$f":"Candlewood!D7","v":"Jack"},{"$f":"Candlewood!N7","v":9.3699999999999992},null,0,"N","Morrie",0,null,0,"",4,7,17.381428571428572,null,{"$f":"Moodus!B7","v":5},{"$f":"Moodus!C7","v":"N"},{"$f":"Moodus!D7","v":"Jack"},{"$f":"Moodus!N7","v":3.84},null,0,"N","Rich T",0,null,0,"",4,3,4.04]
[{"$f":"Candlewood!B8","v":6},{"$f":"Candlewood!C8","v":"N"},{"$f":"Candlewood!D8","v":"Jason"},{"$f":"Candlewood!N8","v":3.54},null,0,"N","X",0,null,0,"",5,5,16.53,null,{"$f":"Moodus!B8","v":0},{"$f":"Moodus!C8","v":"N"},{"$f":"Moodus!D8","v":"Jason"},{"$f":"Moodus!N8","v":0},null,0,"N","Tom",0,null,0,"",5,8,3.9357142857142855]
[{"$f":"Candlewood!B9","v":0},{"$f":"Candlewood!C9","v":"N"},{"$f":"Candlewood!D9","v":"Jim B"},{"$f":"Candlewood!N9","v":0},null,0,"N","X",0,null,0,"",6,4,15.5,null,{"$f":"Moodus!B9","v":1},{"$f":"Moodus!C9","v":"N"},{"$f":"Moodus!D9","v":"Jim B"},{"$f":"Moodus!N9","v":0.77},null,0,"N","X",0,null,0,"",6,2,3.3]
[{"$f":"Candlewood!B10","v":0},{"$f":"Candlewood!C10","v":"N"},{"$f":"Candlewood!D10","v":"Kam"},{"$f":"Candlewood!N10","v":0},null,0,"N","X",0,null,0,"",7,3,14.551428571428572,null,{"$f":"Moodus!B10","v":5},{"$f":"Moodus!C10","v":"N"},{"$f":"Moodus!D10","v":"Kam"},{"$f":"Moodus!N10","v":0.85},null,0,"N","X",0,null,0,"",7,1,2.99]
[{"$f":"Candlewood!B11","v":9},{"$f":"Candlewood!C11","v":"N"},{"$f":"Candlewood!D11","v":"Kevin"},{"$f":"Candlewood!N11","v":9.52},null,0,"N","X",0,null,0,"",8,6,10.469999999999999,null,{"$f":"Moodus!B11","v":1},{"$f":"Moodus!C11","v":"N"},{"$f":"Moodus!D11","v":"Kevin"},{"$f":"Moodus!N11","v":2.2200000000000002},null,0,"N","X",0,null,0,"",8,7,2.73]
[{"$f":"Candlewood!B12","v":2},{"$f":"Candlewood!C12","v":"N"},{"$f":"Candlewood!D12","v":"Mike G"},{"$f":"Candlewood!N12","v":5.4},null,0,"N","X",0,null,0,"",9,2,9.9700000000000006,null,{"$f":"Moodus!B12","v":0},{"$f":"Moodus!C12","v":"N"},{"$f":"Moodus!D12","v":"Mike G"},{"$f":"Moodus!N12","v":0},null,0,"N","X",0,null,0,"","",0,0]
[{"$f":"Candlewood!B13","v":0},{"$f":"Candlewood!C13","v":"N"},{"$f":"Candlewood!D13","v":"Morrie"},{"$f":"Candlewood!N13","v":0},null,0,"N","X",0,null,0,"","",0,0,null,{"$f":"Moodus!B13","v":2},{"$f":"Moodus!C13","v":"N"},{"$f":"Moodus!D13","v":"Morrie"},{"$f":"Moodus!N13","v":0},null,0,"N","X",0,null,0,"","",0,0]
[{"$f":"Candlewood!B14","v":8},{"$f":"Candlewood!C14","v":"N"},{"$f":"Candlewood!D14","v":"Oz"},{"$f":"Candlewood!N14","v":8.09},null,1,"N","Jack",9.3699999999999992,null,22.009999999999998,1,"",0,0,null,{"$f":"Moodus!B14","v":3},{"$f":"Moodus!C14","v":"N"},{"$f":"Moodus!D14","v":"Oz"},{"$f":"Moodus!N14","v":0.76},null,0,"N","X",0,null,0,"","",0,0]
[{"$f":"Candlewood!B15","v":4},{"$f":"Candlewood!C15","v":"N"},{"$f":"Candlewood!D15","v":"Pete"},{"$f":"Candlewood!N15","v":9.16},null,1,"N","Rich T",12.64,null,0,"","",0,0,null,{"$f":"Moodus!B15","v":6},{"$f":"Moodus!C15","v":"N"},{"$f":"Moodus!D15","v":"Pete"},{"$f":"Moodus!N15","v":1.53},null,1,"N","Jim B",0.77,null,2.99,7,"",0,0]
[{"$f":"Candlewood!B16","v":4},{"$f":"Candlewood!C16","v":"N"},{"$f":"Candlewood!D16","v":"Rich B"},{"$f":"Candlewood!N16","v":6.34},null,2,"N","Mike G",5.4,null,9.9700000000000006,9,"",0,0,null,{"$f":"Moodus!B16","v":4},{"$f":"Moodus!C16","v":"N"},{"$f":"Moodus!D16","v":"Rich B"},{"$f":"Moodus!N16","v":1.65},null,1,"N","Kevin",2.2200000000000002,null,0,"","",0,0]
[{"$f":"Candlewood!B17","v":6},{"$f":"Candlewood!C17","v":"N"},{"$f":"Candlewood!D17","v":"Rich M"},{"$f":"Candlewood!N17","v":6.93},null,2,"N","Steve S",4.57,null,0,"","",0,0,null,{"$f":"Moodus!B17","v":2},{"$f":"Moodus!C17","v":"N"},{"$f":"Moodus!D17","v":"Rich M"},{"$f":"Moodus!N17","v":3.3},null,2,"N","Morrie",0,null,3.3,6,"",0,0]
[{"$f":"Candlewood!B18","v":1},{"$f":"Candlewood!C18","v":"N"},{"$f":"Candlewood!D18","v":"Rich T"},{"$f":"Candlewood!N18","v":12.64},null,3,"Y","Scott",6.72,null,14.551428571428572,7,"",0,0,null,{"$f":"Moodus!B18","v":0},{"$f":"Moodus!C18","v":"N"},{"$f":"Moodus!D18","v":"Rich T"},{"$f":"Moodus!N18","v":0},null,2,"N","Rich M",3.3,null,0,"","",0,0]
[{"$f":"Candlewood!B19","v":9},{"$f":"Candlewood!C19","v":"N"},{"$f":"Candlewood!D19","v":"Ryan"},{"$f":"Candlewood!N19","v":10.770000000000001},null,4,"N","Pete",9.16,null,15.5,6,"",0,0,null,{"$f":"Moodus!B19","v":7},{"$f":"Moodus!C19","v":"N"},{"$f":"Moodus!D19","v":"Ryan"},{"$f":"Moodus!N19","v":2.73},null,3,"N","Armand",3.28,null,4.04,4,"",0,0]
[{"$f":"Candlewood!B20","v":3},{"$f":"Candlewood!C20","v":"Y"},{"$f":"Candlewood!D20","v":"Scott"},{"$f":"Candlewood!N20","v":6.72},null,4,"N","Rich B",6.34,null,0,"","",0,0,null,{"$f":"Moodus!B20","v":4},{"$f":"Moodus!C20","v":"N"},{"$f":"Moodus!D20","v":"Scott"},{"$f":"Moodus!N20","v":10.58},null,3,"N","Oz",0.76,null,0,"","",0,0]
[{"$f":"Candlewood!B21","v":8},{"$f":"Candlewood!C21","v":"N"},{"$f":"Candlewood!D21","v":"Steve D"},{"$f":"Candlewood!N21","v":13.27},null,5,"N","Anthony",1.83,null,16.53,5,"",0,0,null,{"$f":"Moodus!B21","v":6},{"$f":"Moodus!C21","v":"N"},{"$f":"Moodus!D21","v":"Steve D"},{"$f":"Moodus!N21","v":3.27},null,4,"N","Rich B",1.65,null,12.23,1,"",0,0]
[{"$f":"Candlewood!B22","v":2},{"$f":"Candlewood!C22","v":"N"},{"$f":"Candlewood!D22","v":"Steve S"},{"$f":"Candlewood!N22","v":4.57},null,5,"N","Dean",14.7,null,0,"","",0,0,null,{"$f":"Moodus!B22","v":7},{"$f":"Moodus!C22","v":"N"},{"$f":"Moodus!D22","v":"Steve S"},{"$f":"Moodus!N22","v":0},null,4,"N","Scott",10.58,null,0,"","",0,0]
[{"$f":"Candlewood!B23","v":7},{"$f":"Candlewood!C23","v":"Y"},{"$f":"Candlewood!D23","v":"Tom"},{"$f":"Candlewood!N23","v":9.5500000000000007},null,6,"N","Jason",3.54,null,10.469999999999999,8,"",1,0,null,{"$f":"Moodus!B23","v":0},{"$f":"Moodus!C23","v":"N"},{"$f":"Moodus!D23","v":"Tom"},{"$f":"Moodus!N23","v":0},null,5,"N","Jack",3.84,null,4.6899999999999995,3,"",1,0]
[{"$f":"Candlewood!B24","v":0},{"$f":"Candlewood!C24","v":"N"},{"$f":"Candlewood!D24","v":"X"},{"$f":"Candlewood!N24","v":0},null,6,"N","Rich M",6.93,null,0,"","",2,0,null,{"$f":"Moodus!B24","v":0},{"$f":"Moodus!C24","v":"N"},{"$f":"Moodus!D24","v":"X"},{"$f":"Moodus!N24","v":0},null,5,"N","Kam",0.85,null,0,"","",2,0]
[{"$f":"Candlewood!B25","v":0},{"$f":"Candlewood!C25","v":"N"},{"$f":"Candlewood!D25","v":"X"},{"$f":"Candlewood!N25","v":0},null,7,"Y","Tom",9.5500000000000007,null,17.381428571428572,4,"",4,0,null,{"$f":"Moodus!B25","v":0},{"$f":"Moodus!C25","v":"N"},{"$f":"Moodus!D25","v":"X"},{"$f":"Moodus!N25","v":0},null,6,"N","Pete",1.53,null,4.8,2,"",3,0]
[{"$f":"Candlewood!B26","v":0},{"$f":"Candlewood!C26","v":"N"},{"$f":"Candlewood!D26","v":"X"},{"$f":"Candlewood!N26","v":0},null,8,"N","Oz",8.09,null,21.36,2,"",5,0,null,{"$f":"Moodus!B26","v":0},{"$f":"Moodus!C26","v":"N"},{"$f":"Moodus!D26","v":"X"},{"$f":"Moodus!N26","v":0},null,6,"N","Steve D",3.27,null,0,"","",4,0]
[{"$f":"Candlewood!B27","v":0},{"$f":"Candlewood!C27","v":"N"},{"$f":"Candlewood!D27","v":"X"},{"$f":"Candlewood!N27","v":0},null,8,"N","Steve D",13.27,null,0,"","",6,0,null,{"$f":"Moodus!B27","v":0},{"$f":"Moodus!C27","v":"N"},{"$f":"Moodus!D27","v":"X"},{"$f":"Moodus!N27","v":0},null,7,"N","Ryan",2.73,null,2.73,8,"",5,0]
[{"$f":"Candlewood!B28","v":0},{"$f":"Candlewood!C28","v":"N"},{"$f":"Candlewood!D28","v":"X"},{"$f":"Candlewood!N28","v":0},null,9,"N","Kevin",9.52,null,20.29,3,"",8,0,null,{"$f":"Moodus!B28","v":0},{"$f":"Moodus!C28","v":"N"},{"$f":"Moodus!D28","v":"X"},{"$f":"Moodus!N28","v":0},null,7,"N","Steve S",0,null,0,"","",6,0]
[{"$f":"Candlewood!B29","v":0},{"$f":"Candlewood!C29","v":"N"},{"$f":"Candlewood!D29","v":"X"},{"$f":"Candlewood!N29","v":0},null,9,"N","Ryan",10.770000000000001,null,0,"","",9,0,null,{"$f":"Moodus!B29","v":0},{"$f":"Moodus!C29","v":"N"},{"$f":"Moodus!D29","v":"X"},{"$f":"Moodus!N29","v":0},null,8,"y","Dean",2.2799999999999998,null,3.9357142857142855,5,"",7,0]
[null,"Macro","CTL+N","Teams",4,null,null,"NB Avg",{"$f":"Candlewood!Q31","v":7.8314285714285718},null,null,null,null,null,null,null,null,"Macro","CTL+Q","Teams",8,null,null,"NB Avg",{"$f":"Moodus!Q31","v":1.6557142857142857}]

{"sheet":"Report","index":9,"n_rows":34,"n_cols":12,"rows_kept":34,"cut":false,"hidden":false,"merged":[[48,0,48,2],[2,10,2,11],[2,4,2,8],[2,0,2,2],[27,5,27,6],[30,5,30,6],[25,5,25,6],[25,7,25,8],[26,5,26,6],[28,5,28,6],[29,5,29,6],[30,7,30,8],[31,7,31,8],[31,5,31,6],[32,5,32,6],[33,5,33,6],[32,7,32,8],[33,7,33,8],[0,0,0,11],[26,7,26,8],[28,7,28,8],[29,7,29,8],[27,7,27,8]]}
["MVBC 2017 Year-To-Date Report"]
[]
["Individual Standings",null,null,null,"Lunkers",null,null,null,null,null,"Individual Adj'd Total Weight"]
["Name","Position","Points",null,"Lake / River","Name","Weight","Species","Trophy",null,"Name","Adj'd Weight"]
[{"$f":"YTD!E15","v":"Dean"},{"$f":"YTD!F15","v":1},{"$f":"YTD!G15","v":20},null,{"$f":"YTD!L15","v":"Bantam"},{"$f":"IF(YTD!A103=\"X\",\"N/A\",YTD!A103)","v":"Armand"},{"$f":"YTD!B103","v":4.05},{"$f":"IF(YTD!C103=0,\"N/A\",YTD!C103)","v":"SMB"},{"$f":"IF((H5=\"LMB\")*AND(G5>=6),\"Yes\",IF((H5=\"SMB\")*AND(G5>=4),\"Yes\",\"No\"))","v":"Yes"},null,{"$f":"YTD!S49","v":"Dean"},{"$f":"YTD!T49","v":59.019999999999989}]
[{"$f":"YTD!E16","v":"Armand"},{"$f":"YTD!F16","v":2},{"$f":"YTD!G16","v":22},null,{"$f":"YTD!L16","v":"McDonough"},{"$f":"IF(YTD!D103=\"X\",\"N/A\",YTD!D103)","v":"Ryan"},{"$f":"YTD!E103","v":3.97},{"$f":"IF(YTD!F103=0,\"N/A\",YTD!F103)","v":"LMB"},{"$f":"IF((H6=\"LMB\")*AND(G6>=6),\"Yes\",IF((H6=\"SMB\")*AND(G6>=4),\"Yes\",\"No\"))","v":"No"},null,{"$f":"YTD!S54","v":"Kevin"},{"$f":"YTD!T54","v":51.49}]
[{"$f":"YTD!E17","v":"Steve D"},{"$f":"YTD!F17","v":3},{"$f":"YTD!G17","v":23},null,{"$f":"YTD!L17","v":"Quaddick"},{"$f":"IF(YTD!G103=\"X\",\"N/A\",YTD!G103)","v":"Tom"},{"$f":"YTD!H103","v":5.36},{"$f":"IF(YTD!I103=0,\"N/A\",YTD!I103)","v":"lmb"},"No",null,{"$f":"YTD!S64","v":"Steve D"},{"$f":"YTD!T64","v":51.320000000000007}]
[{"$f":"YTD!E18","v":"Jack"},{"$f":"YTD!F18","v":4},{"$f":"YTD!G18","v":25},null,{"$f":"YTD!L18","v":"Candlewood"},{"$f":"IF(YTD!J103=\"X\",\"N/A\",YTD!J103)","v":"Dean"},{"$f":"YTD!K103","v":3.91},{"$f":"IF(YTD!L103=0,\"N/A\",YTD!L103)","v":"LMB "},"No",null,{"$f":"YTD!S50","v":"Jack"},{"$f":"YTD!T50","v":50.56}]
[{"$f":"YTD!E19","v":"Kevin"},{"$f":"YTD!F19","v":5},{"$f":"YTD!G19","v":28},null,{"$f":"YTD!L19","v":"Lillinonah"},{"$f":"IF(YTD!M103=\"X\",\"N/A\",YTD!M103)","v":"Dean"},{"$f":"YTD!N103","v":3.94},{"$f":"IF(YTD!O103=0,\"N/A\",YTD!O103)","v":"LMB"},{"$f":"IF((H9=\"LMB\")*AND(G9>=6),\"Yes\",IF((H9=\"SMB\")*AND(G9>=4),\"Yes\",\"No\"))","v":"No"},null,{"$f":"YTD!S63","v":"Scott"},{"$f":"YTD!T63","v":48.11}]
[{"$f":"YTD!E20","v":"Ryan"},{"$f":"YTD!F20","v":6},{"$f":"YTD!G20","v":29},null,{"$f":"YTD!L20","v":"CT River"},{"$f":"IF(YTD!P103=\"X\",\"N/A\",YTD!P103)","v":"N/A"},{"$f":"YTD!Q103","v":3.58},{"$f":"IF(YTD!R103=0,\"N/A\",YTD!R103)","v":"LMB"},{"$f":"IF((H10=\"LMB\")*AND(G10>=6),\"Yes\",IF((H10=\"SMB\")*AND(G10>=4),\"Yes\",\"No\"))","v":"No"},null,{"$f":"YTD!S62","v":"Ryan"},{"$f":"YTD!T62","v":45.679999999999993}]
[{"$f":"YTD!E21","v":"Scott"},{"$f":"YTD!F21","v":7},{"$f":"YTD!G21","v":33},null,{"$f":"YTD!L21","v":"West Hill"},{"$f":"IF(YTD!S103=\"X\",\"N/A\",YTD!S103)","v":"Armand"},{"$f":"YTD!T103","v":3.21},{"$f":"IF(YTD!U103=0,\"N/A\",YTD!U103)","v":"LMB"},"No",null,{"$f":"YTD!S48","v":"Armand"},{"$f":"YTD!T48","v":42.640000000000008}]
[{"$f":"YTD!E22","v":"Rich T"},{"$f":"YTD!F22","v":8},{"$f":"YTD!G22","v":42},null,{"$f":"YTD!L22","v":"Moodus"},{"$f":"IF(YTD!V103=\"X\",\"N/A\",YTD!V103)","v":"Scott"},{"$f":"YTD!W103","v":6.84},{"$f":"IF(YTD!X103=0,\"N/A\",YTD!X103)","v":"LMB"},{"$f":"IF((H12=\"LMB\")*AND(G12>=6),\"Yes\",IF((H12=\"SMB\")*AND(G12>=4),\"Yes\",\"No\"))","v":"Yes"},null,{"$f":"YTD!S58","v":"Pete"},{"$f":"YTD!T58","v":40.28}]
[{"$f":"YTD!E23","v":"Pete"},{"$f":"YTD!F23","v":9},{"$f":"YTD!G23","v":46},null,null,null,null,null,null,null,{"$f":"YTD!S61","v":"Rich T"},{"$f":"YTD!T61","v":37.870000000000005}]
[{"$f":"YTD!E24","v":"Steve S"},{"$f":"YTD!F24","v":10},{"$f":"YTD!G24","v":50},null,"Statistics",null,null,null,null,null,{"$f":"YTD!S65","v":"Steve S"},{"$f":"YTD!T65","v":35.520000000000003}]
[{"$f":"YTD!E25","v":"Rich B"},{"$f":"YTD!F25","v":11},{"$f":"YTD!G25","v":51},null,"Lake / River","Anglers","Fish","Total Wt","Avg Wt",null,{"$f":"YTD!S66","v":"Tom"},{"$f":"YTD!T66","v":26.47}]
[{"$f":"YTD!E26","v":"Rich M"},{"$f":"YTD!F26","v":12},{"$f":"YTD!G26","v":77},null,{"$f":"YTD!L15","v":"Bantam"},{"$f":"Bantam!E30","v":17},{"$f":"Bantam!M30","v":38},{"$f":"Bantam!L30","v":66.39},{"$f":"IF(G16=0,0,H16/G16)","v":1.7471052631578947},null,{"$f":"YTD!S59","v":"Rich B"},{"$f":"YTD!T59","v":26.34}]
[{"$f":"YTD!E27","v":"Oz"},{"$f":"YTD!F27","v":13},{"$f":"YTD!G27","v":79},null,{"$f":"YTD!L16","v":"McDonough"},{"$f":"McDonough!E30","v":16},{"$f":"McDonough!M30","v":71},{"$f":"McDonough!L30","v":113.77000000000001},1.6023943661971833,null,{"$f":"YTD!S51","v":"Jason"},{"$f":"YTD!T51","v":25.05}]
[{"$f":"YTD!E28","v":"Mike G"},{"$f":"YTD!F28","v":14},{"$f":"YTD!G28","v":93},null,{"$f":"YTD!L17","v":"Quaddick"},{"$f":"Quaddick!E30","v":18},{"$f":"Quaddick!M30","v":61},{"$f":"Quaddick!L30","v":110.20999999999998},1.8067213114754095,null,{"$f":"YTD!S60","v":"Rich M"},{"$f":"YTD!T60","v":22.34}]
[{"$f":"YTD!E29","v":"Tom"},{"$f":"YTD!F29","v":15},{"$f":"YTD!G29","v":103},null,{"$f":"YTD!L18","v":"Candlewood"},{"$f":"Candlewood!E30","v":16},{"$f":"Candlewood!M30","v":63},{"$f":"Candlewood!L30","v":132.79999999999998},2.1079365079365076,null,{"$f":"YTD!S52","v":"Jim B"},{"$f":"YTD!T52","v":16.689999999999998}]
[{"$f":"YTD!E30","v":"Jason"},{"$f":"YTD!F30","v":16},{"$f":"YTD!G30","v":105},null,{"$f":"YTD!L19","v":"Lillinonah"},{"$f":"Lillinonah!E30","v":15},{"$f":"Lillinonah!M30","v":58},{"$f":"Lillinonah!L30","v":88.15},1.5198275862068966,null,{"$f":"YTD!S55","v":"Mike G"},{"$f":"YTD!T55","v":15.12}]
[{"$f":"YTD!E31","v":"Jim B"},{"$f":"YTD!F31","v":17},{"$f":"YTD!G31","v":106},null,{"$f":"YTD!L20","v":"CT River"},{"$f":"'CT River'!E30","v":16},{"$f":"'CT River'!M30","v":40},{"$f":"'CT River'!L30","v":59.149999999999991},1.4787499999999998,null,{"$f":"YTD!S57","v":"Oz"},{"$f":"YTD!T57","v":13.97}]
[{"$f":"YTD!E32","v":"Morrie"},{"$f":"YTD!F32","v":18},{"$f":"YTD!G32","v":110},null,{"$f":"YTD!L21","v":"West Hill"},{"$f":"'West Hill'!E30","v":17},{"$f":"'West Hill'!M30","v":26},{"$f":"'West Hill'!L30","v":28.859999999999996},1.1099999999999999,null,{"$f":"YTD!S56","v":"Morrie"},{"$f":"YTD!T56","v":13.51}]
[{"$f":"YTD!E33","v":"Kam"},{"$f":"YTD!F33","v":19},{"$f":"YTD!G33","v":130},null,{"$f":"YTD!L22","v":"Moodus"},{"$f":"Moodus!E30","v":15},{"$f":"Moodus!M30","v":30},{"$f":"Moodus!L30","v":37.06},1.2353333333333334,null,{"$f":"YTD!S53","v":"Kam"},{"$f":"YTD!T53","v":7.06}]
[{"$f":"YTD!E34","v":"Anthony"},21,{"$f":"YTD!G34","v":145},null,null,null,null,null,null,null,{"$f":"YTD!S47","v":"Anthony"},{"$f":"YTD!T47","v":4.95}]
[{"$f":"YTD!E35","v":"X"},{"$f":"YTD!F35","v":21},{"$f":"YTD!G35","v":210},null,"Winning Teams",null,null,null,null,null,{"$f":"YTD!S67","v":"X"},{"$f":"YTD!T67","v":0}]
[{"$f":"YTD!E36","v":"X"},{"$f":"YTD!F36","v":21},{"$f":"YTD!G36","v":210},null,"Lake / River","Team Number",null,"Total Weight",null,null,{"$f":"YTD!S68","v":"X"},{"$f":"YTD!T68","v":0}]
[{"$f":"YTD!E37","v":"X"},{"$f":"YTD!F37","v":21},{"$f":"YTD!G37","v":210},null,{"$f":"YTD!L15","v":"Bantam"},{"$f":"IF(Teams!N4=20,\"N/A\",Teams!N4)","v":5},null,{"$f":"Teams!O4","v":15.74},null,null,{"$f":"YTD!S69","v":"X"},{"$f":"YTD!T69","v":0}]
[{"$f":"YTD!E38","v":"X"},{"$f":"YTD!F38","v":21},{"$f":"YTD!G38","v":210},null,{"$f":"YTD!L16","v":"McDonough"},{"$f":"IF(Teams!N34=20,\"N/A\",Teams!N34)","v":2},null,{"$f":"Teams!O34","v":18.73},null,null,{"$f":"YTD!S70","v":"X"},{"$f":"YTD!T70","v":0}]
[{"$f":"YTD!E39","v":"X"},{"$f":"YTD!F39","v":21},{"$f":"YTD!G39","v":210},null,{"$f":"YTD!L17","v":"Quaddick"},{"$f":"IF(Teams!N64=20,\"N/A\",Teams!N64)","v":4},null,{"$f":"Teams!O64","v":17.54},null,null,{"$f":"YTD!S71","v":"X"},{"$f":"YTD!T71","v":0}]
[{"$f":"YTD!E40","v":"X"},{"$f":"YTD!F40","v":21},{"$f":"YTD!G40","v":210},null,{"$f":"YTD!L18","v":"Candlewood"},{"$f":"IF(Teams!N94=20,\"N/A\",Teams!N94)","v":1},null,{"$f":"Teams!O94","v":22.009999999999998},null,null,{"$f":"YTD!S72","v":"X"},{"$f":"YTD!T72","v":0}]
[null,null,null,null,{"$f":"YTD!L19","v":"Lillinonah"},{"$f":"IF(Teams!AD4=20,\"N/A\",Teams!AD4)","v":8},null,{"$f":"Teams!AE4","v":19.37}]
[null,null,null,null,{"$f":"YTD!L20","v":"CT River"},{"$f":"IF(Teams!AD34=20,\"N/A\",Teams!AD34)","v":3},null,{"$f":"Teams!AE34","v":12.309999999999999}]
[null,null,null,null,{"$f":"YTD!L21","v":"West Hill"},{"$f":"IF(Teams!AD64=20,\"N/A\",Teams!AD64)","v":2},null,{"$f":"Teams!AE64","v":8.94}]
[null,null,null,null,{"$f":"YTD!L22","v":"Moodus"},{"$f":"IF(Teams!AD94=20,\"N/A\",Teams!AD94)","v":4},null,{"$f":"Teams!AE94","v":12.23}]

{"sheet":"YTD","index":10,"n_rows":103,"n_cols":34,"rows_kept":103,"cut":false,"hidden":false,"merged":[[74,15,74,17],[74,18,74,20],[74,21,74,23],[15,11,15,12],[16,11,16,12],[17,11,17,12],[73,0,73,23],[74,0,74,2],[74,3,74,5],[74,6,74,8],[74,9,74,11],[74,12,74,14],[44,8,44,9],[18,11,18,12],[21,11,21,12],[12,22,12,28],[43,0,43,16],[44,18,44,19],[44,0,44,1],[44,6,44,7],[14,11,14,12],[44,2,44,3],[44,4,44,5],[20,11,20,12],[44,10,44,11],[13,8,13,9],[14,18,14,19],[19,11,19,12],[13,18,13,33],[44,12,44,13],[44,14,44,15],[13,11,13,12],[14,32,14,33],[14,20,14,21],[14,22,14,23],[14,26,14,27],[14,28,14,29],[14,30,14,31],[14,24,14,25]]}
[null,{"$f":"P15","v":"Anthony"},{"$f":"P16","v":"Armand"},{"$f":"P17","v":"Dean"},{"$f":"P18","v":"Jack"},{"$f":"P19","v":"Jason"},{"$f":"P20","v":"Jim B"},{"$f":"P21","v":"Kam"},{"$f":"P22","v":"Kevin"},{"$f":"P23","v":"Mike G"},{"$f":"P24","v":"Morrie"},{"$f":"P25","v":"Oz"},{"$f":"P26","v":"Pete"},{"$f":"P27","v":"Rich B"},{"$f":"P28","v":"Rich M"},{"$f":"P29","v":"Rich T"},{"$f":"P30","v":"Ryan"},{"$f":"P31","v":"Scott"},{"$f":"P32","v":"Steve D"},{"$f":"P33","v":"Steve S"},{"$f":"P34","v":"Tom"},{"$f":"P35","v":"X"},{"$f":"P36","v":"X"},{"$f":"P37","v":"X"},{"$f":"P38","v":"X"},{"$f":"P39","v":"X"},{"$f":"P40","v":"X"}]
[null,{"$f":"Bantam!O4","v":14},{"$f":"Bantam!O5","v":1},{"$f":"Candlewood!O6","v":1},{"$f":"'CT River'!O7","v":1},{"$f":"McDonough!O8","v":2},{"$f":"Bantam!O9","v":8},{"$f":"'CT River'!O10","v":5},{"$f":"Lillinonah!O11","v":1},{"$f":"'West Hill'!O12","v":10},{"$f":"'CT River'!O13","v":6},{"$f":"Candlewood!O14","v":9},{"$f":"Lillinonah!O15","v":5},{"$f":"Lillinonah!O16","v":2},{"$f":"Moodus!O17","v":3},{"$f":"'West Hill'!O18","v":2},{"$f":"McDonough!O19","v":1},{"$f":"Moodus!O20","v":1},{"$f":"Quaddick!O21","v":1},{"$f":"Quaddick!O22","v":3},{"$f":"Candlewood!O23","v":5},{"$f":"Bantam!O24","v":35},{"$f":"McDonough!O25","v":35},{"$f":"'CT River'!O26","v":35},{"$f":"Candlewood!O27","v":35},{"$f":"Lillinonah!O28","v":35},{"$f":"Moodus!O29","v":35}]
[null,{"$f":"McDonough!O4","v":15},{"$f":"McDonough!O5","v":3},{"$f":"Bantam!O6","v":2},{"$f":"'West Hill'!O7","v":1},{"$f":"Bantam!O8","v":4},{"$f":"McDonough!O9","v":10},{"$f":"'West Hill'!O10","v":9},{"$f":"Bantam!O11","v":3},{"$f":"Quaddick!O12","v":12},{"$f":"Lillinonah!O13","v":10},{"$f":"Bantam!O14","v":12},{"$f":"Bantam!O15","v":6},{"$f":"'West Hill'!O16","v":5},{"$f":"Lillinonah!O17","v":9},{"$f":"Candlewood!O18","v":3},{"$f":"'CT River'!O19","v":3},{"$f":"Quaddick!O20","v":2},{"$f":"Candlewood!O21","v":2},{"$f":"Lillinonah!O22","v":4},{"$f":"Quaddick!O23","v":8},{"$f":"Quaddick!O24","v":35},{"$f":"Quaddick!O25","v":35},{"$f":"'West Hill'!O26","v":35},{"$f":"'CT River'!O27","v":35},{"$f":"Quaddick!O28","v":35},{"$f":"Bantam!O29","v":35}]
[null,{"$f":"Candlewood!O4","v":16},{"$f":"'West Hill'!O5","v":3},{"$f":"'West Hill'!O6","v":3},{"$f":"Moodus!O7","v":2},{"$f":"Quaddick!O8","v":14},{"$f":"Quaddick!O9","v":11},{"$f":"Moodus!O10","v":11},{"$f":"Quaddick!O11","v":4},{"$f":"Candlewood!O12","v":13},{"$f":"'West Hill'!O13","v":14},{"$f":"'West Hill'!O14","v":12},{"$f":"McDonough!O15","v":7},{"$f":"Bantam!O16","v":9},{"$f":"'CT River'!O17","v":9},{"$f":"Quaddick!O18","v":7},{"$f":"Candlewood!O19","v":4},{"$f":"Lillinonah!O20","v":3},{"$f":"'CT River'!O21","v":2},{"$f":"'CT River'!O22","v":7},{"$f":"Lillinonah!O23","v":12},{"$f":"Moodus!O24","v":35},{"$f":"Candlewood!O25","v":35},{"$f":"Quaddick!O26","v":35},{"$f":"McDonough!O27","v":35},{"$f":"Moodus!O28","v":35},{"$f":"Lillinonah!O29","v":35}]
[null,{"$f":"Quaddick!O4","v":30},{"$f":"Moodus!O5","v":4},{"$f":"McDonough!O6","v":4},{"$f":"Bantam!O7","v":5},{"$f":"Candlewood!O8","v":15},{"$f":"Moodus!O9","v":12},{"$f":"Lillinonah!O10","v":35},{"$f":"Candlewood!O11","v":6},{"$f":"'CT River'!O12","v":14},{"$f":"Quaddick!O13","v":15},{"$f":"Moodus!O14","v":13},{"$f":"Candlewood!O15","v":8},{"$f":"Moodus!O16","v":9},{"$f":"Candlewood!O17","v":10},{"$f":"McDonough!O18","v":7},{"$f":"Moodus!O19","v":6},{"$f":"McDonough!O20","v":5},{"$f":"Moodus!O21","v":5},{"$f":"Bantam!O22","v":11},{"$f":"McDonough!O23","v":13},{"$f":"'West Hill'!O24","v":35},{"$f":"Bantam!O25","v":35},{"$f":"McDonough!O26","v":35},{"$f":"Moodus!O27","v":35},{"$f":"Bantam!O28","v":35},{"$f":"Candlewood!O29","v":35}]
[null,{"$f":"Moodus!O4","v":35},{"$f":"Quaddick!O5","v":5},{"$f":"'CT River'!O6","v":4},{"$f":"Candlewood!O7","v":7},{"$f":"Moodus!O8","v":35},{"$f":"'West Hill'!O9","v":30},{"$f":"Candlewood!O10","v":35},{"$f":"'West Hill'!O11","v":6},{"$f":"Lillinonah!O12","v":14},{"$f":"Moodus!O13","v":30},{"$f":"McDonough!O14","v":16},{"$f":"'CT River'!O15","v":10},{"$f":"Candlewood!O16","v":12},{"$f":"Quaddick!O17","v":16},{"$f":"'CT River'!O18","v":8},{"$f":"Bantam!O19","v":7},{"$f":"Candlewood!O20","v":11},{"$f":"McDonough!O21","v":6},{"$f":"McDonough!O22","v":11},{"$f":"Bantam!O23","v":30},{"$f":"Candlewood!O24","v":35},{"$f":"'CT River'!O25","v":35},{"$f":"Bantam!O26","v":35},{"$f":"Lillinonah!O27","v":35},{"$f":"Candlewood!O28","v":35},{"$f":"McDonough!O29","v":35}]
[null,{"$f":"'West Hill'!O4","v":35},{"$f":"Lillinonah!O5","v":6},{"$f":"Quaddick!O6","v":6},{"$f":"Quaddick!O7","v":9},{"$f":"'West Hill'!O8","v":35},{"$f":"'CT River'!O9","v":35},{"$f":"Quaddick!O10","v":35},{"$f":"Moodus!O11","v":8},{"$f":"Bantam!O12","v":30},{"$f":"Candlewood!O13","v":35},{"$f":"Quaddick!O14","v":17},{"$f":"Moodus!O15","v":10},{"$f":"McDonough!O16","v":14},{"$f":"'West Hill'!O17","v":30},{"$f":"Lillinonah!O18","v":15},{"$f":"'West Hill'!O19","v":8},{"$f":"'CT River'!O20","v":11},{"$f":"'West Hill'!O21","v":7},{"$f":"Candlewood!O22","v":14},{"$f":"Moodus!O23","v":35},{"$f":"McDonough!O24","v":35},{"$f":"'West Hill'!O25","v":35},{"$f":"Moodus!O26","v":35},{"$f":"Bantam!O27","v":35},{"$f":"McDonough!O28","v":35},{"$f":"Quaddick!O29","v":35}]
[null,{"$f":"'CT River'!O4","v":35},{"$f":"'CT River'!O5","v":13},{"$f":"Lillinonah!O6","v":7},{"$f":"Lillinonah!O7","v":11},{"$f":"'CT River'!O8","v":35},{"$f":"Lillinonah!O9","v":35},{"$f":"McDonough!O10","v":35},{"$f":"McDonough!O11","v":9},{"$f":"Moodus!O12","v":35},{"$f":"McDonough!O13","v":35},{"$f":"'CT River'!O14","v":30},{"$f":"'West Hill'!O15","v":11},{"$f":"'CT River'!O16","v":30},{"$f":"McDonough!O17","v":35},{"$f":"Bantam!O18","v":30},{"$f":"Quaddick!O19","v":10},{"$f":"Bantam!O20","v":13},{"$f":"Lillinonah!O21","v":8},{"$f":"'West Hill'!O22","v":15},{"$f":"'West Hill'!O23","v":35},{"$f":"'CT River'!O24","v":35},{"$f":"Lillinonah!O25","v":35},{"$f":"Lillinonah!O26","v":35},{"$f":"'West Hill'!O27","v":35},{"$f":"'CT River'!O28","v":35},{"$f":"'CT River'!O29","v":35}]
[null,{"$f":"Lillinonah!O4","v":35},{"$f":"Candlewood!O5","v":35},{"$f":"Moodus!O6","v":7},{"$f":"McDonough!O7","v":12},{"$f":"Lillinonah!O8","v":35},{"$f":"Candlewood!O9","v":35},{"$f":"Bantam!O10","v":35},{"$f":"'CT River'!O11","v":12},{"$f":"McDonough!O12","v":35},{"$f":"Bantam!O13","v":35},{"$f":"Lillinonah!O14","v":35},{"$f":"Quaddick!O15","v":13},{"$f":"Quaddick!O16","v":35},{"$f":"Bantam!O17","v":35},{"$f":"Moodus!O18","v":35},{"$f":"Lillinonah!O19","v":13},{"$f":"'West Hill'!O20","v":13},{"$f":"Bantam!O21","v":10},{"$f":"Moodus!O22","v":30},{"$f":"'CT River'!O23","v":35},{"$f":"Lillinonah!O24","v":35},{"$f":"Moodus!O25","v":35},{"$f":"Candlewood!O26","v":35},{"$f":"Quaddick!O27","v":35},{"$f":"'West Hill'!O28","v":35},{"$f":"'West Hill'!O29","v":35}]
["Pts. YTD",{"$f":"SUM(B2:B7)","v":145},22,20,25,105,106,130,{"$f":"SUM(I2:I7)","v":28},93,110,79,46,51,77,42,29,{"$f":"SUM(R2:R7)","v":33},23,50,103,210,210,210,210,210,210]
["Position",{"$f":"RANK(B10,Pts._YTD,1)","v":20},2,1,4,16,17,19,5,{"$f":"RANK(J10,Pts._YTD,1)","v":14},18,{"$f":"RANK(L10,Pts._YTD,1)","v":13},9,11,12,8,6,7,{"$f":"RANK(S10,Pts._YTD,1)","v":3},10,15,21,21,21,21,21,21]
[]
[null,null,null,null,null,null,null,null,null,null,null,null,null,null,null,null,null,null,null,null,null,null,"Use macro ctl-f"]
["Name","Position","Pts. YTD",null,"Name","Position","Pts. YTD",null,"Total Weight",null,null,"Lake / River 2017",null,null,null,"Members","NonBoater",null,"Top 3 Finishers for Each Tournament"]
[{"$f":"B1","v":"Anthony"},{"$f":"B11","v":20},{"$f":"B10","v":145},null,"Dean",1,20,null,{"$f":"P15","v":"Anthony"},{"$f":"Moodus!N4+Bantam!N4+'CT River'!N4+Quaddick!N4+'West Hill'!N4+McDonough!N4+Candlewood!N4+Lillinonah!N4","v":4.95},null,"Bantam",null,null,null,"Anthony","Y",null,{"$f":"L15","v":"Bantam"},null,{"$f":"L16","v":"McDonough"},null,{"$f":"L17","v":"Quaddick"},null,{"$f":"L18","v":"Candlewood"},null,{"$f":"L19","v":"Lillinonah"},null,{"$f":"L20","v":"CT River"},null,{"$f":"L21","v":"West Hill"},null,{"$f":"L22","v":"Moodus"}]
[{"$f":"C1","v":"Armand"},{"$f":"C11","v":2},{"$f":"C10","v":22},null,"Armand",2,22,null,"Armand",{"$f":"Moodus!N5+Bantam!N5+'CT River'!N5+Quaddick!N5+'West Hill'!N5+McDonough!N5+Candlewood!N5+Lillinonah!N5","v":42.64},null,"McDonough",null,null,null,"Armand","N",null,{"$f":"Bantam!D5","v":"Armand"},{"$f":"Bantam!O5","v":1},{"$f":"McDonough!D19","v":"Ryan"},{"$f":"McDonough!O19","v":1},{"$f":"Quaddick!D21","v":"Steve D"},{"$f":"Quaddick!O21","v":1},{"$f":"Candlewood!D6","v":"Dean"},{"$f":"Candlewood!O6","v":1},{"$f":"Lillinonah!D11","v":"Kevin"},{"$f":"Lillinonah!O11","v":1},{"$f":"'CT River'!D7","v":"Jack"},{"$f":"'CT River'!O7","v":1},{"$f":"'West Hill'!D7","v":"Jack"},{"$f":"'West Hill'!O7","v":1},{"$f":"Moodus!D20","v":"Scott"},{"$f":"Moodus!O20","v":1}]
[{"$f":"D1","v":"Dean"},{"$f":"D11","v":1},{"$f":"D10","v":20},null,"Steve D",3,23,null,"Dean",{"$f":"Moodus!N6+Bantam!N6+'CT River'!N6+Quaddick!N6+'West Hill'!N6+McDonough!N6+Candlewood!N6+Lillinonah!N6","v":59.019999999999996},null,"Quaddick",null,null,null,"Dean","N",null,{"$f":"Bantam!D6","v":"Dean"},{"$f":"Bantam!O6","v":2},{"$f":"McDonough!D8","v":"Jason"},{"$f":"McDonough!O8","v":2},{"$f":"Quaddick!D20","v":"Scott"},{"$f":"Quaddick!O20","v":2},{"$f":"Candlewood!D21","v":"Steve D"},{"$f":"Candlewood!O21","v":2},{"$f":"Lillinonah!D16","v":"Rich B"},{"$f":"Lillinonah!O16","v":2},{"$f":"'CT River'!D21","v":"Steve D"},{"$f":"'CT River'!O21","v":2},{"$f":"'West Hill'!D18","v":"Rich T"},{"$f":"'West Hill'!O18","v":2},{"$f":"Moodus!D7","v":"Jack"},{"$f":"Moodus!O7","v":2}]
[{"$f":"E1","v":"Jack"},{"$f":"E11","v":4},{"$f":"E10","v":25},null,"Jack",4,25,null,"Jack",{"$f":"Moodus!N7+Bantam!N7+'CT River'!N7+Quaddick!N7+'West Hill'!N7+McDonough!N7+Candlewood!N7+Lillinonah!N7","v":50.56},null,"Candlewood",null,null,null,"Jack","N",null,{"$f":"Bantam!D11","v":"Kevin"},{"$f":"Bantam!O11","v":3},{"$f":"McDonough!D5","v":"Armand"},{"$f":"McDonough!O5","v":3},{"$f":"Quaddick!D22","v":"Steve S"},{"$f":"Quaddick!O22","v":3},{"$f":"Candlewood!D18","v":"Rich T"},{"$f":"Candlewood!O18","v":3},{"$f":"Lillinonah!D20","v":"Scott"},{"$f":"Lillinonah!O20","v":3},{"$f":"'CT River'!D19","v":"Ryan"},{"$f":"'CT River'!O19","v":3},{"$f":"'West Hill'!D6","v":"Dean"},{"$f":"'West Hill'!O6","v":3},{"$f":"Moodus!D17","v":"Rich M"},{"$f":"Moodus!O17","v":3}]
[{"$f":"F1","v":"Jason"},{"$f":"F11","v":16},{"$f":"F10","v":105},null,"Kevin",5,28,null,"Jason",{"$f":"Moodus!N8+Bantam!N8+'CT River'!N8+Quaddick!N8+'West Hill'!N8+McDonough!N8+Candlewood!N8+Lillinonah!N8","v":25.05},null,"Lillinonah",null,null,null,"Jason","N",null,{"$f":"Bantam!D8","v":"Jason"},{"$f":"Bantam!O8","v":4},{"$f":"McDonough!D6","v":"Dean"},{"$f":"McDonough!O6","v":4},{"$f":"Quaddick!D11","v":"Kevin"},{"$f":"Quaddick!O11","v":4},{"$f":"Candlewood!D19","v":"Ryan"},{"$f":"Candlewood!O19","v":4},{"$f":"Lillinonah!D22","v":"Steve S"},{"$f":"Lillinonah!O22","v":4},{"$f":"'CT River'!D6","v":"Dean"},{"$f":"'CT River'!O6","v":4},{"$f":"'West Hill'!D5","v":"Armand"},{"$f":"'West Hill'!O5","v":3},{"$f":"Moodus!D5","v":"Armand"},{"$f":"Moodus!O5","v":4}]
[{"$f":"G1","v":"Jim B"},{"$f":"G11","v":17},{"$f":"G10","v":106},null,"Ryan",6,29,null,"Jim B",{"$f":"Moodus!N9+Bantam!N9+'CT River'!N9+Quaddick!N9+'West Hill'!N9+McDonough!N9+Candlewood!N9+Lillinonah!N9","v":16.690000000000001},null,"CT River",null,null,null,"Jim B","Y",null,{"$f":"Bantam!D7","v":"Jack"},{"$f":"Bantam!O7","v":5},{"$f":"McDonough!D20","v":"Scott"},{"$f":"McDonough!O20","v":5},{"$f":"Quaddick!D5","v":"Armand"},{"$f":"Quaddick!O5","v":5},{"$f":"Candlewood!D23","v":"Tom"},{"$f":"Candlewood!O23","v":5},{"$f":"Lillinonah!D15","v":"Pete"},{"$f":"Lillinonah!O15","v":5},{"$f":"'CT River'!D10","v":"Kam"},{"$f":"'CT River'!O10","v":5},{"$f":"'West Hill'!D16","v":"Rich B"},{"$f":"'West Hill'!O16","v":5},{"$f":"Moodus!D21","v":"Steve D"},{"$f":"Moodus!O21","v":5}]
[{"$f":"H1","v":"Kam"},{"$f":"H11","v":19},{"$f":"H10","v":130},null,"Scott",7,33,null,"Kam",{"$f":"Moodus!N10+Bantam!N10+'CT River'!N10+Quaddick!N10+'West Hill'!N10+McDonough!N10+Candlewood!N10+Lillinonah!N10","v":7.06},null,"West Hill",null,null,null,"Kam","Y",null,{"$f":"Bantam!D15","v":"Pete"},{"$f":"Bantam!O15","v":6},{"$f":"McDonough!D21","v":"Steve D"},{"$f":"McDonough!O21","v":6},{"$f":"Quaddick!D6","v":"Dean"},{"$f":"Quaddick!O6","v":6},{"$f":"Candlewood!D11","v":"Kevin"},{"$f":"Candlewood!O11","v":6},{"$f":"Lillinonah!D5","v":"Armand"},{"$f":"Lillinonah!O5","v":6},{"$f":"'CT River'!D13","v":"Morrie"},{"$f":"'CT River'!O13","v":6},{"$f":"'West Hill'!D11","v":"Kevin"},{"$f":"'West Hill'!O11","v":6},{"$f":"Moodus!D19","v":"Ryan"},{"$f":"Moodus!O19","v":6}]
[{"$f":"I1","v":"Kevin"},{"$f":"I11","v":5},{"$f":"I10","v":28},null,"Rich T",8,42,null,"Kevin",{"$f":"Moodus!N11+Bantam!N11+'CT River'!N11+Quaddick!N11+'West Hill'!N11+McDonough!N11+Candlewood!N11+Lillinonah!N11","v":51.489999999999995},null,"Moodus",null,null,null,"Kevin","N",null,{"$f":"Bantam!D19","v":"Ryan"},{"$f":"Bantam!O19","v":7},{"$f":"McDonough!D18","v":"Rich T"},{"$f":"McDonough!O18","v":7},{"$f":"Quaddick!D18","v":"Rich T"},{"$f":"Quaddick!O18","v":7},{"$f":"Candlewood!D7","v":"Jack"},{"$f":"Candlewood!O7","v":7},{"$f":"Lillinonah!D6","v":"Dean"},{"$f":"Lillinonah!O6","v":7},{"$f":"'CT River'!D22","v":"Steve S"},{"$f":"'CT River'!O22","v":7},{"$f":"'West Hill'!D21","v":"Steve D"},{"$f":"'West Hill'!O21","v":7},{"$f":"Moodus!D6","v":"Dean"},{"$f":"Moodus!O6","v":7}]
[{"$f":"J1","v":"Mike G"},{"$f":"J11","v":14},{"$f":"J10","v":93},null,"Pete",9,46,null,"Mike G",{"$f":"Moodus!N12+Bantam!N12+'CT River'!N12+Quaddick!N12+'West Hill'!N12+McDonough!N12+Candlewood!N12+Lillinonah!N12","v":15.12},null,null,null,null,null,"Mike G","Y",null,{"$f":"Bantam!D9","v":"Jim B"},{"$f":"Bantam!O9","v":8},{"$f":"McDonough!D15","v":"Pete"},{"$f":"McDonough!O15","v":7},{"$f":"Quaddick!D23","v":"Tom"},{"$f":"Quaddick!O23","v":8},{"$f":"Candlewood!D15","v":"Pete"},{"$f":"Candlewood!O15","v":8},{"$f":"Lillinonah!D21","v":"Steve D"},{"$f":"Lillinonah!O21","v":8},{"$f":"'CT River'!D18","v":"Rich T"},{"$f":"'CT River'!O18","v":8},{"$f":"'West Hill'!D19","v":"Ryan"},{"$f":"'West Hill'!O19","v":8},{"$f":"Moodus!D11","v":"Kevin"},{"$f":"Moodus!O11","v":8}]
[{"$f":"K1","v":"Morrie"},{"$f":"K11","v":18},{"$f":"K10","v":110},null,"Steve S",10,50,null,"Morrie",{"$f":"Moodus!N13+Bantam!N13+'CT River'!N13+Quaddick!N13+'West Hill'!N13+McDonough!N13+Candlewood!N13+Lillinonah!N13","v":13.510000000000002},null,null,null,null,null,"Morrie","N",null,{"$f":"Bantam!D16","v":"Rich B"},{"$f":"Bantam!O16","v":9},{"$f":"McDonough!D11","v":"Kevin"},{"$f":"McDonough!O11","v":9},{"$f":"Quaddick!D7","v":"Jack"},{"$f":"Quaddick!O7","v":9},{"$f":"Candlewood!D14","v":"Oz"},{"$f":"Candlewood!O14","v":9},{"$f":"Lillinonah!D17","v":"Rich M"},{"$f":"Lillinonah!O17","v":9},{"$f":"'CT River'!D17","v":"Rich M"},{"$f":"'CT River'!O17","v":9},{"$f":"'West Hill'!D10","v":"Kam"},{"$f":"'West Hill'!O10","v":9},{"$f":"Moodus!D16","v":"Rich B"},{"$f":"Moodus!O16","v":9}]
[{"$f":"L1","v":"Oz"},{"$f":"L11","v":13},{"$f":"L10","v":79},null,"Rich B",11,51,null,"Oz",{"$f":"Moodus!N14+Bantam!N14+'CT River'!N14+Quaddick!N14+'West Hill'!N14+McDonough!N14+Candlewood!N14+Lillinonah!N14","v":13.969999999999999},null,null,null,null,null,"Oz","Y",null,{"$f":"Bantam!D21","v":"Steve D"},{"$f":"Bantam!O21","v":10},{"$f":"McDonough!D9","v":"Jim B"},{"$f":"McDonough!O9","v":10},{"$f":"Quaddick!D19","v":"Ryan"},{"$f":"Quaddick!O19","v":10},{"$f":"Candlewood!D17","v":"Rich M"},{"$f":"Candlewood!O17","v":10},{"$f":"Lillinonah!D13","v":"Morrie"},{"$f":"Lillinonah!O13","v":10},{"$f":"'CT River'!D15","v":"Pete"},{"$f":"'CT River'!O15","v":10},{"$f":"'West Hill'!D12","v":"Mike G"},{"$f":"'West Hill'!O12","v":10},{"$f":"Moodus!D15","v":"Pete"},{"$f":"Moodus!O15","v":10}]
[{"$f":"M1","v":"Pete"},{"$f":"M11","v":9},{"$f":"M10","v":46},null,"Rich M",12,77,null,"Pete",{"$f":"Moodus!N15+Bantam!N15+'CT River'!N15+Quaddick!N15+'West Hill'!N15+McDonough!N15+Candlewood!N15+Lillinonah!N15","v":40.279999999999994},null,"Macros",null,null,null,"Pete","Y",null,{"$f":"Bantam!D22","v":"Steve S"},{"$f":"Bantam!O22","v":11},{"$f":"McDonough!D22","v":"Steve S"},{"$f":"McDonough!O22","v":11},{"$f":"Quaddick!D9","v":"Jim B"},{"$f":"Quaddick!O9","v":11},{"$f":"Candlewood!D20","v":"Scott"},{"$f":"Candlewood!O20","v":11},{"$f":"Lillinonah!D7","v":"Jack"},{"$f":"Lillinonah!O7","v":11},{"$f":"'CT River'!D20","v":"Scott"},{"$f":"'CT River'!O20","v":11},{"$f":"'West Hill'!D15","v":"Pete"},{"$f":"'West Hill'!O15","v":11},{"$f":"Moodus!D10","v":"Kam"},{"$f":"Moodus!O10","v":11}]
[{"$f":"N1","v":"Rich B"},{"$f":"N11","v":11},{"$f":"N10","v":51},null,"Oz",13,79,null,"Rich B",{"$f":"Moodus!N16+Bantam!N16+'CT River'!N16+Quaddick!N16+'West Hill'!N16+McDonough!N16+Candlewood!N16+Lillinonah!N16","v":26.34},null,"ctl-S   Sort Upper Section",null,null,null,"Rich B","N",null,{"$f":"Bantam!D14","v":"Oz"},{"$f":"Bantam!O14","v":12},{"$f":"McDonough!D7","v":"Jack"},{"$f":"McDonough!O7","v":12},{"$f":"Quaddick!D12","v":"Mike G"},{"$f":"Quaddick!O12","v":12},{"$f":"Candlewood!D16","v":"Rich B"},{"$f":"Candlewood!O16","v":12},{"$f":"Lillinonah!D23","v":"Tom"},{"$f":"Lillinonah!O23","v":12},{"$f":"'CT River'!D11","v":"Kevin"},{"$f":"'CT River'!O11","v":12},{"$f":"'West Hill'!D14","v":"Oz"},{"$f":"'West Hill'!O14","v":12},{"$f":"Moodus!D9","v":"Jim B"},{"$f":"Moodus!O9","v":12}]
[{"$f":"O1","v":"Rich M"},{"$f":"O11","v":12},{"$f":"O10","v":77},null,"Mike G",14,93,null,"Rich M",{"$f":"Moodus!N17+Bantam!N17+'CT River'!N17+Quaddick!N17+'West Hill'!N17+McDonough!N17+Candlewood!N17+Lillinonah!N17","v":22.340000000000003},null,"ctl-K   Copy and Paste for Position",null,null,null,"Rich M","Y",null,{"$f":"Bantam!D20","v":"Scott"},{"$f":"Bantam!O20","v":13},{"$f":"McDonough!D23","v":"Tom"},{"$f":"McDonough!O23","v":13},{"$f":"Quaddick!D15","v":"Pete"},{"$f":"Quaddick!O15","v":13},{"$f":"Candlewood!D12","v":"Mike G"},{"$f":"Candlewood!O12","v":13},{"$f":"Lillinonah!D19","v":"Ryan"},{"$f":"Lillinonah!O19","v":13},{"$f":"'CT River'!D5","v":"Armand"},{"$f":"'CT River'!O5","v":13},{"$f":"'West Hill'!D20","v":"Scott"},{"$f":"'West Hill'!O20","v":13},{"$f":"Moodus!D14","v":"Oz"},{"$f":"Moodus!O14","v":13}]
[{"$f":"P1","v":"Rich T"},{"$f":"P11","v":8},{"$f":"P10","v":42},null,"Tom",15,103,null,"Rich T",{"$f":"Moodus!N18+Bantam!N18+'CT River'!N18+Quaddick!N18+'West Hill'!N18+McDonough!N18+Candlewood!N18+Lillinonah!N18","v":37.870000000000005},null,"ctl-L    Sort For Lunker",null,null,null,"Rich T","Y",null,{"$f":"Bantam!D4","v":"Anthony"},{"$f":"Bantam!O4","v":14},{"$f":"McDonough!D16","v":"Rich B"},{"$f":"McDonough!O16","v":14},{"$f":"Quaddick!D8","v":"Jason"},{"$f":"Quaddick!O8","v":14},{"$f":"Candlewood!D22","v":"Steve S"},{"$f":"Candlewood!O22","v":14},{"$f":"Lillinonah!D12","v":"Mike G"},{"$f":"Lillinonah!O12","v":14},{"$f":"'CT River'!D12","v":"Mike G"},{"$f":"'CT River'!O12","v":14},{"$f":"'West Hill'!D13","v":"Morrie"},{"$f":"'West Hill'!O13","v":14},{"$f":"Moodus!D13","v":"Morrie"},{"$f":"Moodus!O13","v":30}]
[{"$f":"Q1","v":"Ryan"},{"$f":"Q11","v":6},{"$f":"Q10","v":29},null,"Jason",16,105,null,"Ryan",{"$f":"Moodus!N19+Bantam!N19+'CT River'!N19+Quaddick!N19+'West Hill'!N19+McDonough!N19+Candlewood!N19+Lillinonah!N19","v":45.68},null,"ctl-F   Sort Top 3 Finishers",null,null,null,"Ryan","Y",null,{"$f":"Bantam!D12","v":"Mike G"},{"$f":"Bantam!O12","v":30},{"$f":"McDonough!D4","v":"Anthony"},{"$f":"McDonough!O4","v":15},{"$f":"Quaddick!D13","v":"Morrie"},{"$f":"Quaddick!O13","v":15},{"$f":"Candlewood!D8","v":"Jason"},{"$f":"Candlewood!O8","v":15},{"$f":"Lillinonah!D18","v":"Rich T"},{"$f":"Lillinonah!O18","v":15},{"$f":"'CT River'!D16","v":"Rich B"},{"$f":"'CT River'!O16","v":30},{"$f":"'West Hill'!D22","v":"Steve S"},{"$f":"'West Hill'!O22","v":15},{"$f":"Moodus!D22","v":"Steve S"},{"$f":"Moodus!O22","v":30}]
[{"$f":"R1","v":"Scott"},{"$f":"R11","v":7},{"$f":"R10","v":33},null,"Jim B",17,106,null,"Scott",{"$f":"Moodus!N20+Bantam!N20+'CT River'!N20+Quaddick!N20+'West Hill'!N20+McDonough!N20+Candlewood!N20+Lillinonah!N20","v":48.11},null,"ctl-W   Sort for Total Weight",null,null,null,"Scott","N",null,{"$f":"Bantam!D18","v":"Rich T"},{"$f":"Bantam!O18","v":30},{"$f":"McDonough!D14","v":"Oz"},{"$f":"McDonough!O14","v":16},{"$f":"Quaddick!D17","v":"Rich M"},{"$f":"Quaddick!O17","v":16},{"$f":"Candlewood!D4","v":"Anthony"},{"$f":"Candlewood!O4","v":16},{"$f":"Lillinonah!D9","v":"Jim B"},{"$f":"Lillinonah!O9","v":35},{"$f":"'CT River'!D14","v":"Oz"},{"$f":"'CT River'!O14","v":30},{"$f":"'West Hill'!D9","v":"Jim B"},{"$f":"'West Hill'!O9","v":30},{"$f":"Moodus!D12","v":"Mike G"},{"$f":"Moodus!O12","v":35}]
[{"$f":"S1","v":"Steve D"},{"$f":"S11","v":3},{"$f":"S10","v":23},null,"Morrie",18,110,null,"Steve D",{"$f":"Moodus!N21+Bantam!N21+'CT River'!N21+Quaddick!N21+'West Hill'!N21+McDonough!N21+Candlewood!N21+Lillinonah!N21","v":51.319999999999993},null,null,null,null,null,"Steve D","N",null,{"$f":"Bantam!D23","v":"Tom"},{"$f":"Bantam!O23","v":30},{"$f":"McDonough!D17","v":"Rich M"},{"$f":"McDonough!O17","v":35},{"$f":"Quaddick!D14","v":"Oz"},{"$f":"Quaddick!O14","v":17},{"$f":"Candlewood!D9","v":"Jim B"},{"$f":"Candlewood!O9","v":35},{"$f":"Lillinonah!D14","v":"Oz"},{"$f":"Lillinonah!O14","v":35},{"$f":"'CT River'!D9","v":"Jim B"},{"$f":"'CT River'!O9","v":35},{"$f":"'West Hill'!D17","v":"Rich M"},{"$f":"'West Hill'!O17","v":30},{"$f":"Moodus!D4","v":"Anthony"},{"$f":"Moodus!O4","v":35}]
[{"$f":"T1","v":"Steve S"},{"$f":"T11","v":10},{"$f":"T10","v":50},null,"Kam",19,130,null,"Steve S",{"$f":"Moodus!N22+Bantam!N22+'CT River'!N22+Quaddick!N22+'West Hill'!N22+McDonough!N22+Candlewood!N22+Lillinonah!N22","v":35.519999999999996},null,null,null,null,null,"Steve S","N",null,{"$f":"Bantam!D17","v":"Rich M"},{"$f":"Bantam!O17","v":35},{"$f":"McDonough!D12","v":"Mike G"},{"$f":"McDonough!O12","v":35},{"$f":"Quaddick!D4","v":"Anthony"},{"$f":"Quaddick!O4","v":30},{"$f":"Candlewood!D13","v":"Morrie"},{"$f":"Candlewood!O13","v":35},{"$f":"Lillinonah!D8","v":"Jason"},{"$f":"Lillinonah!O8","v":35},{"$f":"'CT River'!D8","v":"Jason"},{"$f":"'CT River'!O8","v":35},{"$f":"'West Hill'!D8","v":"Jason"},{"$f":"'West Hill'!O8","v":35},{"$f":"Moodus!D8","v":"Jason"},{"$f":"Moodus!O8","v":35}]
[{"$f":"U1","v":"Tom"},{"$f":"U11","v":15},{"$f":"U10","v":103},null,"Anthony",20,145,null,"Tom",{"$f":"Moodus!N23+Bantam!N23+'CT River'!N23+Quaddick!N23+'West Hill'!N23+McDonough!N23+Candlewood!N23+Lillinonah!N23","v":26.47},null,null,null,null,null,"Tom","N",null,{"$f":"Bantam!D13","v":"Morrie"},{"$f":"Bantam!O13","v":35},{"$f":"McDonough!D10","v":"Kam"},{"$f":"McDonough!O10","v":35},{"$f":"Quaddick!D16","v":"Rich B"},{"$f":"Quaddick!O16","v":35},{"$f":"Candlewood!D10","v":"Kam"},{"$f":"Candlewood!O10","v":35},{"$f":"Lillinonah!D10","v":"Kam"},{"$f":"Lillinonah!O10","v":35},{"$f":"'CT River'!D4","v":"Anthony"},{"$f":"'CT River'!O4","v":35},{"$f":"'West Hill'!D4","v":"Anthony"},{"$f":"'West Hill'!O4","v":35},{"$f":"Moodus!D18","v":"Rich T"},{"$f":"Moodus!O18","v":35}]
[{"$f":"V1","v":"X"},{"$f":"V11","v":21},{"$f":"V10","v":210},null,"X",21,210,null,"X",{"$f":"Moodus!N24+Bantam!N24+'CT River'!N24+Quaddick!N24+'West Hill'!N24+McDonough!N24+Candlewood!N24+Lillinonah!N24","v":0},null,null,null,null,null,"X",null,null,{"$f":"Bantam!D10","v":"Kam"},{"$f":"Bantam!O10","v":35},{"$f":"McDonough!D13","v":"Morrie"},{"$f":"McDonough!O13","v":35},{"$f":"Quaddick!D10","v":"Kam"},{"$f":"Quaddick!O10","v":35},{"$f":"Candlewood!D5","v":"Armand"},{"$f":"Candlewood!O5","v":35},{"$f":"Lillinonah!D4","v":"Anthony"},{"$f":"Lillinonah!O4","v":35},{"$f":"'CT River'!D23","v":"Tom"},{"$f":"'CT River'!O23","v":35},{"$f":"'West Hill'!D23","v":"Tom"},{"$f":"'West Hill'!O23","v":35},{"$f":"Moodus!D23","v":"Tom"},{"$f":"Moodus!O23","v":35}]
[{"$f":"W1","v":"X"},{"$f":"W11","v":21},{"$f":"W10","v":210},null,"X",21,210,null,"X",{"$f":"Moodus!N25+Bantam!N25+'CT River'!N25+Quaddick!N25+'West Hill'!N25+McDonough!N25+Candlewood!N25+Lillinonah!N25","v":0},null,null,null,null,null,"X",null,null,{"$f":"Bantam!D24","v":"X"},{"$f":"Bantam!O24","v":35},{"$f":"McDonough!D24","v":"X"},{"$f":"McDonough!O24","v":35},{"$f":"Quaddick!D24","v":"X"},{"$f":"Quaddick!O24","v":35},{"$f":"Candlewood!D24","v":"X"},{"$f":"Candlewood!O24","v":35},{"$f":"Lillinonah!D24","v":"X"},{"$f":"Lillinonah!O24","v":35},{"$f":"'CT River'!D24","v":"X"},{"$f":"'CT River'!O24","v":35},{"$f":"'West Hill'!D24","v":"X"},{"$f":"'West Hill'!O24","v":35},{"$f":"Moodus!D24","v":"X"},{"$f":"Moodus!O24","v":35}]
[{"$f":"X1","v":"X"},{"$f":"X11","v":21},{"$f":"X10","v":210},null,"X",21,210,null,"X",{"$f":"Moodus!N26+Bantam!N26+'CT River'!N26+Quaddick!N26+'West Hill'!N26+McDonough!N26+Candlewood!N26+Lillinonah!N26","v":0},null,null,null,null,null,"X",null,null,{"$f":"Bantam!D25","v":"X"},{"$f":"Bantam!O25","v":35},{"$f":"McDonough!D25","v":"X"},{"$f":"McDonough!O25","v":35},{"$f":"Quaddick!D25","v":"X"},{"$f":"Quaddick!O25","v":35},{"$f":"Candlewood!D25","v":"X"},{"$f":"Candlewood!O25","v":35},{"$f":"Lillinonah!D25","v":"X"},{"$f":"Lillinonah!O25","v":35},{"$f":"'CT River'!D25","v":"X"},{"$f":"'CT River'!O25","v":35},{"$f":"'West Hill'!D25","v":"X"},{"$f":"'West Hill'!O25","v":35},{"$f":"Moodus!D25","v":"X"},{"$f":"Moodus!O25","v":35}]
[{"$f":"Y1","v":"X"},{"$f":"Y11","v":21},{"$f":"Y10","v":210},null,"X",21,210,null,"X",{"$f":"Moodus!N27+Bantam!N27+'CT River'!N27+Quaddick!N27+'West Hill'!N27+McDonough!N27+Candlewood!N27+Lillinonah!N27","v":0},null,null,null,null,null,"X",null,null,{"$f":"Bantam!D26","v":"X"},{"$f":"Bantam!O26","v":35},{"$f":"McDonough!D27","v":"X"},{"$f":"McDonough!O27","v":35},{"$f":"Quaddick!D26","v":"X"},{"$f":"Quaddick!O26","v":35},{"$f":"Candlewood!D26","v":"X"},{"$f":"Candlewood!O26","v":35},{"$f":"Lillinonah!D26","v":"X"},{"$f":"Lillinonah!O26","v":35},{"$f":"'CT River'!D26","v":"X"},{"$f":"'CT River'!O26","v":35},{"$f":"'West Hill'!D26","v":"X"},{"$f":"'West Hill'!O26","v":35},{"$f":"Moodus!D26","v":"X"},{"$f":"Moodus!O26","v":35}]
[{"$f":"Z1","v":"X"},{"$f":"Z11","v":21},{"$f":"Z10","v":210},null,"X",21,210,null,"X",{"$f":"Moodus!N28+Bantam!N28+'CT River'!N28+Quaddick!N28+'West Hill'!N28+McDonough!N28+Candlewood!N28+Lillinonah!N28","v":0},null,null,null,null,null,"X",null,null,{"$f":"Bantam!D27","v":"X"},{"$f":"Bantam!O27","v":35},{"$f":"McDonough!D26","v":"X"},{"$f":"McDonough!O26","v":35},{"$f":"Quaddick!D27","v":"X"},{"$f":"Quaddick!O27","v":35},{"$f":"Candlewood!D27","v":"X"},{"$f":"Candlewood!O27","v":35},{"$f":"Lillinonah!D27","v":"X"},{"$f":"Lillinonah!O27","v":35},{"$f":"'CT River'!D27","v":"X"},{"$f":"'CT River'!O27","v":35},{"$f":"'West Hill'!D27","v":"X"},{"$f":"'West Hill'!O27","v":35},{"$f":"Moodus!D27","v":"X"},{"$f":"Moodus!O27","v":35}]
[{"$f":"AA1","v":"X"},{"$f":"AA11","v":21},{"$f":"AA10","v":210},null,"X",21,210,null,"X",{"$f":"Moodus!N29+Bantam!N29+'CT River'!N29+Quaddick!N29+'West Hill'!N29+McDonough!N29+Candlewood!N29+Lillinonah!N29","v":0},null,null,null,null,null,"X",null,null,{"$f":"Bantam!D28","v":"X"},{"$f":"Bantam!O28","v":35},{"$f":"McDonough!D28","v":"X"},{"$f":"McDonough!O28","v":35},{"$f":"Quaddick!D28","v":"X"},{"$f":"Quaddick!O28","v":35},{"$f":"Candlewood!D28","v":"X"},{"$f":"Candlewood!O28","v":35},{"$f":"Lillinonah!D28","v":"X"},{"$f":"Lillinonah!O28","v":35},{"$f":"'CT River'!D28","v":"X"},{"$f":"'CT River'!O28","v":35},{"$f":"'West Hill'!D28","v":"X"},{"$f":"'West Hill'!O28","v":35},{"$f":"Moodus!D28","v":"X"},{"$f":"Moodus!O28","v":35}]
[null,null,null,null,null,null,null,null,null,null,null,null,null,null,null,null,null,null,{"$f":"Bantam!D29","v":"X"},{"$f":"Bantam!O29","v":35},{"$f":"McDonough!D29","v":"X"},{"$f":"McDonough!O29","v":35},{"$f":"Quaddick!D29","v":"X"},{"$f":"Quaddick!O29","v":35},{"$f":"Candlewood!D29","v":"X"},{"$f":"Candlewood!O29","v":35},{"$f":"Lillinonah!D29","v":"X"},{"$f":"Lillinonah!O29","v":35},{"$f":"'CT River'!D29","v":"X"},{"$f":"'CT River'!O29","v":35},{"$f":"'West Hill'!D29","v":"X"},{"$f":"'West Hill'!O29","v":35},{"$f":"Moodus!D29","v":"X"},{"$f":"Moodus!O29","v":35}]
[]
[]
["Total Weight"]
[{"$f":"L15","v":"Bantam"},null,{"$f":"L16","v":"McDonough"},null,{"$f":"L17","v":"Quaddick"},null,{"$f":"L18","v":"Candlewood"},null,{"$f":"L19","v":"Lillinonah"},null,{"$f":"L20","v":"CT River"},null,{"$f":"L21","v":"West Hill"},null,{"$f":"L22","v":"Moodus"},null,"Lbs",null,"Total Weight YTD"]
["Name","Weight","Name","Weight","Name","Weight","Name","Weight","Name","Weight","Name","Weight","Name","Weight","Name","Weight","Ytd",null,"Name","Weight"]
[{"$f":"P15","v":"Anthony"},{"$f":"Bantam!N4","v":0.73},{"$f":"P15","v":"Anthony"},{"$f":"McDonough!N4","v":2.39},{"$f":"P15","v":"Anthony"},{"$f":"Quaddick!N4","v":0},{"$f":"P15","v":"Anthony"},{"$f":"Candlewood!N4","v":1.83},{"$f":"P15","v":"Anthony"},{"$f":"Lillinonah!N4","v":0},{"$f":"P15","v":"Anthony"},{"$f":"'CT River'!N4","v":0},{"$f":"P15","v":"Anthony"},{"$f":"'West Hill'!N4","v":0},{"$f":"P15","v":"Anthony"},{"$f":"Moodus!N4","v":0},{"$f":"SUM(A47:P47)","v":4.95},null,{"$f":"P15","v":"Anthony"},{"$f":"Q47","v":4.95}]
[{"$f":"P16","v":"Armand"},{"$f":"Bantam!N5","v":10.57},"Armand",{"$f":"McDonough!N5","v":9.42},"Armand",{"$f":"Quaddick!N5","v":8.56},"Armand",{"$f":"Candlewood!N5","v":0},"Armand",{"$f":"Lillinonah!N5","v":6.5},"Armand",{"$f":"'CT River'!N5","v":1.1000000000000001},"Armand",{"$f":"'West Hill'!N5","v":3.21},"Armand",{"$f":"Moodus!N5","v":3.28},42.640000000000008,null,{"$f":"P16","v":"Armand"},{"$f":"Q48","v":42.640000000000008}]
[{"$f":"P17","v":"Dean"},{"$f":"Bantam!N6","v":10.28},"Dean",{"$f":"McDonough!N6","v":9.16},"Dean",{"$f":"Quaddick!N6","v":8.4300000000000015},"Dean",{"$f":"Candlewood!N6","v":14.7},"Dean",{"$f":"Lillinonah!N6","v":5.91},"Dean",{"$f":"'CT River'!N6","v":5.05},"Dean",{"$f":"'West Hill'!N6","v":3.21},"Dean",{"$f":"Moodus!N6","v":2.2799999999999998},59.019999999999989,null,{"$f":"P17","v":"Dean"},59.019999999999989]
["Jack",{"$f":"Bantam!N7","v":7.41},"Jack",{"$f":"McDonough!N7","v":6.33},"Jack",{"$f":"Quaddick!N7","v":6.43},"Jack",{"$f":"Candlewood!N7","v":9.3699999999999992},"Jack",{"$f":"Lillinonah!N7","v":4.41},"Jack",{"$f":"'CT River'!N7","v":8},"Jack",{"$f":"'West Hill'!N7","v":4.7699999999999996},"Jack",{"$f":"Moodus!N7","v":3.84},50.56,null,"Jack",50.56]
["Jason",{"$f":"Bantam!N8","v":7.62},"Jason",{"$f":"McDonough!N8","v":9.7100000000000009},"Jason",{"$f":"Quaddick!N8","v":4.18},"Jason",{"$f":"Candlewood!N8","v":3.54},"Jason",{"$f":"Lillinonah!N8","v":0},"Jason",{"$f":"'CT River'!N8","v":0},"Jason",{"$f":"'West Hill'!N8","v":0},"Jason",{"$f":"Moodus!N8","v":0},25.05,null,"Jason",25.05]
["Jim B",{"$f":"Bantam!N9","v":3.7},"Jim B",{"$f":"McDonough!N9","v":7.43},{"$f":"P20","v":"Jim B"},{"$f":"Quaddick!N9","v":4.79},"Jim B",{"$f":"Candlewood!N9","v":0},"Jim B",{"$f":"Lillinonah!N9","v":0},"Jim B",{"$f":"'CT River'!N9","v":0},"Jim B",{"$f":"'West Hill'!N9","v":0},"Jim B",{"$f":"Moodus!N9","v":0.77},16.689999999999998,null,"Jim B",16.689999999999998]
["Kam",{"$f":"Bantam!N10","v":0},"Kam",{"$f":"McDonough!N10","v":0},"Kam",{"$f":"Quaddick!N10","v":0},"Kam",{"$f":"Candlewood!N10","v":0},"Kam",{"$f":"Lillinonah!N10","v":0},"Kam",{"$f":"'CT River'!N10","v":4.91},"Kam",{"$f":"'West Hill'!N10","v":1.3},"Kam",{"$f":"Moodus!N10","v":0.85},7.06,null,"Kam",7.06]
["Kevin",{"$f":"Bantam!N11","v":7.8},"Kevin",{"$f":"McDonough!N11","v":7.67},"Kevin",{"$f":"Quaddick!N11","v":9.07},"Kevin",{"$f":"Candlewood!N11","v":9.52},"Kevin",{"$f":"Lillinonah!N11","v":11.41},"Kevin",{"$f":"'CT River'!N11","v":1.88},"Kevin",{"$f":"'West Hill'!N11","v":1.92},"Kevin",{"$f":"Moodus!N11","v":2.2200000000000002},51.49,null,"Kevin",51.49]
["Mike G",{"$f":"Bantam!N12","v":0},"Mike G",{"$f":"McDonough!N12","v":0},"Mike G",{"$f":"Quaddick!N12","v":4.75},"Mike G",{"$f":"Candlewood!N12","v":5.4},"Mike G",{"$f":"Lillinonah!N12","v":2.94},"Mike G",{"$f":"'CT River'!N12","v":0.86},"Mike G",{"$f":"'West Hill'!N12","v":1.17},"Mike G",{"$f":"Moodus!N12","v":0},15.12,null,"Mike G",15.12]
["Morrie",{"$f":"Bantam!N13","v":0},"Morrie",{"$f":"McDonough!N13","v":0},"Morrie",{"$f":"Quaddick!N13","v":3.72},"Morrie",{"$f":"Candlewood!N13","v":0},"Morrie",{"$f":"Lillinonah!N13","v":4.47},"Morrie",{"$f":"'CT River'!N13","v":4.57},"Morrie",{"$f":"'West Hill'!N13","v":0.75},"Morrie",{"$f":"Moodus!N13","v":0},13.51,null,"Morrie",13.51]
["Oz",{"$f":"Bantam!N14","v":1.42},"Oz",{"$f":"McDonough!N14","v":1.02},"Oz",{"$f":"Quaddick!N14","v":1.87},"Oz",{"$f":"Candlewood!N14","v":8.09},"Oz",{"$f":"Lillinonah!N14","v":0},"Oz",{"$f":"'CT River'!N14","v":0},"Oz",{"$f":"'West Hill'!N14","v":0.81},"Oz",{"$f":"Moodus!N14","v":0.76},13.97,null,"Oz",13.97]
["Pete",{"$f":"Bantam!N15","v":5.17},"Pete",{"$f":"McDonough!N15","v":7.98},"Pete",{"$f":"Quaddick!N15","v":4.29},"Pete",{"$f":"Candlewood!N15","v":9.16},"Pete",{"$f":"Lillinonah!N15","v":7.96},"Pete",{"$f":"'CT River'!N15","v":3.32},"Pete",{"$f":"'West Hill'!N15","v":0.87},"Pete",{"$f":"Moodus!N15","v":1.53},40.28,null,"Pete",40.28]
["Rich B",{"$f":"Bantam!N16","v":2.75},"Rich B",{"$f":"McDonough!N16","v":4.76},"Rich B",{"$f":"Quaddick!N16","v":0},"Rich B",{"$f":"Candlewood!N16","v":6.34},"Rich B",{"$f":"Lillinonah!N16","v":8.82},"Rich B",{"$f":"'CT River'!N16","v":0},"Rich B",{"$f":"'West Hill'!N16","v":2.02},"Rich B",{"$f":"Moodus!N16","v":1.65},26.34,null,"Rich B",26.34]
["Rich M",{"$f":"Bantam!N17","v":0},"Rich M",{"$f":"McDonough!N17","v":0},"Rich M",{"$f":"Quaddick!N17","v":3.47},"Rich M",{"$f":"Candlewood!N17","v":6.93},"Rich M",{"$f":"Lillinonah!N17","v":4.92},"Rich M",{"$f":"'CT River'!N17","v":3.7199999999999998},"Rich M",{"$f":"'West Hill'!N17","v":0},"Rich M",{"$f":"Moodus!N17","v":3.3},22.34,null,"Rich M",22.34]
["Rich T",{"$f":"Bantam!N18","v":0},"Rich T",{"$f":"McDonough!N18","v":7.98},"Rich T",{"$f":"Quaddick!N18","v":8.41},"Rich T",{"$f":"Candlewood!N18","v":12.64},"Rich T",{"$f":"Lillinonah!N18","v":0.95},"Rich T",{"$f":"'CT River'!N18","v":3.72},"Rich T",{"$f":"'West Hill'!N18","v":4.17},"Rich T",{"$f":"Moodus!N18","v":0},37.870000000000005,null,"Rich T",37.870000000000005]
["Ryan",{"$f":"Bantam!N19","v":3.91},"Ryan",{"$f":"McDonough!N19","v":10.46},"Ryan",{"$f":"Quaddick!N19","v":5.79},"Ryan",{"$f":"Candlewood!N19","v":10.770000000000001},"Ryan",{"$f":"Lillinonah!N19","v":3.22},"Ryan",{"$f":"'CT River'!N19","v":7.26},"Ryan",{"$f":"'West Hill'!N19","v":1.54},"Ryan",{"$f":"Moodus!N19","v":2.73},45.679999999999993,null,"Ryan",45.679999999999993]
["Scott",{"$f":"Bantam!N20","v":0.92},"Scott",{"$f":"McDonough!N20","v":8.27},"Scott",{"$f":"Quaddick!N20","v":9.85},"Scott",{"$f":"Candlewood!N20","v":6.72},"Scott",{"$f":"Lillinonah!N20","v":8.52},"Scott",{"$f":"'CT River'!N20","v":2.4700000000000002},"Scott",{"$f":"'West Hill'!N20","v":0.78},"Scott",{"$f":"Moodus!N20","v":10.58},48.11,null,"Scott",48.11]
["Steve D",{"$f":"Bantam!N21","v":2.06},"Steve D",{"$f":"McDonough!N21","v":8.23},"Steve D",{"$f":"Quaddick!N21","v":9.86},"Steve D",{"$f":"Candlewood!N21","v":13.27},"Steve D",{"$f":"Lillinonah!N21","v":5.69},"Steve D",{"$f":"'CT River'!N21","v":7.34},"Steve D",{"$f":"'West Hill'!N21","v":1.6},"Steve D",{"$f":"Moodus!N21","v":3.27},51.320000000000007,null,"Steve D",51.320000000000007]
["Steve S",{"$f":"Bantam!N22","v":2.0499999999999998},"Steve S",{"$f":"McDonough!N22","v":6.7},"Steve S",{"$f":"Quaddick!N22","v":9.1300000000000008},"Steve S",{"$f":"Candlewood!N22","v":4.57},"Steve S",{"$f":"Lillinonah!N22","v":8.18},"Steve S",{"$f":"'CT River'!N22","v":4.1500000000000004},"Steve S",{"$f":"'West Hill'!N22","v":0.74},"Steve S",{"$f":"Moodus!N22","v":0},35.520000000000003,null,"Steve S",35.520000000000003]
["Tom",{"$f":"Bantam!N23","v":0},"Tom",{"$f":"McDonough!N23","v":6.06},"Tom",{"$f":"Quaddick!N23","v":7.21},"Tom",{"$f":"Candlewood!N23","v":9.5500000000000007},"Tom",{"$f":"Lillinonah!N23","v":3.65},"Tom",{"$f":"'CT River'!N23","v":0},"Tom",{"$f":"'West Hill'!N23","v":0},"Tom",{"$f":"Moodus!N23","v":0},26.47,null,"Tom",26.47]
["X",{"$f":"Bantam!N24","v":0},"X",{"$f":"McDonough!N24","v":0},"X",{"$f":"Quaddick!N24","v":0},"X",{"$f":"Candlewood!N24","v":0},"X",{"$f":"Lillinonah!N24","v":0},"X",{"$f":"'CT River'!N24","v":0},"X",{"$f":"'West Hill'!N24","v":0},"X",{"$f":"Moodus!N24","v":0},0,null,"X",0]
["X",{"$f":"Bantam!N25","v":0},"X",{"$f":"McDonough!N25","v":0},"X",{"$f":"Quaddick!N25","v":0},"X",{"$f":"Candlewood!N25","v":0},"X",{"$f":"Lillinonah!N25","v":0},"X",{"$f":"'CT River'!N25","v":0},"X",{"$f":"'West Hill'!N25","v":0},"X",{"$f":"Moodus!N25","v":0},0,null,"X",0]
["X",{"$f":"Bantam!N26","v":0},"X",{"$f":"McDonough!N26","v":0},"X",{"$f":"Quaddick!N26","v":0},"X",{"$f":"Candlewood!N26","v":0},"X",{"$f":"Lillinonah!N26","v":0},"X",{"$f":"'CT River'!N26","v":0},"X",{"$f":"'West Hill'!N26","v":0},"X",{"$f":"Moodus!N26","v":0},0,null,"X",0]
["X",{"$f":"Bantam!N27","v":0},"X",{"$f":"McDonough!N27","v":0},"X",{"$f":"Quaddick!N27","v":0},"X",{"$f":"Candlewood!N27","v":0},"X",{"$f":"Lillinonah!N27","v":0},"X",{"$f":"'CT River'!N27","v":0},"X",{"$f":"'West Hill'!N27","v":0},"X",{"$f":"Moodus!N27","v":0},0,null,"X",0]
["X",{"$f":"Bantam!N28","v":0},"X",{"$f":"McDonough!N28","v":0},"X",{"$f":"Quaddick!N28","v":0},"X",{"$f":"Candlewood!N28","v":0},"X",{"$f":"Lillinonah!N28","v":0},"X",{"$f":"'CT River'!N28","v":0},"X",{"$f":"'West Hill'!N28","v":0},"X",{"$f":"Moodus!N28","v":0},0,null,"X",0]
["X",{"$f":"Bantam!N29","v":0},"X",{"$f":"McDonough!N29","v":0},"X",{"$f":"Quaddick!N29","v":0},"X",{"$f":"Candlewood!N29","v":0},"X",{"$f":"Lillinonah!N29","v":0},"X",{"$f":"'CT River'!N29","v":0},"X",{"$f":"'West Hill'!N29","v":0},"X",{"$f":"Moodus!N29","v":0},0,null,"X",0]
[]
["Lunkers"]
[{"$f":"A45","v":"Bantam"},null,null,{"$f":"C45","v":"McDonough"},null,null,{"$f":"E45","v":"Quaddick"},null,null,{"$f":"G45","v":"Candlewood"},null,null,{"$f":"I45","v":"Lillinonah"},null,null,{"$f":"K45","v":"CT River"},null,null,{"$f":"M45","v":"West Hill"},null,null,{"$f":"O45","v":"Moodus"}]
["Name","Weight","L or S","Name","Weight","L or S","Name","Weight","L or S","Name","Weight","L or S","Name","Weight","L or S","Name","Weight","L or S","Name","Weight","L or S","Name","Weight","L or S"]
[{"$f":"Bantam!D4","v":"Anthony"},{"$f":"Bantam!J4","v":0},{"$f":"Bantam!K4","v":0},{"$f":"McDonough!D4","v":"Anthony"},{"$f":"McDonough!J4","v":0},{"$f":"McDonough!K4","v":0},{"$f":"Quaddick!D4","v":"Anthony"},{"$f":"Quaddick!J4","v":0},{"$f":"Quaddick!K4","v":0},{"$f":"Candlewood!D4","v":"Anthony"},{"$f":"Candlewood!J4","v":0},{"$f":"Candlewood!K4","v":0},{"$f":"Lillinonah!D4","v":"Anthony"},{"$f":"Lillinonah!J4","v":0},{"$f":"Lillinonah!K4","v":0},{"$f":"'CT River'!D4","v":"Anthony"},{"$f":"'CT River'!J4","v":0},{"$f":"'CT River'!K4","v":0},{"$f":"'West Hill'!D4","v":"Anthony"},{"$f":"'West Hill'!J4","v":0},{"$f":"'West Hill'!K4","v":0},{"$f":"Moodus!D4","v":"Anthony"},{"$f":"Moodus!J4","v":0},{"$f":"Moodus!K4","v":0}]
[{"$f":"Bantam!D6","v":"Dean"},{"$f":"Bantam!J6","v":0},{"$f":"Bantam!K6","v":0},{"$f":"McDonough!D5","v":"Armand"},{"$f":"McDonough!J5","v":0},{"$f":"McDonough!K5","v":0},{"$f":"Quaddick!D5","v":"Armand"},{"$f":"Quaddick!J5","v":0},{"$f":"Quaddick!K5","v":0},{"$f":"Candlewood!D5","v":"Armand"},{"$f":"Candlewood!J5","v":0},{"$f":"Candlewood!K5","v":0},{"$f":"Lillinonah!D5","v":"Armand"},{"$f":"Lillinonah!J5","v":0},{"$f":"Lillinonah!K5","v":0},{"$f":"P16","v":"Armand"},{"$f":"'CT River'!J5","v":0},{"$f":"'CT River'!K5","v":0},{"$f":"'CT River'!D6","v":"Dean"},{"$f":"'West Hill'!J6","v":0},{"$f":"'West Hill'!K6","v":0},{"$f":"Moodus!D5","v":"Armand"},{"$f":"Moodus!J5","v":0},{"$f":"Moodus!K5","v":0}]
[{"$f":"Bantam!D7","v":"Jack"},{"$f":"Bantam!J7","v":0},{"$f":"Bantam!K7","v":0},{"$f":"McDonough!D6","v":"Dean"},{"$f":"McDonough!J6","v":0},{"$f":"McDonough!K6","v":0},{"$f":"Quaddick!D6","v":"Dean"},{"$f":"Quaddick!J6","v":0},{"$f":"Quaddick!K6","v":0},{"$f":"Candlewood!D7","v":"Jack"},{"$f":"Candlewood!J7","v":0},{"$f":"Candlewood!K7","v":0},{"$f":"Lillinonah!D7","v":"Jack"},{"$f":"Lillinonah!J7","v":0},{"$f":"Lillinonah!K7","v":0},"Dean",{"$f":"'CT River'!J8","v":0},{"$f":"'CT River'!K8","v":0},{"$f":"'CT River'!D7","v":"Jack"},{"$f":"'West Hill'!J7","v":0},{"$f":"'West Hill'!K7","v":0},{"$f":"Moodus!D6","v":"Dean"},{"$f":"Moodus!J6","v":0},{"$f":"Moodus!K6","v":0}]
[{"$f":"Bantam!D8","v":"Jason"},{"$f":"Bantam!J8","v":0},{"$f":"Bantam!K8","v":0},{"$f":"McDonough!D7","v":"Jack"},{"$f":"McDonough!J7","v":0},{"$f":"McDonough!K7","v":0},{"$f":"Quaddick!D7","v":"Jack"},{"$f":"Quaddick!J7","v":0},{"$f":"Quaddick!K7","v":0},{"$f":"Candlewood!D8","v":"Jason"},{"$f":"Candlewood!J8","v":0},{"$f":"Candlewood!K8","v":0},{"$f":"Lillinonah!D8","v":"Jason"},{"$f":"Lillinonah!J8","v":0},{"$f":"Lillinonah!K8","v":0},"Jack",{"$f":"'CT River'!J9","v":0},{"$f":"'CT River'!K9","v":0},{"$f":"'CT River'!D8","v":"Jason"},{"$f":"'West Hill'!J8","v":0},{"$f":"'West Hill'!K8","v":0},{"$f":"Moodus!D7","v":"Jack"},{"$f":"Moodus!J7","v":0},{"$f":"Moodus!K7","v":0}]
[{"$f":"Bantam!D10","v":"Kam"},{"$f":"Bantam!J10","v":0},{"$f":"Bantam!K10","v":0},{"$f":"McDonough!D8","v":"Jason"},{"$f":"McDonough!J8","v":0},{"$f":"McDonough!K8","v":0},{"$f":"Quaddick!D8","v":"Jason"},{"$f":"Quaddick!J8","v":0},{"$f":"Quaddick!K8","v":0},{"$f":"Candlewood!D9","v":"Jim B"},{"$f":"Candlewood!J9","v":0},{"$f":"Candlewood!K9","v":0},{"$f":"Lillinonah!D9","v":"Jim B"},{"$f":"Lillinonah!J9","v":0},{"$f":"Lillinonah!K9","v":0},"Jason",{"$f":"'CT River'!J10","v":0},{"$f":"'CT River'!K10","v":0},{"$f":"'CT River'!D9","v":"Jim B"},{"$f":"'West Hill'!J9","v":0},{"$f":"'West Hill'!K9","v":0},{"$f":"Moodus!D8","v":"Jason"},{"$f":"Moodus!J8","v":0},{"$f":"Moodus!K8","v":0}]
[{"$f":"Bantam!D11","v":"Kevin"},{"$f":"Bantam!J11","v":0},{"$f":"Bantam!K11","v":0},{"$f":"McDonough!D9","v":"Jim B"},{"$f":"McDonough!J9","v":0},{"$f":"McDonough!K9","v":0},{"$f":"Quaddick!D9","v":"Jim B"},{"$f":"Quaddick!J9","v":0},{"$f":"Quaddick!K9","v":0},{"$f":"Candlewood!D10","v":"Kam"},{"$f":"Candlewood!J10","v":0},{"$f":"Candlewood!K10","v":0},{"$f":"Lillinonah!D10","v":"Kam"},{"$f":"Lillinonah!J10","v":0},{"$f":"Lillinonah!K10","v":0},"Jim B",{"$f":"'CT River'!J11","v":0},{"$f":"'CT River'!K11","v":0},{"$f":"'CT River'!D10","v":"Kam"},{"$f":"'West Hill'!J10","v":0},{"$f":"'West Hill'!K10","v":0},{"$f":"Moodus!D9","v":"Jim B"},{"$f":"Moodus!J9","v":0},{"$f":"Moodus!K9","v":0}]
[{"$f":"Bantam!D12","v":"Mike G"},{"$f":"Bantam!J12","v":0},{"$f":"Bantam!K12","v":0},{"$f":"McDonough!D10","v":"Kam"},{"$f":"McDonough!J10","v":0},{"$f":"McDonough!K10","v":0},{"$f":"Quaddick!D10","v":"Kam"},{"$f":"Quaddick!J10","v":0},{"$f":"Quaddick!K10","v":0},{"$f":"Candlewood!D11","v":"Kevin"},{"$f":"Candlewood!J11","v":0},{"$f":"Candlewood!K11","v":0},{"$f":"Lillinonah!D12","v":"Mike G"},{"$f":"Lillinonah!J12","v":0},{"$f":"Lillinonah!K12","v":0},"Kam",{"$f":"'CT River'!J12","v":0},{"$f":"'CT River'!K12","v":0},{"$f":"'CT River'!D11","v":"Kevin"},{"$f":"'West Hill'!J11","v":0},{"$f":"'West Hill'!K11","v":0},{"$f":"Moodus!D10","v":"Kam"},{"$f":"Moodus!J10","v":0},{"$f":"Moodus!K10","v":0}]
[{"$f":"Bantam!D13","v":"Morrie"},{"$f":"Bantam!J13","v":0},{"$f":"Bantam!K13","v":0},{"$f":"McDonough!D11","v":"Kevin"},{"$f":"McDonough!J11","v":0},{"$f":"McDonough!K11","v":0},{"$f":"Quaddick!D11","v":"Kevin"},{"$f":"Quaddick!J11","v":0},{"$f":"Quaddick!K11","v":0},{"$f":"Candlewood!D12","v":"Mike G"},{"$f":"Candlewood!J12","v":0},{"$f":"Candlewood!K12","v":0},{"$f":"Lillinonah!D13","v":"Morrie"},{"$f":"Lillinonah!J13","v":0},{"$f":"Lillinonah!K13","v":0},"Kevin",{"$f":"'CT River'!J13","v":0},{"$f":"'CT River'!K13","v":0},{"$f":"'CT River'!D12","v":"Mike G"},{"$f":"'West Hill'!J12","v":0},{"$f":"'West Hill'!K12","v":0},{"$f":"Moodus!D11","v":"Kevin"},{"$f":"Moodus!J11","v":0},{"$f":"Moodus!K11","v":0}]
[{"$f":"Bantam!D14","v":"Oz"},{"$f":"Bantam!J14","v":0},{"$f":"Bantam!K14","v":0},{"$f":"McDonough!D12","v":"Mike G"},{"$f":"McDonough!J12","v":0},{"$f":"McDonough!K12","v":0},{"$f":"Quaddick!D12","v":"Mike G"},{"$f":"Quaddick!J12","v":0},{"$f":"Quaddick!K12","v":0},{"$f":"Candlewood!D13","v":"Morrie"},{"$f":"Candlewood!J13","v":0},{"$f":"Candlewood!K13","v":0},{"$f":"Lillinonah!D14","v":"Oz"},{"$f":"Lillinonah!J14","v":0},{"$f":"Lillinonah!K14","v":0},"Mike G",{"$f":"'CT River'!J14","v":0},{"$f":"'CT River'!K14","v":0},{"$f":"'CT River'!D13","v":"Morrie"},{"$f":"'West Hill'!J13","v":0},{"$f":"'West Hill'!K13","v":0},{"$f":"Moodus!D12","v":"Mike G"},{"$f":"Moodus!J12","v":0},{"$f":"Moodus!K12","v":0}]
[{"$f":"Bantam!D15","v":"Pete"},{"$f":"Bantam!J15","v":0},{"$f":"Bantam!K15","v":0},{"$f":"McDonough!D13","v":"Morrie"},{"$f":"McDonough!J13","v":0},{"$f":"McDonough!K13","v":0},{"$f":"Quaddick!D13","v":"Morrie"},{"$f":"Quaddick!J13","v":0},{"$f":"Quaddick!K13","v":0},{"$f":"Candlewood!D15","v":"Pete"},{"$f":"Candlewood!J15","v":0},{"$f":"Candlewood!K15","v":0},{"$f":"Lillinonah!D15","v":"Pete"},{"$f":"Lillinonah!J15","v":0},{"$f":"Lillinonah!K15","v":0},"Morrie",{"$f":"'CT River'!J15","v":0},{"$f":"'CT River'!K15","v":0},{"$f":"'CT River'!D14","v":"Oz"},{"$f":"'West Hill'!J14","v":0},{"$f":"'West Hill'!K14","v":0},{"$f":"Moodus!D13","v":"Morrie"},{"$f":"Moodus!J13","v":0},{"$f":"Moodus!K13","v":0}]
[{"$f":"Bantam!D16","v":"Rich B"},{"$f":"Bantam!J16","v":0},{"$f":"Bantam!K16","v":0},{"$f":"McDonough!D14","v":"Oz"},{"$f":"McDonough!J14","v":0},{"$f":"McDonough!K14","v":0},{"$f":"Quaddick!D14","v":"Oz"},{"$f":"Quaddick!J14","v":0},{"$f":"Quaddick!K14","v":0},{"$f":"Candlewood!D16","v":"Rich B"},{"$f":"Candlewood!J16","v":0},{"$f":"Candlewood!K16","v":0},{"$f":"Lillinonah!D17","v":"Rich M"},{"$f":"Lillinonah!J17","v":0},{"$f":"Lillinonah!K17","v":0},"Oz",{"$f":"'CT River'!J16","v":0},{"$f":"'CT River'!K16","v":0},{"$f":"'CT River'!D15","v":"Pete"},{"$f":"'West Hill'!J15","v":0},{"$f":"'West Hill'!K15","v":0},{"$f":"Moodus!D14","v":"Oz"},{"$f":"Moodus!J14","v":0},{"$f":"Moodus!K14","v":0}]
[{"$f":"Bantam!D17","v":"Rich M"},{"$f":"Bantam!J17","v":0},{"$f":"Bantam!K17","v":0},{"$f":"McDonough!D15","v":"Pete"},{"$f":"McDonough!J15","v":0},{"$f":"McDonough!K15","v":0},{"$f":"Quaddick!D15","v":"Pete"},{"$f":"Quaddick!J15","v":0},{"$f":"Quaddick!K15","v":0},{"$f":"Candlewood!D17","v":"Rich M"},{"$f":"Candlewood!J17","v":0},{"$f":"Candlewood!K17","v":0},{"$f":"Lillinonah!D18","v":"Rich T"},{"$f":"Lillinonah!J18","v":0},{"$f":"Lillinonah!K18","v":0},"Pete",{"$f":"'CT River'!J17","v":0},{"$f":"'CT River'!K17","v":0},{"$f":"'CT River'!D16","v":"Rich B"},{"$f":"'West Hill'!J16","v":0},{"$f":"'West Hill'!K16","v":0},{"$f":"Moodus!D15","v":"Pete"},{"$f":"Moodus!J15","v":0},{"$f":"Moodus!K15","v":0}]
[{"$f":"Bantam!D18","v":"Rich T"},{"$f":"Bantam!J18","v":0},{"$f":"Bantam!K18","v":0},{"$f":"McDonough!D16","v":"Rich B"},{"$f":"McDonough!J16","v":0},{"$f":"McDonough!K16","v":0},{"$f":"Quaddick!D16","v":"Rich B"},{"$f":"Quaddick!J16","v":0},{"$f":"Quaddick!K16","v":0},{"$f":"Candlewood!D20","v":"Scott"},{"$f":"Candlewood!J20","v":0},{"$f":"Candlewood!K20","v":0},{"$f":"Lillinonah!D19","v":"Ryan"},{"$f":"Lillinonah!J19","v":0},{"$f":"Lillinonah!K19","v":0},"Rich B",{"$f":"'CT River'!J18","v":0},{"$f":"'CT River'!K18","v":0},{"$f":"'CT River'!D17","v":"Rich M"},{"$f":"'West Hill'!J17","v":0},{"$f":"'West Hill'!K17","v":0},{"$f":"Moodus!D16","v":"Rich B"},{"$f":"Moodus!J16","v":0},{"$f":"Moodus!K16","v":0}]
[{"$f":"Bantam!D19","v":"Ryan"},{"$f":"Bantam!J19","v":0},{"$f":"Bantam!K19","v":0},{"$f":"McDonough!D17","v":"Rich M"},{"$f":"McDonough!J17","v":0},{"$f":"McDonough!K17","v":0},{"$f":"Quaddick!D17","v":"Rich M"},{"$f":"Quaddick!J17","v":0},{"$f":"Quaddick!K17","v":0},{"$f":"Candlewood!D21","v":"Steve D"},{"$f":"Candlewood!J21","v":0},{"$f":"Candlewood!K21","v":0},{"$f":"Lillinonah!D20","v":"Scott"},{"$f":"Lillinonah!J20","v":0},{"$f":"Lillinonah!K20","v":0},"Rich M",{"$f":"'CT River'!J20","v":0},{"$f":"'CT River'!K20","v":0},{"$f":"'CT River'!D18","v":"Rich T"},{"$f":"'West Hill'!J18","v":0},{"$f":"'West Hill'!K18","v":0},{"$f":"Moodus!D17","v":"Rich M"},{"$f":"Moodus!J17","v":0},{"$f":"Moodus!K17","v":0}]
[{"$f":"Bantam!D20","v":"Scott"},{"$f":"Bantam!J20","v":0},{"$f":"Bantam!K20","v":0},{"$f":"McDonough!D18","v":"Rich T"},{"$f":"McDonough!J18","v":0},{"$f":"McDonough!K18","v":0},{"$f":"Quaddick!D18","v":"Rich T"},{"$f":"Quaddick!J18","v":0},{"$f":"Quaddick!K18","v":0},{"$f":"Candlewood!D22","v":"Steve S"},{"$f":"Candlewood!J22","v":0},{"$f":"Candlewood!K22","v":0},{"$f":"Lillinonah!D21","v":"Steve D"},{"$f":"Lillinonah!J21","v":0},{"$f":"Lillinonah!K21","v":0},"Rich T",{"$f":"'CT River'!J22","v":0},{"$f":"'CT River'!K22","v":0},{"$f":"'CT River'!D19","v":"Ryan"},{"$f":"'West Hill'!J19","v":0},{"$f":"'West Hill'!K19","v":0},{"$f":"Moodus!D18","v":"Rich T"},{"$f":"Moodus!J18","v":0},{"$f":"Moodus!K18","v":0}]
[{"$f":"Bantam!D21","v":"Steve D"},{"$f":"Bantam!J21","v":0},{"$f":"Bantam!K21","v":0},{"$f":"McDonough!D20","v":"Scott"},{"$f":"McDonough!J20","v":0},{"$f":"McDonough!K20","v":0},{"$f":"Quaddick!D19","v":"Ryan"},{"$f":"Quaddick!J19","v":0},{"$f":"Quaddick!K19","v":0},{"$f":"Candlewood!D23","v":"Tom"},{"$f":"Candlewood!J23","v":0},{"$f":"Candlewood!K23","v":0},{"$f":"Lillinonah!D23","v":"Tom"},{"$f":"Lillinonah!J23","v":0},{"$f":"Lillinonah!K23","v":0},"Ryan",{"$f":"'CT River'!J23","v":0},{"$f":"'CT River'!K23","v":0},{"$f":"'CT River'!D20","v":"Scott"},{"$f":"'West Hill'!J20","v":0},{"$f":"'West Hill'!K20","v":0},{"$f":"Moodus!D19","v":"Ryan"},{"$f":"Moodus!J19","v":0},{"$f":"Moodus!K19","v":0}]
[{"$f":"Bantam!D22","v":"Steve S"},{"$f":"Bantam!J22","v":0},{"$f":"Bantam!K22","v":0},{"$f":"McDonough!D21","v":"Steve D"},{"$f":"McDonough!J21","v":0},{"$f":"McDonough!K21","v":0},{"$f":"Quaddick!D20","v":"Scott"},{"$f":"Quaddick!J20","v":0},{"$f":"Quaddick!K20","v":0},{"$f":"Candlewood!D24","v":"X"},{"$f":"Candlewood!J24","v":0},{"$f":"Candlewood!K24","v":0},{"$f":"Lillinonah!D24","v":"X"},{"$f":"Lillinonah!J24","v":0},{"$f":"Lillinonah!K24","v":0},"Scott",{"$f":"'CT River'!J24","v":0},{"$f":"'CT River'!K24","v":0},{"$f":"'CT River'!D21","v":"Steve D"},{"$f":"'West Hill'!J21","v":0},{"$f":"'West Hill'!K21","v":0},{"$f":"Moodus!D21","v":"Steve D"},{"$f":"Moodus!J21","v":0},{"$f":"Moodus!K21","v":0}]
[{"$f":"Bantam!D23","v":"Tom"},{"$f":"Bantam!J23","v":0},{"$f":"Bantam!K23","v":0},{"$f":"McDonough!D22","v":"Steve S"},{"$f":"McDonough!J22","v":0},{"$f":"McDonough!K22","v":0},{"$f":"Quaddick!D21","v":"Steve D"},{"$f":"Quaddick!J21","v":0},{"$f":"Quaddick!K21","v":0},{"$f":"Candlewood!D25","v":"X"},{"$f":"Candlewood!J25","v":0},{"$f":"Candlewood!K25","v":0},{"$f":"Lillinonah!D25","v":"X"},{"$f":"Lillinonah!J25","v":0},{"$f":"Lillinonah!K25","v":0},"Steve D",{"$f":"'CT River'!J25","v":0},{"$f":"'CT River'!K25","v":0},{"$f":"'CT River'!D22","v":"Steve S"},{"$f":"'West Hill'!J22","v":0},{"$f":"'West Hill'!K22","v":0},{"$f":"Moodus!D22","v":"Steve S"},{"$f":"Moodus!J22","v":0},{"$f":"Moodus!K22","v":0}]
[{"$f":"Bantam!D24","v":"X"},{"$f":"Bantam!J24","v":0},{"$f":"Bantam!K24","v":0},{"$f":"McDonough!D23","v":"Tom"},{"$f":"McDonough!J23","v":0},{"$f":"McDonough!K23","v":0},{"$f":"Quaddick!D22","v":"Steve S"},{"$f":"Quaddick!J22","v":0},{"$f":"Quaddick!K22","v":0},{"$f":"Candlewood!D26","v":"X"},{"$f":"Candlewood!J26","v":0},{"$f":"Candlewood!K26","v":0},{"$f":"Lillinonah!D26","v":"X"},{"$f":"Lillinonah!J26","v":0},{"$f":"Lillinonah!K26","v":0},"X",{"$f":"'CT River'!J26","v":0},{"$f":"'CT River'!K26","v":0},{"$f":"'CT River'!D23","v":"Tom"},{"$f":"'West Hill'!J23","v":0},{"$f":"'West Hill'!K23","v":0},{"$f":"Moodus!D23","v":"Tom"},{"$f":"Moodus!J23","v":0},{"$f":"Moodus!K23","v":0}]
[{"$f":"Bantam!D25","v":"X"},{"$f":"Bantam!J25","v":0},{"$f":"Bantam!K25","v":0},{"$f":"McDonough!D24","v":"X"},{"$f":"McDonough!J24","v":0},{"$f":"McDonough!K24","v":0},{"$f":"Quaddick!D24","v":"X"},{"$f":"Quaddick!J24","v":0},{"$f":"Quaddick!K24","v":0},{"$f":"Candlewood!D27","v":"X"},{"$f":"Candlewood!J27","v":0},{"$f":"Candlewood!K27","v":0},{"$f":"Lillinonah!D27","v":"X"},{"$f":"Lillinonah!J27","v":0},{"$f":"Lillinonah!K27","v":0},"X",{"$f":"'CT River'!J27","v":0},{"$f":"'CT River'!K27","v":0},{"$f":"'CT River'!D24","v":"X"},{"$f":"'West Hill'!J24","v":0},{"$f":"'West Hill'!K24","v":0},{"$f":"Moodus!D24","v":"X"},{"$f":"Moodus!J24","v":0},{"$f":"Moodus!K24","v":0}]
[{"$f":"Bantam!D26","v":"X"},{"$f":"Bantam!J26","v":0},{"$f":"Bantam!K26","v":0},{"$f":"McDonough!D25","v":"X"},{"$f":"McDonough!J25","v":0},{"$f":"McDonough!K25","v":0},{"$f":"Quaddick!D25","v":"X"},{"$f":"Quaddick!J25","v":0},{"$f":"Quaddick!K25","v":0},{"$f":"Candlewood!D28","v":"X"},{"$f":"Candlewood!J28","v":0},{"$f":"Candlewood!K28","v":0},{"$f":"Lillinonah!D28","v":"X"},{"$f":"Lillinonah!J28","v":0},{"$f":"Lillinonah!K28","v":0},"X",{"$f":"'CT River'!J28","v":0},{"$f":"'CT River'!K28","v":0},{"$f":"'CT River'!D25","v":"X"},{"$f":"'West Hill'!J25","v":0},{"$f":"'West Hill'!K25","v":0},{"$f":"Moodus!D25","v":"X"},{"$f":"Moodus!J25","v":0},{"$f":"Moodus!K25","v":0}]
[{"$f":"Bantam!D27","v":"X"},{"$f":"Bantam!J27","v":0},{"$f":"Bantam!K27","v":0},{"$f":"McDonough!D26","v":"X"},{"$f":"McDonough!J26","v":0},{"$f":"McDonough!K26","v":0},{"$f":"Quaddick!D26","v":"X"},{"$f":"Quaddick!J26","v":0},{"$f":"Quaddick!K26","v":0},{"$f":"Candlewood!D29","v":"X"},{"$f":"Candlewood!J29","v":0},{"$f":"Candlewood!K29","v":0},{"$f":"Lillinonah!D29","v":"X"},{"$f":"Lillinonah!J29","v":0},{"$f":"Lillinonah!K29","v":0},{"$f":"AE36","v":"X"},{"$f":"'CT River'!J29","v":0},{"$f":"'CT River'!K29","v":0},{"$f":"'CT River'!D26","v":"X"},{"$f":"'West Hill'!J26","v":0},{"$f":"'West Hill'!K26","v":0},{"$f":"Moodus!D26","v":"X"},{"$f":"Moodus!J26","v":0},{"$f":"Moodus!K26","v":0}]
[{"$f":"Bantam!D28","v":"X"},{"$f":"Bantam!J28","v":0},{"$f":"Bantam!K28","v":0},{"$f":"McDonough!D27","v":"X"},{"$f":"McDonough!J27","v":0},{"$f":"McDonough!K27","v":0},{"$f":"Quaddick!D27","v":"X"},{"$f":"Quaddick!J27","v":0},{"$f":"Quaddick!K27","v":0},{"$f":"Candlewood!D14","v":"Oz"},{"$f":"Candlewood!J14","v":3.28},{"$f":"Candlewood!K14","v":"LMB "},{"$f":"Lillinonah!D22","v":"Steve S"},{"$f":"Lillinonah!J22","v":2.85},{"$f":"Lillinonah!K22","v":"LMB "},{"$f":"P37","v":"X"},{"$f":"'CT River'!J21","v":2.0499999999999998},{"$f":"'CT River'!K21","v":"LMB"},{"$f":"'CT River'!D27","v":"X"},{"$f":"'West Hill'!J27","v":0},{"$f":"'West Hill'!K27","v":0},{"$f":"Moodus!D27","v":"X"},{"$f":"Moodus!J27","v":0},{"$f":"Moodus!K27","v":0}]
[{"$f":"Bantam!D29","v":"X"},{"$f":"Bantam!J29","v":0},{"$f":"Bantam!K29","v":0},{"$f":"McDonough!D28","v":"X"},{"$f":"McDonough!J28","v":0},{"$f":"McDonough!K28","v":0},{"$f":"Quaddick!D28","v":"X"},{"$f":"Quaddick!J28","v":0},{"$f":"Quaddick!K28","v":0},{"$f":"Candlewood!D18","v":"Rich T"},{"$f":"Candlewood!J18","v":3.3},{"$f":"Candlewood!K18","v":"LMB"},{"$f":"Lillinonah!D16","v":"Rich B"},{"$f":"Lillinonah!J16","v":3.09},{"$f":"Lillinonah!K16","v":"lmb"},{"$f":"P38","v":"X"},{"$f":"'CT River'!J19","v":2.2999999999999998},{"$f":"'CT River'!K19","v":"LMB"},{"$f":"'CT River'!D28","v":"X"},{"$f":"'West Hill'!J28","v":0},{"$f":"'West Hill'!K28","v":0},{"$f":"Moodus!D28","v":"X"},{"$f":"Moodus!J28","v":0},{"$f":"Moodus!K28","v":0}]
[{"$f":"Bantam!D9","v":"Jim B"},{"$f":"Bantam!J9","v":3.7},{"$f":"Bantam!K9","v":"LMB"},{"$f":"McDonough!D29","v":"X"},{"$f":"McDonough!J29","v":0},{"$f":"McDonough!K29","v":0},{"$f":"Quaddick!D29","v":"X"},{"$f":"Quaddick!J29","v":0},{"$f":"Quaddick!K29","v":0},{"$f":"Candlewood!D19","v":"Ryan"},{"$f":"Candlewood!J19","v":3.37},{"$f":"Candlewood!K19","v":"LMB "},{"$f":"Lillinonah!D11","v":"Kevin"},{"$f":"Lillinonah!J11","v":3.22},{"$f":"Lillinonah!K11","v":"smb"},{"$f":"P39","v":"X"},{"$f":"'CT River'!J6","v":2.3199999999999998},{"$f":"'CT River'!K6","v":"LMB"},{"$f":"'CT River'!D29","v":"X"},{"$f":"'West Hill'!J29","v":0},{"$f":"'West Hill'!K29","v":0},{"$f":"Moodus!D29","v":"X"},{"$f":"Moodus!J29","v":0},{"$f":"Moodus!K29","v":0}]
[{"$f":"Bantam!D5","v":"Armand"},{"$f":"Bantam!J5","v":4.05},{"$f":"Bantam!K5","v":"SMB"},{"$f":"McDonough!D19","v":"Ryan"},{"$f":"McDonough!J19","v":3.97},{"$f":"McDonough!K19","v":"LMB"},{"$f":"Quaddick!D23","v":"Tom"},{"$f":"Quaddick!J23","v":5.36},{"$f":"Quaddick!K23","v":"lmb"},{"$f":"Candlewood!D6","v":"Dean"},{"$f":"Candlewood!J6","v":3.91},{"$f":"Candlewood!K6","v":"LMB "},{"$f":"Lillinonah!D6","v":"Dean"},{"$f":"Lillinonah!J6","v":3.94},{"$f":"Lillinonah!K6","v":"LMB"},{"$f":"P40","v":"X"},{"$f":"'CT River'!J7","v":3.58},{"$f":"'CT River'!K7","v":"LMB"},{"$f":"'CT River'!D5","v":"Armand"},{"$f":"'West Hill'!J5","v":3.21},{"$f":"'West Hill'!K5","v":"LMB"},{"$f":"Moodus!D20","v":"Scott"},{"$f":"Moodus!J20","v":6.84},{"$f":"Moodus!K20","v":"LMB"}]
[{"$f":"A102","v":"Armand"},{"$f":"B102","v":4.05},{"$f":"C102","v":"SMB"},{"$f":"D102","v":"Ryan"},3.97,{"$f":"F102","v":"LMB"},{"$f":"G102","v":"Tom"},{"$f":"H102","v":5.36},{"$f":"I102","v":"lmb"},"Dean",3.91,"LMB ","Dean",3.94,"LMB","X",3.58,"LMB","Armand",3.21,"LMB","Scott",6.84,"LMB"]

{"sheet":"Sheet1","index":11,"n_rows":20,"n_cols":4,"rows_kept":20,"cut":false,"hidden":false,"merged":[]}
["Name","Weight","Name","Weight"]
["Anthony",null,"Anthony"]
["Armand",null,"Armand"]
["Dean",null,"Dean"]
["Jack",null,"Jack"]
["Jason",null,"Jason"]
["Jim B",null,"Jim B"]
["Kam",null,"Kam"]
["Kevin",null,"Kevin"]
["Mike G",null,"Mike G"]
["Morrie",null,"Morrie"]
["Oz",null,"Oz"]
["Pete",null,"Pete"]
["Rich B",null,"Rich B"]
["Rich T",null,"Rich T"]
["Ryan",null,"Ryan"]
["Scott",null,"Scott"]
["Steve D",null,"Steve D"]
["Steve S",null,"Steve S"]
["Tom",null,"Tom"]

{"sheet":"Sheet2","index":12,"n_rows":0,"n_cols":0,"rows_kept":0,"cut":false,"hidden":false,"merged":[]}